Show logfile Show outfile
Automated smoke report for branch blead 5.37.4 patch 6a011f13d7690dbe2e03ad7500756c983bcb1834 v5.37.2-477-g6a011f13d7
winbonne10: AMD Ryzen 7 5700G with Radeon Graphics (~3793 MHz) (amd64/2 cpus)
    on        MSWin32 Win10 Build 19044 (64-bit)
    using     gcc version 8.3.0 (*1)
    smoketime 10 hours 13 minutes (average 1 hour 1 minute)

Summary: FAIL(F)

O = OK  F = Failure(s), extended report at the bottom
X = Failure(s) under TEST but not under harness
? = still running or test results not (yet) available
Build failures during:       - = unknown or N/A
c = Configure, m = make, M = make (after miniperl), t = make test-prep

v5.37.2-477-g6a011f13d7
---------------------- ----------------------------------------------------
F  F                    -DCCTYPE=GCC -DCCHOME=C:\Strawberry\c -Duselargefiles -Uuseithreads (*1)
F  F                    -DCCTYPE=GCC -DCCHOME=C:\Strawberry\c -Duselargefiles (*1)
F  F                    -DCCTYPE=GCC -DCCHOME=C:\Strawberry\c -Duselargefiles -Duselongdouble (*1)
F  F                    -DCCTYPE=GCC -DCCHOME=C:\Strawberry\c -Duselargefiles -Dusequadmath (*1)
F  F                    -DCCTYPE=GCC -DCCHOME=C:\Strawberry\c -Duselargefiles -UWIN64 -Duse64bitint (*1)
|  |
|  +------------------  stdio DEBUGGING
+---------------------  stdio

Applied patches:
  SMOKE6a011f13d7690dbe2e03ad7500756c983bcb1834

Skipped tests:
  None

Test failures:
~~ ../t/porting/pod_rules.t .................................... FAILED 2-5 Bad plan.  You planned 7 tests but ran 5.
  [stdio] -DCCTYPE=GCC -DCCHOME=C:\Strawberry\c -Duselargefiles DEBUGGING
  [stdio] -DCCTYPE=GCC -DCCHOME=C:\Strawberry\c -Duselargefiles -Uuseithreads
  [stdio] -DCCTYPE=GCC -DCCHOME=C:\Strawberry\c -Duselargefiles -Dusequadmath DEBUGGING
  [stdio] -DCCTYPE=GCC -DCCHOME=C:\Strawberry\c -Duselargefiles -UWIN64 -Duse64bitint
  [stdio] -DCCTYPE=GCC -DCCHOME=C:\Strawberry\c -Duselargefiles -Dusequadmath
  [stdio] -DCCTYPE=GCC -DCCHOME=C:\Strawberry\c -Duselargefiles
  [stdio] -DCCTYPE=GCC -DCCHOME=C:\Strawberry\c -Duselargefiles -Duselongdouble
  [stdio] -DCCTYPE=GCC -DCCHOME=C:\Strawberry\c -Duselargefiles -UWIN64 -Duse64bitint DEBUGGING
  [stdio] -DCCTYPE=GCC -DCCHOME=C:\Strawberry\c -Duselargefiles -Duselongdouble DEBUGGING
~~ ../t/run/exit.t ............................................. FAILED Non-zero exit status: 255 Bad plan.  You planned 17 tests but ran 0.
  [stdio] -DCCTYPE=GCC -DCCHOME=C:\Strawberry\c -Duselargefiles -Uuseithreads DEBUGGING
~~ ../cpan/CPAN-Meta-YAML/t/32_world_tml.t ..................... FAILED Non-zero exit status: 2 No plan found in TAP output
  [stdio] -DCCTYPE=GCC -DCCHOME=C:\Strawberry\c -Duselargefiles -UWIN64 -Duse64bitint
  [stdio] -DCCTYPE=GCC -DCCHOME=C:\Strawberry\c -Duselargefiles -Dusequadmath
  [stdio] -DCCTYPE=GCC -DCCHOME=C:\Strawberry\c -Duselargefiles -Dusequadmath DEBUGGING
  [stdio] -DCCTYPE=GCC -DCCHOME=C:\Strawberry\c -Duselargefiles
  [stdio] -DCCTYPE=GCC -DCCHOME=C:\Strawberry\c -Duselargefiles DEBUGGING
  [stdio] -DCCTYPE=GCC -DCCHOME=C:\Strawberry\c -Duselargefiles -Uuseithreads
  [stdio] -DCCTYPE=GCC -DCCHOME=C:\Strawberry\c -Duselargefiles -Duselongdouble
  [stdio] -DCCTYPE=GCC -DCCHOME=C:\Strawberry\c -Duselargefiles -UWIN64 -Duse64bitint DEBUGGING
  [stdio] -DCCTYPE=GCC -DCCHOME=C:\Strawberry\c -Duselargefiles -Duselongdouble DEBUGGING
~~ ../t/porting/authors.t ...................................... FAILED 7
  [stdio] -DCCTYPE=GCC -DCCHOME=C:\Strawberry\c -Duselargefiles DEBUGGING
  [stdio] -DCCTYPE=GCC -DCCHOME=C:\Strawberry\c -Duselargefiles -Uuseithreads
  [stdio] -DCCTYPE=GCC -DCCHOME=C:\Strawberry\c -Duselargefiles -Dusequadmath DEBUGGING
  [stdio] -DCCTYPE=GCC -DCCHOME=C:\Strawberry\c -Duselargefiles -UWIN64 -Duse64bitint
  [stdio] -DCCTYPE=GCC -DCCHOME=C:\Strawberry\c -Duselargefiles -Dusequadmath
  [stdio] -DCCTYPE=GCC -DCCHOME=C:\Strawberry\c -Duselargefiles
  [stdio] -DCCTYPE=GCC -DCCHOME=C:\Strawberry\c -Duselargefiles -UWIN64 -Duse64bitint DEBUGGING
  [stdio] -DCCTYPE=GCC -DCCHOME=C:\Strawberry\c -Duselargefiles -Duselongdouble
  [stdio] -DCCTYPE=GCC -DCCHOME=C:\Strawberry\c -Duselargefiles -Duselongdouble DEBUGGING
~~ ../t/win32/popen.t .......................................... FAILED Non-zero exit status: 9 No plan found in TAP output
  [stdio] -DCCTYPE=GCC -DCCHOME=C:\Strawberry\c -Duselargefiles -Duselongdouble DEBUGGING
  [stdio] -DCCTYPE=GCC -DCCHOME=C:\Strawberry\c -Duselargefiles -UWIN64 -Duse64bitint DEBUGGING
  [stdio] -DCCTYPE=GCC -DCCHOME=C:\Strawberry\c -Duselargefiles -Duselongdouble
  [stdio] -DCCTYPE=GCC -DCCHOME=C:\Strawberry\c -Duselargefiles DEBUGGING
  [stdio] -DCCTYPE=GCC -DCCHOME=C:\Strawberry\c -Duselargefiles -Dusequadmath
  [stdio] -DCCTYPE=GCC -DCCHOME=C:\Strawberry\c -Duselargefiles -UWIN64 -Duse64bitint
  [stdio] -DCCTYPE=GCC -DCCHOME=C:\Strawberry\c -Duselargefiles -Dusequadmath DEBUGGING
  [stdio] -DCCTYPE=GCC -DCCHOME=C:\Strawberry\c -Duselargefiles
~~ ../t/porting/customized.t ................................... FAILED 1-37
  [stdio] -DCCTYPE=GCC -DCCHOME=C:\Strawberry\c -Duselargefiles -Duselongdouble
  [stdio] -DCCTYPE=GCC -DCCHOME=C:\Strawberry\c -Duselargefiles -UWIN64 -Duse64bitint DEBUGGING
  [stdio] -DCCTYPE=GCC -DCCHOME=C:\Strawberry\c -Duselargefiles -Duselongdouble DEBUGGING
  [stdio] -DCCTYPE=GCC -DCCHOME=C:\Strawberry\c -Duselargefiles -Uuseithreads
  [stdio] -DCCTYPE=GCC -DCCHOME=C:\Strawberry\c -Duselargefiles DEBUGGING
  [stdio] -DCCTYPE=GCC -DCCHOME=C:\Strawberry\c -Duselargefiles
  [stdio] -DCCTYPE=GCC -DCCHOME=C:\Strawberry\c -Duselargefiles -Dusequadmath DEBUGGING
  [stdio] -DCCTYPE=GCC -DCCHOME=C:\Strawberry\c -Duselargefiles -UWIN64 -Duse64bitint
  [stdio] -DCCTYPE=GCC -DCCHOME=C:\Strawberry\c -Duselargefiles -Dusequadmath
~~ ../cpan/CPAN-Meta-YAML/t/30_yaml_spec_tml.t ................. FAILED Non-zero exit status: 2 No plan found in TAP output
  [stdio] -DCCTYPE=GCC -DCCHOME=C:\Strawberry\c -Duselargefiles -Duselongdouble DEBUGGING
  [stdio] -DCCTYPE=GCC -DCCHOME=C:\Strawberry\c -Duselargefiles -Duselongdouble
  [stdio] -DCCTYPE=GCC -DCCHOME=C:\Strawberry\c -Duselargefiles -UWIN64 -Duse64bitint DEBUGGING
  [stdio] -DCCTYPE=GCC -DCCHOME=C:\Strawberry\c -Duselargefiles -Dusequadmath
  [stdio] -DCCTYPE=GCC -DCCHOME=C:\Strawberry\c -Duselargefiles -UWIN64 -Duse64bitint
  [stdio] -DCCTYPE=GCC -DCCHOME=C:\Strawberry\c -Duselargefiles -Dusequadmath DEBUGGING
  [stdio] -DCCTYPE=GCC -DCCHOME=C:\Strawberry\c -Duselargefiles
  [stdio] -DCCTYPE=GCC -DCCHOME=C:\Strawberry\c -Duselargefiles DEBUGGING
  [stdio] -DCCTYPE=GCC -DCCHOME=C:\Strawberry\c -Duselargefiles -Uuseithreads
~~ ../cpan/CPAN-Meta-YAML/t/31_local_tml.t ..................... FAILED Non-zero exit status: 2 No plan found in TAP output
  [stdio] -DCCTYPE=GCC -DCCHOME=C:\Strawberry\c -Duselargefiles -Uuseithreads
  [stdio] -DCCTYPE=GCC -DCCHOME=C:\Strawberry\c -Duselargefiles DEBUGGING
  [stdio] -DCCTYPE=GCC -DCCHOME=C:\Strawberry\c -Duselargefiles
  [stdio] -DCCTYPE=GCC -DCCHOME=C:\Strawberry\c -Duselargefiles -UWIN64 -Duse64bitint
  [stdio] -DCCTYPE=GCC -DCCHOME=C:\Strawberry\c -Duselargefiles -Dusequadmath
  [stdio] -DCCTYPE=GCC -DCCHOME=C:\Strawberry\c -Duselargefiles -Dusequadmath DEBUGGING
  [stdio] -DCCTYPE=GCC -DCCHOME=C:\Strawberry\c -Duselargefiles -Duselongdouble DEBUGGING
  [stdio] -DCCTYPE=GCC -DCCHOME=C:\Strawberry\c -Duselargefiles -Duselongdouble
  [stdio] -DCCTYPE=GCC -DCCHOME=C:\Strawberry\c -Duselargefiles -UWIN64 -Duse64bitint DEBUGGING
~~ ../t/porting/regen.t ........................................ FAILED 12 Non-zero exit status: 255 Bad plan.  You planned 42 tests but ran 12.
  [stdio] -DCCTYPE=GCC -DCCHOME=C:\Strawberry\c -Duselargefiles -Uuseithreads
  [stdio] -DCCTYPE=GCC -DCCHOME=C:\Strawberry\c -Duselargefiles DEBUGGING
  [stdio] -DCCTYPE=GCC -DCCHOME=C:\Strawberry\c -Duselargefiles
  [stdio] -DCCTYPE=GCC -DCCHOME=C:\Strawberry\c -Duselargefiles -Dusequadmath DEBUGGING
  [stdio] -DCCTYPE=GCC -DCCHOME=C:\Strawberry\c -Duselargefiles -UWIN64 -Duse64bitint
  [stdio] -DCCTYPE=GCC -DCCHOME=C:\Strawberry\c -Duselargefiles -Dusequadmath
  [stdio] -DCCTYPE=GCC -DCCHOME=C:\Strawberry\c -Duselargefiles -Duselongdouble
  [stdio] -DCCTYPE=GCC -DCCHOME=C:\Strawberry\c -Duselargefiles -UWIN64 -Duse64bitint DEBUGGING
  [stdio] -DCCTYPE=GCC -DCCHOME=C:\Strawberry\c -Duselargefiles -Duselongdouble DEBUGGING

Test todo-passed:
~~ ../ext/IPC-Open3/t/IPC-Open3.t .............................. PASSED 25
  [stdio] -DCCTYPE=GCC -DCCHOME=C:\Strawberry\c -Duselargefiles -UWIN64 -Duse64bitint
  [stdio] -DCCTYPE=GCC -DCCHOME=C:\Strawberry\c -Duselargefiles -Dusequadmath DEBUGGING
  [stdio] -DCCTYPE=GCC -DCCHOME=C:\Strawberry\c -Duselargefiles -Dusequadmath
  [stdio] -DCCTYPE=GCC -DCCHOME=C:\Strawberry\c -Duselargefiles
  [stdio] -DCCTYPE=GCC -DCCHOME=C:\Strawberry\c -Duselargefiles DEBUGGING
  [stdio] -DCCTYPE=GCC -DCCHOME=C:\Strawberry\c -Duselargefiles -Uuseithreads
  [stdio] -DCCTYPE=GCC -DCCHOME=C:\Strawberry\c -Duselargefiles -Duselongdouble DEBUGGING
  [stdio] -DCCTYPE=GCC -DCCHOME=C:\Strawberry\c -Duselargefiles -Duselongdouble
  [stdio] -DCCTYPE=GCC -DCCHOME=C:\Strawberry\c -Duselargefiles -UWIN64 -Duse64bitint DEBUGGING
~~ ../t/win32/stat.t ........................................... PASSED 41
  [stdio] -DCCTYPE=GCC -DCCHOME=C:\Strawberry\c -Duselargefiles -Uuseithreads
~~ ../dist/Net-Ping/t/450_service.t ............................ PASSED 9
  [stdio] -DCCTYPE=GCC -DCCHOME=C:\Strawberry\c -Duselargefiles -Uuseithreads

MANIFEST messages:

Compiler messages:

About this smoke:
    smoking-perl: 5.32.1
  smoker-version: 1.79_06/0.046
       timestamp: 2022-09-08T21:03:08
          tester: abeltje

For these MSWin32 builds -Duseithreads is always on (except for -Uuseithreads)
-- 
Report generated by Test::Smoke::Gateway v0.12