Show logfile
Automated smoke report for branch blead 5.37.3 patch c52f54c8521c6155984dba0a0675d3220170468b v5.37.2-147-gc52f54c852
cjg-alpine3: Intel(R) Xeon(R) CPU E5-2620 v2 @ 2.10GHz (GenuineIntel 2100MHz) (x86_64/1 cpus)
    on        linux 5.15.59-0-lts [Alpine Linux v3.15 3.15.6]
    using     g++ version 10.3.1 20211027 (*1)
    smoketime 7 hours 57 minutes (average 39 minutes 48 seconds)

Summary: FAIL(F)

O = OK  F = Failure(s), extended report at the bottom
X = Failure(s) under TEST but not under harness
? = still running or test results not (yet) available
Build failures during:       - = unknown or N/A
c = Configure, m = make, M = make (after miniperl), t = make test-prep

v5.37.2-147-gc52f54c852
---------------------- ----------------------------------------------------
O  O                    -Dcc=g++ (*1)
O  O                    -Dcc=g++ -Duse64bitall (*1)
O  O                    -Dcc=g++ -Duselongdouble (*1)
F  F                    -Dcc=g++ -Duseithreads (*1)
F  F                    -Dcc=g++ -Duseithreads -Duse64bitall (*1)
F  F                    -Dcc=g++ -Duseithreads -Duselongdouble (*1)
|  |
|  +------------------  stdio DEBUGGING
+---------------------  stdio

Applied patches:

Skipped tests:
      # One test name on a line

Test failures:
~~ ../dist/threads/t/kill2.t ................................... FAILED Non-zero exit status: 29 No plan found in TAP output
  [stdio] -Dcc=g++ -Duseithreads -Duselongdouble
  [stdio] -Dcc=g++ -Duseithreads -Duse64bitall
  [stdio] -Dcc=g++ -Duseithreads
  [stdio] -Dcc=g++ -Duseithreads -Duse64bitall DEBUGGING
  [stdio] -Dcc=g++ -Duseithreads DEBUGGING
  [stdio] -Dcc=g++ -Duseithreads -Duselongdouble DEBUGGING
~~ ../lib/Thread.t ............................................. FAILED Non-zero exit status: 29 No plan found in TAP output
  [stdio] -Dcc=g++ -Duseithreads DEBUGGING
  [stdio] -Dcc=g++ -Duseithreads -Duselongdouble DEBUGGING
  [stdio] -Dcc=g++ -Duseithreads -Duse64bitall DEBUGGING
  [stdio] -Dcc=g++ -Duseithreads
  [stdio] -Dcc=g++ -Duseithreads -Duselongdouble
  [stdio] -Dcc=g++ -Duseithreads -Duse64bitall
~~ ../dist/threads-shared/t/wait.t ............................. FAILED Non-zero exit status: 29 Bad plan.  You planned 91 tests but ran 0.
  [stdio] -Dcc=g++ -Duseithreads -Duse64bitall
  [stdio] -Dcc=g++ -Duseithreads -Duselongdouble
  [stdio] -Dcc=g++ -Duseithreads
  [stdio] -Dcc=g++ -Duseithreads -Duse64bitall DEBUGGING
  [stdio] -Dcc=g++ -Duseithreads -Duselongdouble DEBUGGING
  [stdio] -Dcc=g++ -Duseithreads DEBUGGING
~~ ../dist/Thread-Queue/t/11_limit.t ........................... FAILED Non-zero exit status: 29 No plan found in TAP output
  [stdio] -Dcc=g++ -Duseithreads
  [stdio] -Dcc=g++ -Duseithreads -Duse64bitall
  [stdio] -Dcc=g++ -Duseithreads -Duselongdouble
  [stdio] -Dcc=g++ -Duseithreads -Duselongdouble DEBUGGING
  [stdio] -Dcc=g++ -Duseithreads DEBUGGING
  [stdio] -Dcc=g++ -Duseithreads -Duse64bitall DEBUGGING
~~ ../dist/threads/t/kill.t .................................... FAILED Non-zero exit status: 29 No plan found in TAP output
  [stdio] -Dcc=g++ -Duseithreads
  [stdio] -Dcc=g++ -Duseithreads -Duse64bitall
  [stdio] -Dcc=g++ -Duseithreads -Duselongdouble
  [stdio] -Dcc=g++ -Duseithreads -Duselongdouble DEBUGGING
  [stdio] -Dcc=g++ -Duseithreads DEBUGGING
  [stdio] -Dcc=g++ -Duseithreads -Duse64bitall DEBUGGING
~~ ../t/uni/fold.t ............................................. FAILED 18676-18677
  [stdio] -Dcc=g++ -Duseithreads
  [stdio] -Dcc=g++ -Duseithreads -Duse64bitall
  [stdio] -Dcc=g++ -Duseithreads -Duselongdouble
  [stdio] -Dcc=g++ -Duseithreads -Duselongdouble DEBUGGING
  [stdio] -Dcc=g++ -Duseithreads DEBUGGING
  [stdio] -Dcc=g++ -Duseithreads -Duse64bitall DEBUGGING
~~ ../dist/threads-shared/t/clone.t ............................ FAILED Non-zero exit status: 29 Bad plan.  You planned 40 tests but ran 0.
  [stdio] -Dcc=g++ -Duseithreads -Duse64bitall DEBUGGING
  [stdio] -Dcc=g++ -Duseithreads DEBUGGING
  [stdio] -Dcc=g++ -Duseithreads -Duselongdouble DEBUGGING
  [stdio] -Dcc=g++ -Duseithreads -Duselongdouble
  [stdio] -Dcc=g++ -Duseithreads -Duse64bitall
  [stdio] -Dcc=g++ -Duseithreads
~~ ../dist/threads/t/problems.t ................................ FAILED Non-zero exit status: 29 No plan found in TAP output
  [stdio] -Dcc=g++ -Duseithreads -Duselongdouble
  [stdio] -Dcc=g++ -Duseithreads -Duse64bitall
  [stdio] -Dcc=g++ -Duseithreads
  [stdio] -Dcc=g++ -Duseithreads -Duse64bitall DEBUGGING
  [stdio] -Dcc=g++ -Duseithreads DEBUGGING
  [stdio] -Dcc=g++ -Duseithreads -Duselongdouble DEBUGGING
~~ ../t/op/getpid.t ............................................ FAILED Non-zero exit status: 29 No plan found in TAP output
  [stdio] -Dcc=g++ -Duseithreads -Duselongdouble DEBUGGING
  [stdio] -Dcc=g++ -Duseithreads DEBUGGING
  [stdio] -Dcc=g++ -Duseithreads -Duse64bitall DEBUGGING
  [stdio] -Dcc=g++ -Duseithreads
  [stdio] -Dcc=g++ -Duseithreads -Duse64bitall
  [stdio] -Dcc=g++ -Duseithreads -Duselongdouble
~~ ../cpan/Scalar-List-Utils/t/dualvar.t ....................... FAILED Non-zero exit status: 29 Bad plan.  You planned 41 tests but ran 0.
  [stdio] -Dcc=g++ -Duseithreads -Duse64bitall DEBUGGING
  [stdio] -Dcc=g++ -Duseithreads DEBUGGING
  [stdio] -Dcc=g++ -Duseithreads -Duselongdouble DEBUGGING
  [stdio] -Dcc=g++ -Duseithreads -Duselongdouble
  [stdio] -Dcc=g++ -Duseithreads -Duse64bitall
  [stdio] -Dcc=g++ -Duseithreads
~~ ../dist/Thread-Semaphore/t/05_force.t ....................... FAILED Non-zero exit status: 29 No plan found in TAP output
  [stdio] -Dcc=g++ -Duseithreads -Duse64bitall DEBUGGING
  [stdio] -Dcc=g++ -Duseithreads DEBUGGING
  [stdio] -Dcc=g++ -Duseithreads -Duselongdouble DEBUGGING
  [stdio] -Dcc=g++ -Duseithreads -Duselongdouble
  [stdio] -Dcc=g++ -Duseithreads -Duse64bitall
  [stdio] -Dcc=g++ -Duseithreads
~~ ../t/re/subst.t ............................................. FAILED 263
  [stdio] -Dcc=g++ -Duseithreads DEBUGGING
  [stdio] -Dcc=g++ -Duseithreads -Duselongdouble DEBUGGING
  [stdio] -Dcc=g++ -Duseithreads -Duse64bitall DEBUGGING
  [stdio] -Dcc=g++ -Duseithreads
  [stdio] -Dcc=g++ -Duseithreads -Duselongdouble
  [stdio] -Dcc=g++ -Duseithreads -Duse64bitall
~~ ../dist/threads-shared/t/utf8.t ............................. FAILED Non-zero exit status: 29 Bad plan.  You planned 12 tests but ran 0.
  [stdio] -Dcc=g++ -Duseithreads -Duselongdouble
  [stdio] -Dcc=g++ -Duseithreads -Duse64bitall
  [stdio] -Dcc=g++ -Duseithreads
  [stdio] -Dcc=g++ -Duseithreads -Duse64bitall DEBUGGING
  [stdio] -Dcc=g++ -Duseithreads DEBUGGING
  [stdio] -Dcc=g++ -Duseithreads -Duselongdouble DEBUGGING
~~ ../dist/Thread-Queue/t/05_extract.t ......................... FAILED Non-zero exit status: 29 No plan found in TAP output
  [stdio] -Dcc=g++ -Duseithreads
  [stdio] -Dcc=g++ -Duseithreads -Duselongdouble
  [stdio] -Dcc=g++ -Duseithreads -Duse64bitall
  [stdio] -Dcc=g++ -Duseithreads DEBUGGING
  [stdio] -Dcc=g++ -Duseithreads -Duselongdouble DEBUGGING
  [stdio] -Dcc=g++ -Duseithreads -Duse64bitall DEBUGGING
~~ ../dist/threads-shared/t/dualvar.t .......................... FAILED Non-zero exit status: 29 Bad plan.  You planned 226 tests but ran 0.
  [stdio] -Dcc=g++ -Duseithreads
  [stdio] -Dcc=g++ -Duseithreads -Duse64bitall
  [stdio] -Dcc=g++ -Duseithreads -Duselongdouble
  [stdio] -Dcc=g++ -Duseithreads -Duselongdouble DEBUGGING
  [stdio] -Dcc=g++ -Duseithreads DEBUGGING
  [stdio] -Dcc=g++ -Duseithreads -Duse64bitall DEBUGGING
~~ ../dist/threads-shared/t/blessed.t .......................... FAILED Non-zero exit status: 29 Bad plan.  You planned 37 tests but ran 0.
  [stdio] -Dcc=g++ -Duseithreads
  [stdio] -Dcc=g++ -Duseithreads -Duselongdouble
  [stdio] -Dcc=g++ -Duseithreads -Duse64bitall
  [stdio] -Dcc=g++ -Duseithreads DEBUGGING
  [stdio] -Dcc=g++ -Duseithreads -Duselongdouble DEBUGGING
  [stdio] -Dcc=g++ -Duseithreads -Duse64bitall DEBUGGING
~~ ../dist/threads-shared/t/av_refs.t .......................... FAILED Non-zero exit status: 29 Bad plan.  You planned 14 tests but ran 0.
  [stdio] -Dcc=g++ -Duseithreads
  [stdio] -Dcc=g++ -Duseithreads -Duse64bitall
  [stdio] -Dcc=g++ -Duseithreads -Duselongdouble
  [stdio] -Dcc=g++ -Duseithreads -Duselongdouble DEBUGGING
  [stdio] -Dcc=g++ -Duseithreads DEBUGGING
  [stdio] -Dcc=g++ -Duseithreads -Duse64bitall DEBUGGING
~~ ../dist/threads-shared/t/object2.t .......................... FAILED Non-zero exit status: 29 Bad plan.  You planned 133 tests but ran 0.
  [stdio] -Dcc=g++ -Duseithreads DEBUGGING
  [stdio] -Dcc=g++ -Duseithreads -Duselongdouble DEBUGGING
  [stdio] -Dcc=g++ -Duseithreads -Duse64bitall DEBUGGING
  [stdio] -Dcc=g++ -Duseithreads
  [stdio] -Dcc=g++ -Duseithreads -Duselongdouble
  [stdio] -Dcc=g++ -Duseithreads -Duse64bitall
~~ ../dist/Thread-Queue/t/07_lock.t ............................ FAILED Non-zero exit status: 29 No plan found in TAP output
  [stdio] -Dcc=g++ -Duseithreads DEBUGGING
  [stdio] -Dcc=g++ -Duseithreads -Duselongdouble DEBUGGING
  [stdio] -Dcc=g++ -Duseithreads -Duse64bitall DEBUGGING
  [stdio] -Dcc=g++ -Duseithreads
  [stdio] -Dcc=g++ -Duseithreads -Duselongdouble
  [stdio] -Dcc=g++ -Duseithreads -Duse64bitall
~~ ../t/re/subst_wamp.t ........................................ FAILED 263
  [stdio] -Dcc=g++ -Duseithreads DEBUGGING
  [stdio] -Dcc=g++ -Duseithreads -Duselongdouble DEBUGGING
  [stdio] -Dcc=g++ -Duseithreads -Duse64bitall DEBUGGING
  [stdio] -Dcc=g++ -Duseithreads
  [stdio] -Dcc=g++ -Duseithreads -Duselongdouble
  [stdio] -Dcc=g++ -Duseithreads -Duse64bitall
~~ ../dist/threads/t/exit.t .................................... FAILED Non-zero exit status: 29 No plan found in TAP output
  [stdio] -Dcc=g++ -Duseithreads -Duse64bitall
  [stdio] -Dcc=g++ -Duseithreads -Duselongdouble
  [stdio] -Dcc=g++ -Duseithreads
  [stdio] -Dcc=g++ -Duseithreads -Duse64bitall DEBUGGING
  [stdio] -Dcc=g++ -Duseithreads -Duselongdouble DEBUGGING
  [stdio] -Dcc=g++ -Duseithreads DEBUGGING
~~ ../dist/threads-shared/t/hv_refs.t .......................... FAILED Non-zero exit status: 29 Bad plan.  You planned 20 tests but ran 0.
  [stdio] -Dcc=g++ -Duseithreads
  [stdio] -Dcc=g++ -Duseithreads -Duse64bitall
  [stdio] -Dcc=g++ -Duseithreads -Duselongdouble
  [stdio] -Dcc=g++ -Duseithreads -Duselongdouble DEBUGGING
  [stdio] -Dcc=g++ -Duseithreads DEBUGGING
  [stdio] -Dcc=g++ -Duseithreads -Duse64bitall DEBUGGING
~~ ../dist/Thread-Queue/t/03_peek.t ............................ FAILED Non-zero exit status: 29 No plan found in TAP output
  [stdio] -Dcc=g++ -Duseithreads -Duselongdouble DEBUGGING
  [stdio] -Dcc=g++ -Duseithreads DEBUGGING
  [stdio] -Dcc=g++ -Duseithreads -Duse64bitall DEBUGGING
  [stdio] -Dcc=g++ -Duseithreads
  [stdio] -Dcc=g++ -Duseithreads -Duse64bitall
  [stdio] -Dcc=g++ -Duseithreads -Duselongdouble
~~ ../dist/Thread-Queue/t/09_ended.t ........................... FAILED Non-zero exit status: 29 No plan found in TAP output
  [stdio] -Dcc=g++ -Duseithreads -Duse64bitall DEBUGGING
  [stdio] -Dcc=g++ -Duseithreads -Duselongdouble DEBUGGING
  [stdio] -Dcc=g++ -Duseithreads DEBUGGING
  [stdio] -Dcc=g++ -Duseithreads -Duse64bitall
  [stdio] -Dcc=g++ -Duseithreads -Duselongdouble
  [stdio] -Dcc=g++ -Duseithreads
~~ ../t/re/substT.t ............................................ FAILED 263
  [stdio] -Dcc=g++ -Duseithreads -Duselongdouble
  [stdio] -Dcc=g++ -Duseithreads -Duse64bitall
  [stdio] -Dcc=g++ -Duseithreads
  [stdio] -Dcc=g++ -Duseithreads -Duse64bitall DEBUGGING
  [stdio] -Dcc=g++ -Duseithreads DEBUGGING
  [stdio] -Dcc=g++ -Duseithreads -Duselongdouble DEBUGGING
~~ ../dist/Thread-Queue/t/06_insert.t .......................... FAILED Non-zero exit status: 29 No plan found in TAP output
  [stdio] -Dcc=g++ -Duseithreads
  [stdio] -Dcc=g++ -Duseithreads -Duse64bitall
  [stdio] -Dcc=g++ -Duseithreads -Duselongdouble
  [stdio] -Dcc=g++ -Duseithreads -Duselongdouble DEBUGGING
  [stdio] -Dcc=g++ -Duseithreads DEBUGGING
  [stdio] -Dcc=g++ -Duseithreads -Duse64bitall DEBUGGING
~~ ../t/op/reset.t ............................................. FAILED 37-40
  [stdio] -Dcc=g++ -Duseithreads DEBUGGING
  [stdio] -Dcc=g++ -Duseithreads -Duselongdouble DEBUGGING
  [stdio] -Dcc=g++ -Duseithreads -Duse64bitall DEBUGGING
  [stdio] -Dcc=g++ -Duseithreads
  [stdio] -Dcc=g++ -Duseithreads -Duselongdouble
  [stdio] -Dcc=g++ -Duseithreads -Duse64bitall
~~ ../t/op/threads-dirh.t ...................................... FAILED Non-zero exit status: 29 Bad plan.  You planned 6 tests but ran 0.
  [stdio] -Dcc=g++ -Duseithreads DEBUGGING
  [stdio] -Dcc=g++ -Duseithreads -Duselongdouble DEBUGGING
  [stdio] -Dcc=g++ -Duseithreads -Duse64bitall DEBUGGING
  [stdio] -Dcc=g++ -Duseithreads
  [stdio] -Dcc=g++ -Duseithreads -Duselongdouble
  [stdio] -Dcc=g++ -Duseithreads -Duse64bitall
~~ ../dist/Thread-Queue/t/02_refs.t ............................ FAILED Non-zero exit status: 29 No plan found in TAP output
  [stdio] -Dcc=g++ -Duseithreads -Duse64bitall DEBUGGING
  [stdio] -Dcc=g++ -Duseithreads DEBUGGING
  [stdio] -Dcc=g++ -Duseithreads -Duselongdouble DEBUGGING
  [stdio] -Dcc=g++ -Duseithreads -Duselongdouble
  [stdio] -Dcc=g++ -Duseithreads -Duse64bitall
  [stdio] -Dcc=g++ -Duseithreads
~~ ../dist/threads/t/end.t ..................................... FAILED Non-zero exit status: 29 No plan found in TAP output
  [stdio] -Dcc=g++ -Duseithreads DEBUGGING
  [stdio] -Dcc=g++ -Duseithreads -Duselongdouble DEBUGGING
  [stdio] -Dcc=g++ -Duseithreads -Duse64bitall DEBUGGING
  [stdio] -Dcc=g++ -Duseithreads
  [stdio] -Dcc=g++ -Duseithreads -Duselongdouble
  [stdio] -Dcc=g++ -Duseithreads -Duse64bitall
~~ ../dist/threads-shared/t/object.t ........................... FAILED Non-zero exit status: 29 Bad plan.  You planned 28 tests but ran 0.
  [stdio] -Dcc=g++ -Duseithreads -Duselongdouble
  [stdio] -Dcc=g++ -Duseithreads -Duse64bitall
  [stdio] -Dcc=g++ -Duseithreads
  [stdio] -Dcc=g++ -Duseithreads -Duse64bitall DEBUGGING
  [stdio] -Dcc=g++ -Duseithreads DEBUGGING
  [stdio] -Dcc=g++ -Duseithreads -Duselongdouble DEBUGGING
~~ ../dist/threads-shared/t/cond.t ............................. FAILED Non-zero exit status: 29 Bad plan.  You planned 32 tests but ran 0.
  [stdio] -Dcc=g++ -Duseithreads -Duse64bitall
  [stdio] -Dcc=g++ -Duseithreads -Duselongdouble
  [stdio] -Dcc=g++ -Duseithreads
  [stdio] -Dcc=g++ -Duseithreads -Duse64bitall DEBUGGING
  [stdio] -Dcc=g++ -Duseithreads -Duselongdouble DEBUGGING
  [stdio] -Dcc=g++ -Duseithreads DEBUGGING
~~ ../dist/threads/t/kill3.t ................................... FAILED Non-zero exit status: 29 No plan found in TAP output
  [stdio] -Dcc=g++ -Duseithreads -Duse64bitall DEBUGGING
  [stdio] -Dcc=g++ -Duseithreads -Duselongdouble DEBUGGING
  [stdio] -Dcc=g++ -Duseithreads DEBUGGING
  [stdio] -Dcc=g++ -Duseithreads -Duse64bitall
  [stdio] -Dcc=g++ -Duseithreads -Duselongdouble
  [stdio] -Dcc=g++ -Duseithreads
~~ ../dist/Thread-Queue/t/01_basic.t ........................... FAILED Non-zero exit status: 29 No plan found in TAP output
  [stdio] -Dcc=g++ -Duseithreads -Duse64bitall
  [stdio] -Dcc=g++ -Duseithreads -Duselongdouble
  [stdio] -Dcc=g++ -Duseithreads
  [stdio] -Dcc=g++ -Duseithreads -Duse64bitall DEBUGGING
  [stdio] -Dcc=g++ -Duseithreads -Duselongdouble DEBUGGING
  [stdio] -Dcc=g++ -Duseithreads DEBUGGING
~~ ../dist/threads-shared/t/sv_refs.t .......................... FAILED Non-zero exit status: 29 Bad plan.  You planned 21 tests but ran 0.
  [stdio] -Dcc=g++ -Duseithreads DEBUGGING
  [stdio] -Dcc=g++ -Duseithreads -Duselongdouble DEBUGGING
  [stdio] -Dcc=g++ -Duseithreads -Duse64bitall DEBUGGING
  [stdio] -Dcc=g++ -Duseithreads
  [stdio] -Dcc=g++ -Duseithreads -Duselongdouble
  [stdio] -Dcc=g++ -Duseithreads -Duse64bitall
~~ ../dist/threads-shared/t/shared_attr.t ...................... FAILED Non-zero exit status: 29 Bad plan.  You planned 101 tests but ran 0.
  [stdio] -Dcc=g++ -Duseithreads DEBUGGING
  [stdio] -Dcc=g++ -Duseithreads -Duselongdouble DEBUGGING
  [stdio] -Dcc=g++ -Duseithreads -Duse64bitall DEBUGGING
  [stdio] -Dcc=g++ -Duseithreads
  [stdio] -Dcc=g++ -Duseithreads -Duselongdouble
  [stdio] -Dcc=g++ -Duseithreads -Duse64bitall
~~ ../dist/threads-shared/t/hv_simple.t ........................ FAILED Non-zero exit status: 29 Bad plan.  You planned 16 tests but ran 0.
  [stdio] -Dcc=g++ -Duseithreads -Duselongdouble DEBUGGING
  [stdio] -Dcc=g++ -Duseithreads DEBUGGING
  [stdio] -Dcc=g++ -Duseithreads -Duse64bitall DEBUGGING
  [stdio] -Dcc=g++ -Duseithreads
  [stdio] -Dcc=g++ -Duseithreads -Duse64bitall
  [stdio] -Dcc=g++ -Duseithreads -Duselongdouble
~~ ../dist/Thread-Semaphore/t/01_basic.t ....................... FAILED Non-zero exit status: 29 No plan found in TAP output
  [stdio] -Dcc=g++ -Duseithreads
  [stdio] -Dcc=g++ -Duseithreads -Duse64bitall
  [stdio] -Dcc=g++ -Duseithreads -Duselongdouble
  [stdio] -Dcc=g++ -Duseithreads -Duselongdouble DEBUGGING
  [stdio] -Dcc=g++ -Duseithreads DEBUGGING
  [stdio] -Dcc=g++ -Duseithreads -Duse64bitall DEBUGGING
~~ ../dist/Thread-Semaphore/t/04_nonblocking.t ................. FAILED Non-zero exit status: 29 No plan found in TAP output
  [stdio] -Dcc=g++ -Duseithreads
  [stdio] -Dcc=g++ -Duseithreads -Duse64bitall
  [stdio] -Dcc=g++ -Duseithreads -Duselongdouble
  [stdio] -Dcc=g++ -Duseithreads -Duselongdouble DEBUGGING
  [stdio] -Dcc=g++ -Duseithreads DEBUGGING
  [stdio] -Dcc=g++ -Duseithreads -Duse64bitall DEBUGGING
~~ ../dist/Thread-Semaphore/t/06_timed.t ....................... FAILED Non-zero exit status: 29 No plan found in TAP output
  [stdio] -Dcc=g++ -Duseithreads DEBUGGING
  [stdio] -Dcc=g++ -Duseithreads -Duselongdouble DEBUGGING
  [stdio] -Dcc=g++ -Duseithreads -Duse64bitall DEBUGGING
  [stdio] -Dcc=g++ -Duseithreads
  [stdio] -Dcc=g++ -Duseithreads -Duselongdouble
  [stdio] -Dcc=g++ -Duseithreads -Duse64bitall
~~ ../dist/threads-shared/t/av_simple.t ........................ FAILED Non-zero exit status: 29 Bad plan.  You planned 47 tests but ran 0.
  [stdio] -Dcc=g++ -Duseithreads -Duse64bitall
  [stdio] -Dcc=g++ -Duseithreads -Duselongdouble
  [stdio] -Dcc=g++ -Duseithreads
  [stdio] -Dcc=g++ -Duseithreads -Duse64bitall DEBUGGING
  [stdio] -Dcc=g++ -Duseithreads -Duselongdouble DEBUGGING
  [stdio] -Dcc=g++ -Duseithreads DEBUGGING
~~ ../dist/threads-shared/t/sv_simple.t ........................ FAILED Non-zero exit status: 29 Bad plan.  You planned 11 tests but ran 0.
  [stdio] -Dcc=g++ -Duseithreads DEBUGGING
  [stdio] -Dcc=g++ -Duseithreads -Duselongdouble DEBUGGING
  [stdio] -Dcc=g++ -Duseithreads -Duse64bitall DEBUGGING
  [stdio] -Dcc=g++ -Duseithreads
  [stdio] -Dcc=g++ -Duseithreads -Duselongdouble
  [stdio] -Dcc=g++ -Duseithreads -Duse64bitall
~~ ../ext/XS-APItest/t/boolean-thr.t ........................... FAILED Non-zero exit status: 29 No plan found in TAP output
  [stdio] -Dcc=g++ -Duseithreads -Duselongdouble
  [stdio] -Dcc=g++ -Duseithreads -Duse64bitall
  [stdio] -Dcc=g++ -Duseithreads
  [stdio] -Dcc=g++ -Duseithreads -Duse64bitall DEBUGGING
  [stdio] -Dcc=g++ -Duseithreads DEBUGGING
  [stdio] -Dcc=g++ -Duseithreads -Duselongdouble DEBUGGING
~~ ../t/op/threads.t ........................................... FAILED 29
  [stdio] -Dcc=g++ -Duseithreads -Duse64bitall
  [stdio] -Dcc=g++ -Duseithreads -Duselongdouble
  [stdio] -Dcc=g++ -Duseithreads
  [stdio] -Dcc=g++ -Duseithreads -Duse64bitall DEBUGGING
  [stdio] -Dcc=g++ -Duseithreads -Duselongdouble DEBUGGING
  [stdio] -Dcc=g++ -Duseithreads DEBUGGING
~~ ../dist/threads/t/state.t ................................... FAILED Non-zero exit status: 29 No plan found in TAP output
  [stdio] -Dcc=g++ -Duseithreads
  [stdio] -Dcc=g++ -Duseithreads -Duselongdouble
  [stdio] -Dcc=g++ -Duseithreads -Duse64bitall
  [stdio] -Dcc=g++ -Duseithreads DEBUGGING
  [stdio] -Dcc=g++ -Duseithreads -Duselongdouble DEBUGGING
  [stdio] -Dcc=g++ -Duseithreads -Duse64bitall DEBUGGING
~~ ../dist/threads/t/free.t .................................... FAILED Non-zero exit status: 29 No plan found in TAP output
  [stdio] -Dcc=g++ -Duseithreads -Duse64bitall DEBUGGING
  [stdio] -Dcc=g++ -Duseithreads DEBUGGING
  [stdio] -Dcc=g++ -Duseithreads -Duselongdouble DEBUGGING
  [stdio] -Dcc=g++ -Duseithreads -Duselongdouble
  [stdio] -Dcc=g++ -Duseithreads -Duse64bitall
  [stdio] -Dcc=g++ -Duseithreads
~~ ../dist/threads/t/blocks.t .................................. FAILED Non-zero exit status: 29 No plan found in TAP output
  [stdio] -Dcc=g++ -Duseithreads -Duse64bitall DEBUGGING
  [stdio] -Dcc=g++ -Duseithreads DEBUGGING
  [stdio] -Dcc=g++ -Duseithreads -Duselongdouble DEBUGGING
  [stdio] -Dcc=g++ -Duseithreads -Duselongdouble
  [stdio] -Dcc=g++ -Duseithreads -Duse64bitall
  [stdio] -Dcc=g++ -Duseithreads
~~ ../dist/threads/t/join.t .................................... FAILED Non-zero exit status: 29 No plan found in TAP output
  [stdio] -Dcc=g++ -Duseithreads -Duselongdouble DEBUGGING
  [stdio] -Dcc=g++ -Duseithreads DEBUGGING
  [stdio] -Dcc=g++ -Duseithreads -Duse64bitall DEBUGGING
  [stdio] -Dcc=g++ -Duseithreads
  [stdio] -Dcc=g++ -Duseithreads -Duse64bitall
  [stdio] -Dcc=g++ -Duseithreads -Duselongdouble
~~ ../dist/Thread-Queue/t/10_timed.t ........................... FAILED Non-zero exit status: 29 No plan found in TAP output
  [stdio] -Dcc=g++ -Duseithreads
  [stdio] -Dcc=g++ -Duseithreads -Duselongdouble
  [stdio] -Dcc=g++ -Duseithreads -Duse64bitall
  [stdio] -Dcc=g++ -Duseithreads DEBUGGING
  [stdio] -Dcc=g++ -Duseithreads -Duselongdouble DEBUGGING
  [stdio] -Dcc=g++ -Duseithreads -Duse64bitall DEBUGGING
~~ ../dist/threads-shared/t/stress.t ........................... FAILED Non-zero exit status: 29 Bad plan.  You planned 1 tests but ran 0.
  [stdio] -Dcc=g++ -Duseithreads -Duselongdouble
  [stdio] -Dcc=g++ -Duseithreads -Duse64bitall
  [stdio] -Dcc=g++ -Duseithreads
  [stdio] -Dcc=g++ -Duseithreads -Duse64bitall DEBUGGING
  [stdio] -Dcc=g++ -Duseithreads DEBUGGING
  [stdio] -Dcc=g++ -Duseithreads -Duselongdouble DEBUGGING
~~ ../dist/threads/t/free2.t ................................... FAILED Non-zero exit status: 29 No plan found in TAP output
  [stdio] -Dcc=g++ -Duseithreads -Duse64bitall DEBUGGING
  [stdio] -Dcc=g++ -Duseithreads DEBUGGING
  [stdio] -Dcc=g++ -Duseithreads -Duselongdouble DEBUGGING
  [stdio] -Dcc=g++ -Duseithreads -Duselongdouble
  [stdio] -Dcc=g++ -Duseithreads -Duse64bitall
  [stdio] -Dcc=g++ -Duseithreads
~~ ../lib/perl5db.t ............................................ FAILED 14
  [stdio] -Dcc=g++ -Duseithreads DEBUGGING
  [stdio] -Dcc=g++ -Duseithreads -Duselongdouble DEBUGGING
  [stdio] -Dcc=g++ -Duseithreads -Duse64bitall DEBUGGING
  [stdio] -Dcc=g++ -Duseithreads
  [stdio] -Dcc=g++ -Duseithreads -Duselongdouble
  [stdio] -Dcc=g++ -Duseithreads -Duse64bitall
~~ ../dist/threads/t/context.t ................................. FAILED Non-zero exit status: 29 No plan found in TAP output
  [stdio] -Dcc=g++ -Duseithreads -Duse64bitall DEBUGGING
  [stdio] -Dcc=g++ -Duseithreads -Duselongdouble DEBUGGING
  [stdio] -Dcc=g++ -Duseithreads DEBUGGING
  [stdio] -Dcc=g++ -Duseithreads -Duse64bitall
  [stdio] -Dcc=g++ -Duseithreads -Duselongdouble
  [stdio] -Dcc=g++ -Duseithreads
~~ ../dist/threads/t/thread.t .................................. FAILED Non-zero exit status: 29 No plan found in TAP output
  [stdio] -Dcc=g++ -Duseithreads -Duse64bitall DEBUGGING
  [stdio] -Dcc=g++ -Duseithreads DEBUGGING
  [stdio] -Dcc=g++ -Duseithreads -Duselongdouble DEBUGGING
  [stdio] -Dcc=g++ -Duseithreads -Duselongdouble
  [stdio] -Dcc=g++ -Duseithreads -Duse64bitall
  [stdio] -Dcc=g++ -Duseithreads
~~ ../dist/threads-shared/t/waithires.t ........................ FAILED Non-zero exit status: 29 Bad plan.  You planned 63 tests but ran 0.
  [stdio] -Dcc=g++ -Duseithreads -Duse64bitall
  [stdio] -Dcc=g++ -Duseithreads -Duselongdouble
  [stdio] -Dcc=g++ -Duseithreads
  [stdio] -Dcc=g++ -Duseithreads -Duse64bitall DEBUGGING
  [stdio] -Dcc=g++ -Duseithreads -Duselongdouble DEBUGGING
  [stdio] -Dcc=g++ -Duseithreads DEBUGGING

Test todo-passed:

MANIFEST messages:
  MANIFEST did not declare '.mailmap'

Compiler messages:
  builtin.c:511:1: warning: missing initializer for member 'BuiltinFuncDescriptor::xsub' [-Wmissing-field-initializers]
  builtin.c:511:1: warning: missing initializer for member 'BuiltinFuncDescriptor::checker' [-Wmissing-field-initializers]
  builtin.c:511:1: warning: missing initializer for member 'BuiltinFuncDescriptor::ckval' [-Wmissing-field-initializers]
  MD5.xs: In function 'MD5_CTX* get_md5_ctx(SV*)':
  MD5.xs:470:27: warning: type qualifiers ignored on cast result type [-Wignored-qualifiers]
  MD5.xs: In function 'SV* new_md5_ctx(MD5_CTX*, const char*)':
  MD5.xs:492:40: warning: type qualifiers ignored on cast result type [-Wignored-qualifiers]
  ../../embed.h:611:63: note: in definition of macro 'sv_magicext'
  byte_t.c:7:32: warning: option '-Wc++-compat' is valid for C/ObjC but not for C++ [-Wpragmas]
  cp_00_t.c:7:32: warning: option '-Wc++-compat' is valid for C/ObjC but not for C++ [-Wpragmas]
  eu_01_t.c:7:32: warning: option '-Wc++-compat' is valid for C/ObjC but not for C++ [-Wpragmas]
  gb_02_t.c:7:32: warning: option '-Wc++-compat' is valid for C/ObjC but not for C++ [-Wpragmas]
  gb_03_t.c:7:32: warning: option '-Wc++-compat' is valid for C/ObjC but not for C++ [-Wpragmas]
  ir_04_t.c:7:32: warning: option '-Wc++-compat' is valid for C/ObjC but not for C++ [-Wpragmas]
  ma_05_t.c:7:32: warning: option '-Wc++-compat' is valid for C/ObjC but not for C++ [-Wpragmas]
  ebcdic_t.c:7:32: warning: option '-Wc++-compat' is valid for C/ObjC but not for C++ [-Wpragmas]
  ji_02_t.c:7:32: warning: option '-Wc++-compat' is valid for C/ObjC but not for C++ [-Wpragmas]
  ji_03_t.c:7:32: warning: option '-Wc++-compat' is valid for C/ObjC but not for C++ [-Wpragmas]
  ji_04_t.c:7:32: warning: option '-Wc++-compat' is valid for C/ObjC but not for C++ [-Wpragmas]
  sh_06_t.c:7:32: warning: option '-Wc++-compat' is valid for C/ObjC but not for C++ [-Wpragmas]
  jo_02_t.c:7:32: warning: option '-Wc++-compat' is valid for C/ObjC but not for C++ [-Wpragmas]
  ks_03_t.c:7:32: warning: option '-Wc++-compat' is valid for C/ObjC but not for C++ [-Wpragmas]
  ma_04_t.c:7:32: warning: option '-Wc++-compat' is valid for C/ObjC but not for C++ [-Wpragmas]
  symbol_t.c:7:32: warning: option '-Wc++-compat' is valid for C/ObjC but not for C++ [-Wpragmas]
  bi_00_t.c:7:32: warning: option '-Wc++-compat' is valid for C/ObjC but not for C++ [-Wpragmas]
  bi_01_t.c:7:32: warning: option '-Wc++-compat' is valid for C/ObjC but not for C++ [-Wpragmas]
  cp_02_t.c:7:32: warning: option '-Wc++-compat' is valid for C/ObjC but not for C++ [-Wpragmas]
  ma_03_t.c:7:32: warning: option '-Wc++-compat' is valid for C/ObjC but not for C++ [-Wpragmas]
  def_t.c:7:32: warning: option '-Wc++-compat' is valid for C/ObjC but not for C++ [-Wpragmas]
  Socket.xs: In function 'void XS_Socket_inet_aton(CV*)':
  Socket.xs:784:28: warning: missing initializer for member 'addrinfo::ai_family' [-Wmissing-field-initializers]
  Socket.xs:784:28: warning: missing initializer for member 'addrinfo::ai_socktype' [-Wmissing-field-initializers]
  Socket.xs:784:28: warning: missing initializer for member 'addrinfo::ai_protocol' [-Wmissing-field-initializers]
  Socket.xs:784:28: warning: missing initializer for member 'addrinfo::ai_addrlen' [-Wmissing-field-initializers]
  Socket.xs:784:28: warning: missing initializer for member 'addrinfo::ai_addr' [-Wmissing-field-initializers]
  Socket.xs:784:28: warning: missing initializer for member 'addrinfo::ai_canonname' [-Wmissing-field-initializers]
  Socket.xs:784:28: warning: missing initializer for member 'addrinfo::ai_next' [-Wmissing-field-initializers]
  HiRes.xs: In function 'void XS_Time__HiRes_setitimer(CV*)':
  ../../perl.h:596:30: warning: option '-Wc++-compat' is valid for C/ObjC but not for C++ [-Wpragmas]
  ../../perl.h:599:30: note: in expansion of macro 'GCC_DIAG_PRAGMA'
  ../../perl.h:607:33: note: in expansion of macro 'GCC_DIAG_IGNORE'
  HiRes.xs:1249:9: note: in expansion of macro 'GCC_DIAG_IGNORE_STMT'
  HiRes.xs: In function 'void XS_Time__HiRes_getitimer(CV*)':
  HiRes.xs:1269:9: note: in expansion of macro 'GCC_DIAG_IGNORE_STMT'
  locale.c:440:1: warning: '__locale_struct* S_use_curlocale_scratch(PerlInterpreter*)' defined but not used [-Wunused-function]
  MD5.xs: In function 'MD5_CTX* get_md5_ctx(PerlInterpreter*, SV*)':
  MD5.xs: In function 'SV* new_md5_ctx(PerlInterpreter*, MD5_CTX*, const char*)':
  Socket.xs: In function 'void XS_Socket_inet_aton(PerlInterpreter*, CV*)':
  HiRes.xs: In function 'void XS_Time__HiRes_setitimer(PerlInterpreter*, CV*)':
  HiRes.xs: In function 'void XS_Time__HiRes_getitimer(PerlInterpreter*, CV*)':

About this smoke:
    smoking-perl: 5.30.2
  smoker-version: 1.71/0.046
       timestamp: 2022-08-11T03:03:17
          tester: core

-- 
Report generated by Test::Smoke::Gateway v0.12