Show logfile
Automated smoke report for branch smoke-me/khw-locale3 5.37.2 patch 7e7d85dbf2676ce982cdc378dac59643143009c5 v5.37.1-176-g7e7d85dbf2
cjg-alpine3: Intel(R) Xeon(R) CPU E5-2620 v2 @ 2.10GHz (GenuineIntel 2134MHz) (x86_64/1 cpus)
    on        linux 5.15.55-0-lts [Alpine Linux v3.15 3.15.5]
    using     gcc version 10.3.1 20211027 (*1)
    smoketime 7 hours 59 minutes (average 39 minutes 56 seconds)

Summary: FAIL(F)

O = OK  F = Failure(s), extended report at the bottom
X = Failure(s) under TEST but not under harness
? = still running or test results not (yet) available
Build failures during:       - = unknown or N/A
c = Configure, m = make, M = make (after miniperl), t = make test-prep

v5.37.1-176-g7e7d85dbf2
---------------------- ----------------------------------------------------
O  O                    -Dcc=gcc (*1)
O  O                    -Dcc=gcc -Duse64bitall (*1)
O  O                    -Dcc=gcc -Duselongdouble (*1)
F  F                    -Dcc=gcc -Duseithreads (*1)
F  F                    -Dcc=gcc -Duseithreads -Duse64bitall (*1)
F  F                    -Dcc=gcc -Duseithreads -Duselongdouble (*1)
|  |
|  +------------------  stdio DEBUGGING
+---------------------  stdio

Applied patches:

Skipped tests:
      # One test name on a line

Test failures:
~~ ../dist/Thread-Semaphore/t/05_force.t ....................... FAILED Non-zero exit status: 29 No plan found in TAP output
  [stdio] -Dcc=gcc -Duseithreads -Duselongdouble
  [stdio] -Dcc=gcc -Duseithreads -Duselongdouble DEBUGGING
  [stdio] -Dcc=gcc -Duseithreads DEBUGGING
  [stdio] -Dcc=gcc -Duseithreads -Duse64bitall DEBUGGING
  [stdio] -Dcc=gcc -Duseithreads -Duse64bitall
  [stdio] -Dcc=gcc -Duseithreads
~~ ../cpan/Scalar-List-Utils/t/dualvar.t ....................... FAILED Non-zero exit status: 29 Bad plan.  You planned 41 tests but ran 0.
  [stdio] -Dcc=gcc -Duseithreads -Duselongdouble DEBUGGING
  [stdio] -Dcc=gcc -Duseithreads -Duselongdouble
  [stdio] -Dcc=gcc -Duseithreads DEBUGGING
  [stdio] -Dcc=gcc -Duseithreads -Duse64bitall DEBUGGING
  [stdio] -Dcc=gcc -Duseithreads -Duse64bitall
  [stdio] -Dcc=gcc -Duseithreads
~~ ../t/op/getpid.t ............................................ FAILED Non-zero exit status: 29 No plan found in TAP output
  [stdio] -Dcc=gcc -Duseithreads -Duse64bitall DEBUGGING
  [stdio] -Dcc=gcc -Duseithreads -Duse64bitall
  [stdio] -Dcc=gcc -Duseithreads DEBUGGING
  [stdio] -Dcc=gcc -Duseithreads
  [stdio] -Dcc=gcc -Duseithreads -Duselongdouble DEBUGGING
  [stdio] -Dcc=gcc -Duseithreads -Duselongdouble
~~ ../dist/Thread-Queue/t/05_extract.t ......................... FAILED Non-zero exit status: 29 No plan found in TAP output
  [stdio] -Dcc=gcc -Duseithreads -Duse64bitall DEBUGGING
  [stdio] -Dcc=gcc -Duseithreads -Duse64bitall
  [stdio] -Dcc=gcc -Duseithreads DEBUGGING
  [stdio] -Dcc=gcc -Duseithreads
  [stdio] -Dcc=gcc -Duseithreads -Duselongdouble
  [stdio] -Dcc=gcc -Duseithreads -Duselongdouble DEBUGGING
~~ ../dist/threads-shared/t/utf8.t ............................. FAILED Non-zero exit status: 29 Bad plan.  You planned 12 tests but ran 0.
  [stdio] -Dcc=gcc -Duseithreads -Duse64bitall DEBUGGING
  [stdio] -Dcc=gcc -Duseithreads -Duse64bitall
  [stdio] -Dcc=gcc -Duseithreads DEBUGGING
  [stdio] -Dcc=gcc -Duseithreads
  [stdio] -Dcc=gcc -Duseithreads -Duselongdouble
  [stdio] -Dcc=gcc -Duseithreads -Duselongdouble DEBUGGING
~~ ../dist/Thread-Queue/t/11_limit.t ........................... FAILED Non-zero exit status: 29 No plan found in TAP output
  [stdio] -Dcc=gcc -Duseithreads -Duselongdouble DEBUGGING
  [stdio] -Dcc=gcc -Duseithreads -Duselongdouble
  [stdio] -Dcc=gcc -Duseithreads
  [stdio] -Dcc=gcc -Duseithreads -Duse64bitall
  [stdio] -Dcc=gcc -Duseithreads -Duse64bitall DEBUGGING
  [stdio] -Dcc=gcc -Duseithreads DEBUGGING
~~ ../dist/threads/t/kill2.t ................................... FAILED Non-zero exit status: 29 No plan found in TAP output
  [stdio] -Dcc=gcc -Duseithreads -Duselongdouble DEBUGGING
  [stdio] -Dcc=gcc -Duseithreads -Duselongdouble
  [stdio] -Dcc=gcc -Duseithreads
  [stdio] -Dcc=gcc -Duseithreads DEBUGGING
  [stdio] -Dcc=gcc -Duseithreads -Duse64bitall
  [stdio] -Dcc=gcc -Duseithreads -Duse64bitall DEBUGGING
~~ ../lib/Thread.t ............................................. FAILED Non-zero exit status: 29 No plan found in TAP output
  [stdio] -Dcc=gcc -Duseithreads -Duselongdouble DEBUGGING
  [stdio] -Dcc=gcc -Duseithreads -Duselongdouble
  [stdio] -Dcc=gcc -Duseithreads
  [stdio] -Dcc=gcc -Duseithreads DEBUGGING
  [stdio] -Dcc=gcc -Duseithreads -Duse64bitall
  [stdio] -Dcc=gcc -Duseithreads -Duse64bitall DEBUGGING
~~ ../dist/threads-shared/t/wait.t ............................. FAILED Non-zero exit status: 29 Bad plan.  You planned 91 tests but ran 0.
  [stdio] -Dcc=gcc -Duseithreads -Duse64bitall DEBUGGING
  [stdio] -Dcc=gcc -Duseithreads -Duse64bitall
  [stdio] -Dcc=gcc -Duseithreads DEBUGGING
  [stdio] -Dcc=gcc -Duseithreads
  [stdio] -Dcc=gcc -Duseithreads -Duselongdouble
  [stdio] -Dcc=gcc -Duseithreads -Duselongdouble DEBUGGING
~~ ../dist/threads/t/problems.t ................................ FAILED Non-zero exit status: 29 No plan found in TAP output
  [stdio] -Dcc=gcc -Duseithreads -Duselongdouble DEBUGGING
  [stdio] -Dcc=gcc -Duseithreads -Duselongdouble
  [stdio] -Dcc=gcc -Duseithreads DEBUGGING
  [stdio] -Dcc=gcc -Duseithreads -Duse64bitall
  [stdio] -Dcc=gcc -Duseithreads -Duse64bitall DEBUGGING
  [stdio] -Dcc=gcc -Duseithreads
~~ ../dist/threads-shared/t/clone.t ............................ FAILED Non-zero exit status: 29 Bad plan.  You planned 40 tests but ran 0.
  [stdio] -Dcc=gcc -Duseithreads DEBUGGING
  [stdio] -Dcc=gcc -Duseithreads -Duse64bitall DEBUGGING
  [stdio] -Dcc=gcc -Duseithreads -Duse64bitall
  [stdio] -Dcc=gcc -Duseithreads
  [stdio] -Dcc=gcc -Duseithreads -Duselongdouble
  [stdio] -Dcc=gcc -Duseithreads -Duselongdouble DEBUGGING
~~ ../dist/threads/t/kill.t .................................... FAILED Non-zero exit status: 29 No plan found in TAP output
  [stdio] -Dcc=gcc -Duseithreads DEBUGGING
  [stdio] -Dcc=gcc -Duseithreads -Duse64bitall DEBUGGING
  [stdio] -Dcc=gcc -Duseithreads -Duse64bitall
  [stdio] -Dcc=gcc -Duseithreads
  [stdio] -Dcc=gcc -Duseithreads -Duselongdouble
  [stdio] -Dcc=gcc -Duseithreads -Duselongdouble DEBUGGING
~~ ../dist/Thread-Queue/t/09_ended.t ........................... FAILED Non-zero exit status: 29 No plan found in TAP output
  [stdio] -Dcc=gcc -Duseithreads -Duselongdouble DEBUGGING
  [stdio] -Dcc=gcc -Duseithreads -Duselongdouble
  [stdio] -Dcc=gcc -Duseithreads DEBUGGING
  [stdio] -Dcc=gcc -Duseithreads -Duse64bitall
  [stdio] -Dcc=gcc -Duseithreads -Duse64bitall DEBUGGING
  [stdio] -Dcc=gcc -Duseithreads
~~ ../t/op/threads-dirh.t ...................................... FAILED Non-zero exit status: 29 Bad plan.  You planned 6 tests but ran 0.
  [stdio] -Dcc=gcc -Duseithreads -Duselongdouble
  [stdio] -Dcc=gcc -Duseithreads -Duselongdouble DEBUGGING
  [stdio] -Dcc=gcc -Duseithreads
  [stdio] -Dcc=gcc -Duseithreads DEBUGGING
  [stdio] -Dcc=gcc -Duseithreads -Duse64bitall
  [stdio] -Dcc=gcc -Duseithreads -Duse64bitall DEBUGGING
~~ ../t/op/reset.t ............................................. FAILED 37-40
  [stdio] -Dcc=gcc -Duseithreads -Duselongdouble
  [stdio] -Dcc=gcc -Duseithreads -Duselongdouble DEBUGGING
  [stdio] -Dcc=gcc -Duseithreads
  [stdio] -Dcc=gcc -Duseithreads DEBUGGING
  [stdio] -Dcc=gcc -Duseithreads -Duse64bitall DEBUGGING
  [stdio] -Dcc=gcc -Duseithreads -Duse64bitall
~~ ../dist/Thread-Queue/t/06_insert.t .......................... FAILED Non-zero exit status: 29 No plan found in TAP output
  [stdio] -Dcc=gcc -Duseithreads -Duse64bitall DEBUGGING
  [stdio] -Dcc=gcc -Duseithreads -Duse64bitall
  [stdio] -Dcc=gcc -Duseithreads DEBUGGING
  [stdio] -Dcc=gcc -Duseithreads
  [stdio] -Dcc=gcc -Duseithreads -Duselongdouble DEBUGGING
  [stdio] -Dcc=gcc -Duseithreads -Duselongdouble
~~ ../dist/threads-shared/t/object2.t .......................... FAILED Non-zero exit status: 29 Bad plan.  You planned 133 tests but ran 0.
  [stdio] -Dcc=gcc -Duseithreads
  [stdio] -Dcc=gcc -Duseithreads DEBUGGING
  [stdio] -Dcc=gcc -Duseithreads -Duse64bitall
  [stdio] -Dcc=gcc -Duseithreads -Duse64bitall DEBUGGING
  [stdio] -Dcc=gcc -Duseithreads -Duselongdouble DEBUGGING
  [stdio] -Dcc=gcc -Duseithreads -Duselongdouble
~~ ../dist/threads-shared/t/av_refs.t .......................... FAILED Non-zero exit status: 29 Bad plan.  You planned 14 tests but ran 0.
  [stdio] -Dcc=gcc -Duseithreads -Duselongdouble
  [stdio] -Dcc=gcc -Duseithreads -Duselongdouble DEBUGGING
  [stdio] -Dcc=gcc -Duseithreads
  [stdio] -Dcc=gcc -Duseithreads DEBUGGING
  [stdio] -Dcc=gcc -Duseithreads -Duse64bitall
  [stdio] -Dcc=gcc -Duseithreads -Duse64bitall DEBUGGING
~~ ../dist/threads-shared/t/blessed.t .......................... FAILED Non-zero exit status: 29 Bad plan.  You planned 37 tests but ran 0.
  [stdio] -Dcc=gcc -Duseithreads
  [stdio] -Dcc=gcc -Duseithreads -Duse64bitall DEBUGGING
  [stdio] -Dcc=gcc -Duseithreads -Duse64bitall
  [stdio] -Dcc=gcc -Duseithreads DEBUGGING
  [stdio] -Dcc=gcc -Duseithreads -Duselongdouble
  [stdio] -Dcc=gcc -Duseithreads -Duselongdouble DEBUGGING
~~ ../dist/threads-shared/t/dualvar.t .......................... FAILED Non-zero exit status: 29 Bad plan.  You planned 226 tests but ran 0.
  [stdio] -Dcc=gcc -Duseithreads DEBUGGING
  [stdio] -Dcc=gcc -Duseithreads -Duse64bitall DEBUGGING
  [stdio] -Dcc=gcc -Duseithreads -Duse64bitall
  [stdio] -Dcc=gcc -Duseithreads
  [stdio] -Dcc=gcc -Duseithreads -Duselongdouble
  [stdio] -Dcc=gcc -Duseithreads -Duselongdouble DEBUGGING
~~ ../dist/Thread-Queue/t/03_peek.t ............................ FAILED Non-zero exit status: 29 No plan found in TAP output
  [stdio] -Dcc=gcc -Duseithreads -Duselongdouble
  [stdio] -Dcc=gcc -Duseithreads -Duselongdouble DEBUGGING
  [stdio] -Dcc=gcc -Duseithreads DEBUGGING
  [stdio] -Dcc=gcc -Duseithreads -Duse64bitall DEBUGGING
  [stdio] -Dcc=gcc -Duseithreads -Duse64bitall
  [stdio] -Dcc=gcc -Duseithreads
~~ ../dist/threads/t/exit.t .................................... FAILED Non-zero exit status: 29 No plan found in TAP output
  [stdio] -Dcc=gcc -Duseithreads -Duselongdouble
  [stdio] -Dcc=gcc -Duseithreads -Duselongdouble DEBUGGING
  [stdio] -Dcc=gcc -Duseithreads DEBUGGING
  [stdio] -Dcc=gcc -Duseithreads -Duse64bitall DEBUGGING
  [stdio] -Dcc=gcc -Duseithreads -Duse64bitall
  [stdio] -Dcc=gcc -Duseithreads
~~ ../dist/threads-shared/t/hv_refs.t .......................... FAILED Non-zero exit status: 29 Bad plan.  You planned 20 tests but ran 0.
  [stdio] -Dcc=gcc -Duseithreads -Duselongdouble
  [stdio] -Dcc=gcc -Duseithreads -Duselongdouble DEBUGGING
  [stdio] -Dcc=gcc -Duseithreads
  [stdio] -Dcc=gcc -Duseithreads DEBUGGING
  [stdio] -Dcc=gcc -Duseithreads -Duse64bitall DEBUGGING
  [stdio] -Dcc=gcc -Duseithreads -Duse64bitall
~~ ../dist/Thread-Queue/t/07_lock.t ............................ FAILED Non-zero exit status: 29 No plan found in TAP output
  [stdio] -Dcc=gcc -Duseithreads -Duselongdouble
  [stdio] -Dcc=gcc -Duseithreads -Duselongdouble DEBUGGING
  [stdio] -Dcc=gcc -Duseithreads DEBUGGING
  [stdio] -Dcc=gcc -Duseithreads -Duse64bitall
  [stdio] -Dcc=gcc -Duseithreads -Duse64bitall DEBUGGING
  [stdio] -Dcc=gcc -Duseithreads
~~ ../dist/threads-shared/t/shared_attr.t ...................... FAILED Non-zero exit status: 29 Bad plan.  You planned 101 tests but ran 0.
  [stdio] -Dcc=gcc -Duseithreads -Duselongdouble DEBUGGING
  [stdio] -Dcc=gcc -Duseithreads -Duselongdouble
  [stdio] -Dcc=gcc -Duseithreads
  [stdio] -Dcc=gcc -Duseithreads -Duse64bitall DEBUGGING
  [stdio] -Dcc=gcc -Duseithreads -Duse64bitall
  [stdio] -Dcc=gcc -Duseithreads DEBUGGING
~~ ../dist/Thread-Semaphore/t/01_basic.t ....................... FAILED Non-zero exit status: 29 No plan found in TAP output
  [stdio] -Dcc=gcc -Duseithreads -Duselongdouble
  [stdio] -Dcc=gcc -Duseithreads -Duselongdouble DEBUGGING
  [stdio] -Dcc=gcc -Duseithreads -Duse64bitall
  [stdio] -Dcc=gcc -Duseithreads -Duse64bitall DEBUGGING
  [stdio] -Dcc=gcc -Duseithreads DEBUGGING
  [stdio] -Dcc=gcc -Duseithreads
~~ ../dist/threads-shared/t/hv_simple.t ........................ FAILED Non-zero exit status: 29 Bad plan.  You planned 16 tests but ran 0.
  [stdio] -Dcc=gcc -Duseithreads -Duse64bitall
  [stdio] -Dcc=gcc -Duseithreads -Duse64bitall DEBUGGING
  [stdio] -Dcc=gcc -Duseithreads DEBUGGING
  [stdio] -Dcc=gcc -Duseithreads
  [stdio] -Dcc=gcc -Duseithreads -Duselongdouble DEBUGGING
  [stdio] -Dcc=gcc -Duseithreads -Duselongdouble
~~ ../dist/threads-shared/t/cond.t ............................. FAILED Non-zero exit status: 29 Bad plan.  You planned 32 tests but ran 0.
  [stdio] -Dcc=gcc -Duseithreads -Duselongdouble DEBUGGING
  [stdio] -Dcc=gcc -Duseithreads -Duselongdouble
  [stdio] -Dcc=gcc -Duseithreads
  [stdio] -Dcc=gcc -Duseithreads DEBUGGING
  [stdio] -Dcc=gcc -Duseithreads -Duse64bitall
  [stdio] -Dcc=gcc -Duseithreads -Duse64bitall DEBUGGING
~~ ../dist/threads-shared/t/object.t ........................... FAILED Non-zero exit status: 29 Bad plan.  You planned 28 tests but ran 0.
  [stdio] -Dcc=gcc -Duseithreads -Duselongdouble DEBUGGING
  [stdio] -Dcc=gcc -Duseithreads -Duselongdouble
  [stdio] -Dcc=gcc -Duseithreads
  [stdio] -Dcc=gcc -Duseithreads -Duse64bitall
  [stdio] -Dcc=gcc -Duseithreads -Duse64bitall DEBUGGING
  [stdio] -Dcc=gcc -Duseithreads DEBUGGING
~~ ../dist/threads/t/end.t ..................................... FAILED Non-zero exit status: 29 No plan found in TAP output
  [stdio] -Dcc=gcc -Duseithreads DEBUGGING
  [stdio] -Dcc=gcc -Duseithreads -Duse64bitall
  [stdio] -Dcc=gcc -Duseithreads -Duse64bitall DEBUGGING
  [stdio] -Dcc=gcc -Duseithreads
  [stdio] -Dcc=gcc -Duseithreads -Duselongdouble
  [stdio] -Dcc=gcc -Duseithreads -Duselongdouble DEBUGGING
~~ ../dist/Thread-Queue/t/02_refs.t ............................ FAILED Non-zero exit status: 29 No plan found in TAP output
  [stdio] -Dcc=gcc -Duseithreads
  [stdio] -Dcc=gcc -Duseithreads DEBUGGING
  [stdio] -Dcc=gcc -Duseithreads -Duse64bitall
  [stdio] -Dcc=gcc -Duseithreads -Duse64bitall DEBUGGING
  [stdio] -Dcc=gcc -Duseithreads -Duselongdouble
  [stdio] -Dcc=gcc -Duseithreads -Duselongdouble DEBUGGING
~~ ../dist/threads-shared/t/sv_refs.t .......................... FAILED Non-zero exit status: 29 Bad plan.  You planned 21 tests but ran 0.
  [stdio] -Dcc=gcc -Duseithreads -Duselongdouble
  [stdio] -Dcc=gcc -Duseithreads -Duselongdouble DEBUGGING
  [stdio] -Dcc=gcc -Duseithreads -Duse64bitall DEBUGGING
  [stdio] -Dcc=gcc -Duseithreads -Duse64bitall
  [stdio] -Dcc=gcc -Duseithreads DEBUGGING
  [stdio] -Dcc=gcc -Duseithreads
~~ ../dist/Thread-Queue/t/01_basic.t ........................... FAILED Non-zero exit status: 29 No plan found in TAP output
  [stdio] -Dcc=gcc -Duseithreads DEBUGGING
  [stdio] -Dcc=gcc -Duseithreads -Duse64bitall
  [stdio] -Dcc=gcc -Duseithreads -Duse64bitall DEBUGGING
  [stdio] -Dcc=gcc -Duseithreads
  [stdio] -Dcc=gcc -Duseithreads -Duselongdouble DEBUGGING
  [stdio] -Dcc=gcc -Duseithreads -Duselongdouble
~~ ../dist/threads/t/kill3.t ................................... FAILED Non-zero exit status: 29 No plan found in TAP output
  [stdio] -Dcc=gcc -Duseithreads -Duselongdouble DEBUGGING
  [stdio] -Dcc=gcc -Duseithreads -Duselongdouble
  [stdio] -Dcc=gcc -Duseithreads
  [stdio] -Dcc=gcc -Duseithreads -Duse64bitall DEBUGGING
  [stdio] -Dcc=gcc -Duseithreads -Duse64bitall
  [stdio] -Dcc=gcc -Duseithreads DEBUGGING
~~ ../dist/threads-shared/t/stress.t ........................... FAILED Non-zero exit status: 29 Bad plan.  You planned 1 tests but ran 0.
  [stdio] -Dcc=gcc -Duseithreads -Duselongdouble
  [stdio] -Dcc=gcc -Duseithreads -Duselongdouble DEBUGGING
  [stdio] -Dcc=gcc -Duseithreads
  [stdio] -Dcc=gcc -Duseithreads -Duse64bitall
  [stdio] -Dcc=gcc -Duseithreads -Duse64bitall DEBUGGING
  [stdio] -Dcc=gcc -Duseithreads DEBUGGING
~~ ../dist/Thread-Queue/t/10_timed.t ........................... FAILED Non-zero exit status: 29 No plan found in TAP output
  [stdio] -Dcc=gcc -Duseithreads -Duse64bitall
  [stdio] -Dcc=gcc -Duseithreads -Duse64bitall DEBUGGING
  [stdio] -Dcc=gcc -Duseithreads DEBUGGING
  [stdio] -Dcc=gcc -Duseithreads
  [stdio] -Dcc=gcc -Duseithreads -Duselongdouble
  [stdio] -Dcc=gcc -Duseithreads -Duselongdouble DEBUGGING
~~ ../dist/threads/t/join.t .................................... FAILED Non-zero exit status: 29 No plan found in TAP output
  [stdio] -Dcc=gcc -Duseithreads
  [stdio] -Dcc=gcc -Duseithreads -Duse64bitall DEBUGGING
  [stdio] -Dcc=gcc -Duseithreads -Duse64bitall
  [stdio] -Dcc=gcc -Duseithreads DEBUGGING
  [stdio] -Dcc=gcc -Duseithreads -Duselongdouble DEBUGGING
  [stdio] -Dcc=gcc -Duseithreads -Duselongdouble
~~ ../dist/threads/t/blocks.t .................................. FAILED Non-zero exit status: 29 No plan found in TAP output
  [stdio] -Dcc=gcc -Duseithreads DEBUGGING
  [stdio] -Dcc=gcc -Duseithreads -Duse64bitall DEBUGGING
  [stdio] -Dcc=gcc -Duseithreads -Duse64bitall
  [stdio] -Dcc=gcc -Duseithreads
  [stdio] -Dcc=gcc -Duseithreads -Duselongdouble DEBUGGING
  [stdio] -Dcc=gcc -Duseithreads -Duselongdouble
~~ ../dist/threads/t/free.t .................................... FAILED Non-zero exit status: 29 No plan found in TAP output
  [stdio] -Dcc=gcc -Duseithreads -Duselongdouble DEBUGGING
  [stdio] -Dcc=gcc -Duseithreads -Duselongdouble
  [stdio] -Dcc=gcc -Duseithreads DEBUGGING
  [stdio] -Dcc=gcc -Duseithreads -Duse64bitall DEBUGGING
  [stdio] -Dcc=gcc -Duseithreads -Duse64bitall
  [stdio] -Dcc=gcc -Duseithreads
~~ ../dist/threads-shared/t/waithires.t ........................ FAILED Non-zero exit status: 29 Bad plan.  You planned 63 tests but ran 0.
  [stdio] -Dcc=gcc -Duseithreads -Duselongdouble
  [stdio] -Dcc=gcc -Duseithreads -Duselongdouble DEBUGGING
  [stdio] -Dcc=gcc -Duseithreads
  [stdio] -Dcc=gcc -Duseithreads DEBUGGING
  [stdio] -Dcc=gcc -Duseithreads -Duse64bitall DEBUGGING
  [stdio] -Dcc=gcc -Duseithreads -Duse64bitall
~~ ../dist/threads/t/thread.t .................................. FAILED Non-zero exit status: 29 No plan found in TAP output
  [stdio] -Dcc=gcc -Duseithreads DEBUGGING
  [stdio] -Dcc=gcc -Duseithreads -Duse64bitall DEBUGGING
  [stdio] -Dcc=gcc -Duseithreads -Duse64bitall
  [stdio] -Dcc=gcc -Duseithreads
  [stdio] -Dcc=gcc -Duseithreads -Duselongdouble DEBUGGING
  [stdio] -Dcc=gcc -Duseithreads -Duselongdouble
~~ ../dist/threads/t/context.t ................................. FAILED Non-zero exit status: 29 No plan found in TAP output
  [stdio] -Dcc=gcc -Duseithreads DEBUGGING
  [stdio] -Dcc=gcc -Duseithreads -Duse64bitall
  [stdio] -Dcc=gcc -Duseithreads -Duse64bitall DEBUGGING
  [stdio] -Dcc=gcc -Duseithreads
  [stdio] -Dcc=gcc -Duseithreads -Duselongdouble DEBUGGING
  [stdio] -Dcc=gcc -Duseithreads -Duselongdouble
~~ ../lib/perl5db.t ............................................ FAILED 14
  [stdio] -Dcc=gcc -Duseithreads
  [stdio] -Dcc=gcc -Duseithreads -Duse64bitall
  [stdio] -Dcc=gcc -Duseithreads -Duse64bitall DEBUGGING
  [stdio] -Dcc=gcc -Duseithreads DEBUGGING
  [stdio] -Dcc=gcc -Duseithreads -Duselongdouble DEBUGGING
  [stdio] -Dcc=gcc -Duseithreads -Duselongdouble
~~ ../dist/threads/t/free2.t ................................... FAILED Non-zero exit status: 29 No plan found in TAP output
  [stdio] -Dcc=gcc -Duseithreads -Duselongdouble
  [stdio] -Dcc=gcc -Duseithreads -Duselongdouble DEBUGGING
  [stdio] -Dcc=gcc -Duseithreads -Duse64bitall DEBUGGING
  [stdio] -Dcc=gcc -Duseithreads -Duse64bitall
  [stdio] -Dcc=gcc -Duseithreads DEBUGGING
  [stdio] -Dcc=gcc -Duseithreads
~~ ../dist/threads-shared/t/av_simple.t ........................ FAILED Non-zero exit status: 29 Bad plan.  You planned 47 tests but ran 0.
  [stdio] -Dcc=gcc -Duseithreads
  [stdio] -Dcc=gcc -Duseithreads DEBUGGING
  [stdio] -Dcc=gcc -Duseithreads -Duse64bitall
  [stdio] -Dcc=gcc -Duseithreads -Duse64bitall DEBUGGING
  [stdio] -Dcc=gcc -Duseithreads -Duselongdouble
  [stdio] -Dcc=gcc -Duseithreads -Duselongdouble DEBUGGING
~~ ../dist/Thread-Semaphore/t/06_timed.t ....................... FAILED Non-zero exit status: 29 No plan found in TAP output
  [stdio] -Dcc=gcc -Duseithreads -Duse64bitall DEBUGGING
  [stdio] -Dcc=gcc -Duseithreads -Duse64bitall
  [stdio] -Dcc=gcc -Duseithreads DEBUGGING
  [stdio] -Dcc=gcc -Duseithreads
  [stdio] -Dcc=gcc -Duseithreads -Duselongdouble
  [stdio] -Dcc=gcc -Duseithreads -Duselongdouble DEBUGGING
~~ ../dist/Thread-Semaphore/t/04_nonblocking.t ................. FAILED Non-zero exit status: 29 No plan found in TAP output
  [stdio] -Dcc=gcc -Duseithreads -Duselongdouble DEBUGGING
  [stdio] -Dcc=gcc -Duseithreads -Duselongdouble
  [stdio] -Dcc=gcc -Duseithreads -Duse64bitall DEBUGGING
  [stdio] -Dcc=gcc -Duseithreads -Duse64bitall
  [stdio] -Dcc=gcc -Duseithreads DEBUGGING
  [stdio] -Dcc=gcc -Duseithreads
~~ ../ext/XS-APItest/t/boolean-thr.t ........................... FAILED Non-zero exit status: 29 No plan found in TAP output
  [stdio] -Dcc=gcc -Duseithreads -Duselongdouble DEBUGGING
  [stdio] -Dcc=gcc -Duseithreads -Duselongdouble
  [stdio] -Dcc=gcc -Duseithreads DEBUGGING
  [stdio] -Dcc=gcc -Duseithreads -Duse64bitall
  [stdio] -Dcc=gcc -Duseithreads -Duse64bitall DEBUGGING
  [stdio] -Dcc=gcc -Duseithreads
~~ ../t/op/threads.t ........................................... FAILED 29
  [stdio] -Dcc=gcc -Duseithreads -Duselongdouble
  [stdio] -Dcc=gcc -Duseithreads -Duselongdouble DEBUGGING
  [stdio] -Dcc=gcc -Duseithreads DEBUGGING
  [stdio] -Dcc=gcc -Duseithreads -Duse64bitall DEBUGGING
  [stdio] -Dcc=gcc -Duseithreads -Duse64bitall
  [stdio] -Dcc=gcc -Duseithreads
~~ ../dist/threads/t/state.t ................................... FAILED Non-zero exit status: 29 No plan found in TAP output
  [stdio] -Dcc=gcc -Duseithreads -Duselongdouble DEBUGGING
  [stdio] -Dcc=gcc -Duseithreads -Duselongdouble
  [stdio] -Dcc=gcc -Duseithreads
  [stdio] -Dcc=gcc -Duseithreads DEBUGGING
  [stdio] -Dcc=gcc -Duseithreads -Duse64bitall
  [stdio] -Dcc=gcc -Duseithreads -Duse64bitall DEBUGGING
~~ ../dist/threads-shared/t/sv_simple.t ........................ FAILED Non-zero exit status: 29 Bad plan.  You planned 11 tests but ran 0.
  [stdio] -Dcc=gcc -Duseithreads -Duselongdouble
  [stdio] -Dcc=gcc -Duseithreads -Duselongdouble DEBUGGING
  [stdio] -Dcc=gcc -Duseithreads DEBUGGING
  [stdio] -Dcc=gcc -Duseithreads -Duse64bitall
  [stdio] -Dcc=gcc -Duseithreads -Duse64bitall DEBUGGING
  [stdio] -Dcc=gcc -Duseithreads

Test todo-passed:

MANIFEST messages:
  MANIFEST did not declare '.mailmap'

Compiler messages:
  Makefile:258: warning: ignoring prerequisites on suffix rule definition
  Makefile:254: warning: ignoring prerequisites on suffix rule definition
  makefile:258: warning: ignoring prerequisites on suffix rule definition
  makefile:254: warning: ignoring prerequisites on suffix rule definition
  locale.c:1350:1: warning: 'S_calculate_LC_ALL' defined but not used [-Wunused-function]

About this smoke:
    smoking-perl: 5.30.2
  smoker-version: 1.71/0.046
       timestamp: 2022-07-23T10:43:25
          tester: core

-- 
Report generated by Test::Smoke::Gateway v0.12