Show logfile
Automated smoke report for branch blead 5.37.2 patch dd4d3f69a5f082c6c3cdd2a49512ea7e630b62cb v5.37.1-18-gdd4d3f69a5
cjg-netbsd9: Intel 686-class (amd64/1 cpus)
    on        netbsd 9.2
    using     gcc version 7.5.0 (*1)
    smoketime 5 hours 38 minutes (average 42 minutes 22 seconds)

Summary: PASS

O = OK  F = Failure(s), extended report at the bottom
X = Failure(s) under TEST but not under harness
? = still running or test results not (yet) available
Build failures during:       - = unknown or N/A
c = Configure, m = make, M = make (after miniperl), t = make test-prep

v5.37.1-18-gdd4d3f69a5
---------------------- ----------------------------------------------------
O  O                    -Dcc=gcc (*1)
O  O                    -Dcc=gcc -Duse64bitall (*1)
O  O                    -Dcc=gcc -Duseithreads (*1)
O  O                    -Dcc=gcc -Duseithreads -Duse64bitall (*1)
|  |
|  +------------------  stdio DEBUGGING
+---------------------  stdio

Applied patches:

Skipped tests:
      # One test name on a line

Test failures:

Test todo-passed:

MANIFEST messages:
  MANIFEST did not declare '.mailmap'

Compiler messages:
  locale.c:1113:1: warning: 'S_calculate_LC_ALL' defined but not used [-Wunused-function]
  /usr/include/sys/cdefs_elf.h:67:20: error: missing binary operator before token "("
  /usr/include/sys/cdefs_elf.h:73:20: error: missing binary operator before token "("
  /usr/include/sys/cdefs_elf.h:79:20: error: missing binary operator before token "("
  Socket.c: In function 'XS_Socket_pack_ip_mreq_source':
  Socket.c:1703:7: warning: variable 'interface' set but not used [-Wunused-but-set-variable]
  const-c.inc: In function 'constant_19':
  const-c.inc:351:42: warning: unused parameter 'iv_return' [-Wunused-parameter]
  Piece.xs: In function '_strptime':
  Piece.xs:719:8: warning: 'len' may be used uninitialized in this function [-Wmaybe-uninitialized]
  re_exec.c: In function 'S_regtry':
  re_exec.c:7099:44: warning: 'fold_array' may be used uninitialized in this function [-Wmaybe-uninitialized]
  re_exec.c:7003:24: note: 'fold_array' was declared here
  re_exec.c:7105:29: warning: 'folder' may be used uninitialized in this function [-Wmaybe-uninitialized]
  re_exec.c:7002:23: note: 'folder' was declared here
  regexec.c: In function 'S_regtry':
  regexec.c:7099:44: warning: 'fold_array' may be used uninitialized in this function [-Wmaybe-uninitialized]
  regexec.c:7003:24: note: 'fold_array' was declared here
  regexec.c:7105:29: warning: 'folder' may be used uninitialized in this function [-Wmaybe-uninitialized]
  regexec.c:7002:23: note: 'folder' was declared here

About this smoke:
    smoking-perl: 5.30.2
  smoker-version: 1.71/0.046
       timestamp: 2022-06-23 06:24:23+00
          tester: core

-- 
Report generated by Test::Smoke::Gateway v0.09