Show logfile
Automated smoke report for branch blead 5.37.2 patch 8bde4793b8b1dfdd6be2f3ddc1fdf4f7f5c5b01e v5.37.1-12-g8bde4793b8
cjg-netbsd9: Intel 686-class (amd64/1 cpus)
    on        netbsd 9.2
    using     g++ version 7.5.0 (*1)
    smoketime 5 hours 41 minutes (average 42 minutes 39 seconds)

Summary: PASS

O = OK  F = Failure(s), extended report at the bottom
X = Failure(s) under TEST but not under harness
? = still running or test results not (yet) available
Build failures during:       - = unknown or N/A
c = Configure, m = make, M = make (after miniperl), t = make test-prep

v5.37.1-12-g8bde4793b8
---------------------- ----------------------------------------------------
O  O                    -Dcc=g++ (*1)
O  O                    -Dcc=g++ -Duse64bitall (*1)
O  O                    -Dcc=g++ -Duseithreads (*1)
O  O                    -Dcc=g++ -Duseithreads -Duse64bitall (*1)
|  |
|  +------------------  stdio DEBUGGING
+---------------------  stdio

Applied patches:

Skipped tests:
      # One test name on a line

Test failures:

Test todo-passed:

MANIFEST messages:
  MANIFEST did not declare '.mailmap'

Compiler messages:
  builtin.c:400:1: warning: missing initializer for member 'BuiltinFuncDescriptor::xsub' [-Wmissing-field-initializers]
  builtin.c:400:1: warning: missing initializer for member 'BuiltinFuncDescriptor::checker' [-Wmissing-field-initializers]
  builtin.c:400:1: warning: missing initializer for member 'BuiltinFuncDescriptor::ckval' [-Wmissing-field-initializers]
  locale.c:1113:1: warning: 'const char* S_calculate_LC_ALL(const char**)' defined but not used [-Wunused-function]
  /usr/include/sys/cdefs_elf.h:67:20: error: missing binary operator before token "("
  /usr/include/sys/cdefs_elf.h:73:20: error: missing binary operator before token "("
  /usr/include/sys/cdefs_elf.h:79:20: error: missing binary operator before token "("
  byte_t.c:7:32: warning: option '-Wc++-compat' is valid for C/ObjC but not for C++ [-Wpragmas]
  cp_00_t.c:7:32: warning: option '-Wc++-compat' is valid for C/ObjC but not for C++ [-Wpragmas]
  eu_01_t.c:7:32: warning: option '-Wc++-compat' is valid for C/ObjC but not for C++ [-Wpragmas]
  gb_02_t.c:7:32: warning: option '-Wc++-compat' is valid for C/ObjC but not for C++ [-Wpragmas]
  gb_03_t.c:7:32: warning: option '-Wc++-compat' is valid for C/ObjC but not for C++ [-Wpragmas]
  ir_04_t.c:7:32: warning: option '-Wc++-compat' is valid for C/ObjC but not for C++ [-Wpragmas]
  ma_05_t.c:7:32: warning: option '-Wc++-compat' is valid for C/ObjC but not for C++ [-Wpragmas]
  ebcdic_t.c:7:32: warning: option '-Wc++-compat' is valid for C/ObjC but not for C++ [-Wpragmas]
  ji_02_t.c:7:32: warning: option '-Wc++-compat' is valid for C/ObjC but not for C++ [-Wpragmas]
  ji_03_t.c:7:32: warning: option '-Wc++-compat' is valid for C/ObjC but not for C++ [-Wpragmas]
  ji_04_t.c:7:32: warning: option '-Wc++-compat' is valid for C/ObjC but not for C++ [-Wpragmas]
  sh_06_t.c:7:32: warning: option '-Wc++-compat' is valid for C/ObjC but not for C++ [-Wpragmas]
  jo_02_t.c:7:32: warning: option '-Wc++-compat' is valid for C/ObjC but not for C++ [-Wpragmas]
  ks_03_t.c:7:32: warning: option '-Wc++-compat' is valid for C/ObjC but not for C++ [-Wpragmas]
  ma_04_t.c:7:32: warning: option '-Wc++-compat' is valid for C/ObjC but not for C++ [-Wpragmas]
  symbol_t.c:7:32: warning: option '-Wc++-compat' is valid for C/ObjC but not for C++ [-Wpragmas]
  bi_00_t.c:7:32: warning: option '-Wc++-compat' is valid for C/ObjC but not for C++ [-Wpragmas]
  bi_01_t.c:7:32: warning: option '-Wc++-compat' is valid for C/ObjC but not for C++ [-Wpragmas]
  cp_02_t.c:7:32: warning: option '-Wc++-compat' is valid for C/ObjC but not for C++ [-Wpragmas]
  ma_03_t.c:7:32: warning: option '-Wc++-compat' is valid for C/ObjC but not for C++ [-Wpragmas]
  def_t.c:7:32: warning: option '-Wc++-compat' is valid for C/ObjC but not for C++ [-Wpragmas]
  Socket.xs: In function 'void XS_Socket_inet_aton(CV*)':
  Socket.xs:778:28: warning: missing initializer for member 'addrinfo::ai_family' [-Wmissing-field-initializers]
  Socket.xs:778:28: warning: missing initializer for member 'addrinfo::ai_socktype' [-Wmissing-field-initializers]
  Socket.xs:778:28: warning: missing initializer for member 'addrinfo::ai_protocol' [-Wmissing-field-initializers]
  Socket.xs:778:28: warning: missing initializer for member 'addrinfo::ai_addrlen' [-Wmissing-field-initializers]
  Socket.xs:778:28: warning: missing initializer for member 'addrinfo::ai_canonname' [-Wmissing-field-initializers]
  Socket.xs:778:28: warning: missing initializer for member 'addrinfo::ai_addr' [-Wmissing-field-initializers]
  Socket.xs:778:28: warning: missing initializer for member 'addrinfo::ai_next' [-Wmissing-field-initializers]
  Socket.c: In function 'void XS_Socket_pack_ip_mreq_source(CV*)':
  Socket.c:1703:7: warning: variable 'interface' set but not used [-Wunused-but-set-variable]
  const-c.inc: In function 'int constant_19(const char*, IV*)':
  const-c.inc:351:42: warning: unused parameter 'iv_return' [-Wunused-parameter]
  HiRes.xs: In function 'void XS_Time__HiRes_setitimer(CV*)':
  HiRes.xs:1249:42: warning: option '-Wc++-compat' is valid for C/ObjC but not for C++ [-Wpragmas]
  HiRes.xs: In function 'void XS_Time__HiRes_getitimer(CV*)':
  HiRes.xs:1269:42: warning: option '-Wc++-compat' is valid for C/ObjC but not for C++ [-Wpragmas]
  Piece.xs: In function 'char* _strptime(const char*, const char*, tm*, int*)':
  Piece.xs:719:8: warning: 'len' may be used uninitialized in this function [-Wmaybe-uninitialized]
  re_exec.c: In function 'bool S_regtry(regmatch_info*, char**)':
  re_exec.c:7099:53: warning: 'fold_array' may be used uninitialized in this function [-Wmaybe-uninitialized]
  re_exec.c:7003:24: note: 'fold_array' was declared here
  re_exec.c:7105:35: warning: 'folder' may be used uninitialized in this function [-Wmaybe-uninitialized]
  re_exec.c:7002:23: note: 'folder' was declared here
  regexec.c: In function 'bool S_regtry(regmatch_info*, char**)':
  regexec.c:7099:53: warning: 'fold_array' may be used uninitialized in this function [-Wmaybe-uninitialized]
  regexec.c:7003:24: note: 'fold_array' was declared here
  regexec.c:7105:35: warning: 'folder' may be used uninitialized in this function [-Wmaybe-uninitialized]
  regexec.c:7002:23: note: 'folder' was declared here
  locale.c:1113:1: warning: 'const char* S_calculate_LC_ALL(PerlInterpreter*, const char**)' defined but not used [-Wunused-function]
  Socket.xs: In function 'void XS_Socket_inet_aton(PerlInterpreter*, CV*)':
  Socket.c: In function 'void XS_Socket_pack_ip_mreq_source(PerlInterpreter*, CV*)':
  const-c.inc: In function 'int constant_19(PerlInterpreter*, const char*, IV*)':
  HiRes.xs: In function 'void XS_Time__HiRes_setitimer(PerlInterpreter*, CV*)':
  HiRes.xs: In function 'void XS_Time__HiRes_getitimer(PerlInterpreter*, CV*)':
  Piece.xs: In function 'char* _strptime(PerlInterpreter*, const char*, const char*, tm*, int*)':
  re_exec.c: In function 'bool S_regtry(PerlInterpreter*, regmatch_info*, char**)':
  regexec.c: In function 'bool S_regtry(PerlInterpreter*, regmatch_info*, char**)':

About this smoke:
    smoking-perl: 5.30.2
  smoker-version: 1.71/0.046
       timestamp: 2022-06-21 16:31:13+00
          tester: core

-- 
Report generated by Test::Smoke::Gateway v0.09