Show logfile
Automated smoke report for branch blead 5.35.12 patch 300ff263fbad8007ca52d84a8be8b98fba791a3c v5.35.11-140-g300ff263fb
perl-sparc64-stable.home.hewus.com: SPARC-T4 (rev 0.0) @ 2847.862 MHz (2847 MHz) (sparc64/16 cpus)
    on        openbsd 7.0
    using     cc version 4.2.1 20070719 (*1)
    smoketime 1 day 15 hours 58 minutes (average 4 hours 59 minutes)

Summary: FAIL(F)

O = OK  F = Failure(s), extended report at the bottom
X = Failure(s) under TEST but not under harness
? = still running or test results not (yet) available
Build failures during:       - = unknown or N/A
c = Configure, m = make, M = make (after miniperl), t = make test-prep

v5.35.11-140-g300ff263fb
---------------------- ----------------------------------------------------
F  F  F  F  F  F         (*1)
F  F  F  F  F  F        -Duseithreads (*1)
F  F  F  F  F  F        -Acppflags=-DBIG_TIME -DNO_LOCALE_NUMERIC -DNO_LOCALE_COLLATE (*1)
F  F  F  F  F  F        -Acppflags=-DBIG_TIME -DNO_LOCALE_NUMERIC -DNO_LOCALE_COLLATE -Duseithreads (*1)
|  |  |  |  |  |
|  |  |  |  |  +------  locale:UTF-8 DEBUGGING
|  |  |  |  +---------  perlio DEBUGGING
|  |  |  +------------  stdio DEBUGGING
|  |  +---------------  locale:UTF-8
|  +------------------  perlio
+---------------------  stdio

Applied patches:

Skipped tests:
      # One test name on a line

Test failures:
~~ ../t/re/reg_mesg.t .......................................... FAILED No plan found in TAP output
  [stdio/perlio/locale:UTF-8] 
  [stdio/perlio/locale:UTF-8] -Acppflags=-DBIG_TIME -DNO_LOCALE_NUMERIC -DNO_LOCALE_COLLATE
  [stdio/perlio/locale:UTF-8]  DEBUGGING
  [stdio/perlio/locale:UTF-8] -Acppflags=-DBIG_TIME -DNO_LOCALE_NUMERIC -DNO_LOCALE_COLLATE DEBUGGING
  [stdio/perlio/locale:UTF-8] -Acppflags=-DBIG_TIME -DNO_LOCALE_NUMERIC -DNO_LOCALE_COLLATE -Duseithreads DEBUGGING
  [stdio/perlio/locale:UTF-8] -Acppflags=-DBIG_TIME -DNO_LOCALE_NUMERIC -DNO_LOCALE_COLLATE -Duseithreads
  [stdio/perlio/locale:UTF-8] -Duseithreads
  [stdio/perlio/locale:UTF-8] -Duseithreads DEBUGGING
~~ ../t/re/regex_sets.t ........................................ FAILED No plan found in TAP output
  [stdio/perlio/locale:UTF-8] 
  [stdio/perlio/locale:UTF-8]  DEBUGGING
  [stdio/perlio/locale:UTF-8] -Acppflags=-DBIG_TIME -DNO_LOCALE_NUMERIC -DNO_LOCALE_COLLATE
  [stdio/perlio/locale:UTF-8] -Acppflags=-DBIG_TIME -DNO_LOCALE_NUMERIC -DNO_LOCALE_COLLATE DEBUGGING
  [stdio/perlio/locale:UTF-8] -Acppflags=-DBIG_TIME -DNO_LOCALE_NUMERIC -DNO_LOCALE_COLLATE -Duseithreads DEBUGGING
  [stdio/perlio/locale:UTF-8] -Acppflags=-DBIG_TIME -DNO_LOCALE_NUMERIC -DNO_LOCALE_COLLATE -Duseithreads
  [stdio/perlio/locale:UTF-8] -Duseithreads DEBUGGING
  [stdio/perlio/locale:UTF-8] -Duseithreads
~~ ../t/porting/podcheck.t ..................................... FAILED 193-194
  [stdio/perlio/locale:UTF-8] -Acppflags=-DBIG_TIME -DNO_LOCALE_NUMERIC -DNO_LOCALE_COLLATE -Duseithreads
  [stdio/perlio/locale:UTF-8] -Duseithreads
  [stdio/perlio/locale:UTF-8] -Duseithreads DEBUGGING
  [stdio/perlio/locale:UTF-8] -Acppflags=-DBIG_TIME -DNO_LOCALE_NUMERIC -DNO_LOCALE_COLLATE -Duseithreads DEBUGGING
  [stdio/perlio/locale:UTF-8] -Acppflags=-DBIG_TIME -DNO_LOCALE_NUMERIC -DNO_LOCALE_COLLATE DEBUGGING
  [stdio/perlio/locale:UTF-8] -Acppflags=-DBIG_TIME -DNO_LOCALE_NUMERIC -DNO_LOCALE_COLLATE
  [perlio/locale:UTF-8]  DEBUGGING
  [stdio/perlio/locale:UTF-8] 
~~ ../t/re/regexp_qr_embed_thr.t ............................... FAILED No plan found in TAP output
  [locale:UTF-8] -Duseithreads
~~ ../t/porting/regen.t ........................................ FAILED 22 Non-zero exit status: 2 Bad plan.  You planned 42 tests but ran 22.
  [stdio] -Acppflags=-DBIG_TIME -DNO_LOCALE_NUMERIC -DNO_LOCALE_COLLATE -Duseithreads
  [stdio] -Duseithreads DEBUGGING
  [stdio] -Duseithreads
  [stdio] 
  [stdio] -Acppflags=-DBIG_TIME -DNO_LOCALE_NUMERIC -DNO_LOCALE_COLLATE
  [stdio]  DEBUGGING
  [stdio] -Acppflags=-DBIG_TIME -DNO_LOCALE_NUMERIC -DNO_LOCALE_COLLATE DEBUGGING
  [stdio] -Acppflags=-DBIG_TIME -DNO_LOCALE_NUMERIC -DNO_LOCALE_COLLATE -Duseithreads DEBUGGING
~~ ../t/porting/regen.t ........................................ FAILED 22 Non-zero exit status: 255 Bad plan.  You planned 42 tests but ran 22.
  [perlio/locale:UTF-8] -Acppflags=-DBIG_TIME -DNO_LOCALE_NUMERIC -DNO_LOCALE_COLLATE
  [perlio/locale:UTF-8]  DEBUGGING
  [perlio/locale:UTF-8] 
  [perlio/locale:UTF-8] -Acppflags=-DBIG_TIME -DNO_LOCALE_NUMERIC -DNO_LOCALE_COLLATE -Duseithreads DEBUGGING
  [perlio/locale:UTF-8] -Acppflags=-DBIG_TIME -DNO_LOCALE_NUMERIC -DNO_LOCALE_COLLATE DEBUGGING
  [perlio/locale:UTF-8] -Duseithreads DEBUGGING
  [perlio/locale:UTF-8] -Duseithreads
  [perlio/locale:UTF-8] -Acppflags=-DBIG_TIME -DNO_LOCALE_NUMERIC -DNO_LOCALE_COLLATE -Duseithreads

Test todo-passed:

MANIFEST messages:
  MANIFEST did not declare '.mailmap'

Compiler messages:

About this smoke:
    smoking-perl: 5.32.1
  smoker-version: 1.78/0.046
       timestamp: 2022-05-09 05:20:16+00
          tester: smoker

-- 
Report generated by Test::Smoke::Gateway v0.10