Automated smoke report for branch blead 5.35.12 patch 300ff263fbad8007ca52d84a8be8b98fba791a3c v5.35.11-140-g300ff263fb
githubtib: Intel(R) Xeon(R) Platinum 8171M CPU @ 2.60GHz (GenuineIntel 2095MHz) (x86_64/1[2 cores] cpus)
    on        linux 5.4.0-1077-azure [Ubuntu 18.04.5 LTS (bionic)]
    using     cc version 7.5.0 (*1)
    smoketime 38 minutes 32 seconds (average 38 minutes 32 seconds)

Summary: FAIL(F)

O = OK  F = Failure(s), extended report at the bottom
X = Failure(s) under TEST but not under harness
? = still running or test results not (yet) available
Build failures during:       - = unknown or N/A
c = Configure, m = make, M = make (after miniperl), t = make test-prep

v5.35.11-140-g300ff263fb
---------------------- ----------------------------------------------------
F  F  -  -               (*1)
|  |  |  |
|  |  |  +------------  perlio DEBUGGING
|  |  +---------------  stdio DEBUGGING
|  +------------------  perlio
+---------------------  stdio

Applied patches:

Skipped tests:
      # One test name on a line

Test failures:
~~ ../t/porting/regen.t ........................................ FAILED 22 Non-zero exit status: 255 Bad plan.  You planned 42 tests but ran 22.
  [perlio] 
~~ ../t/porting/podcheck.t ..................................... FAILED 193-194
  [perlio] 
~~ ../t/porting/regen.t ........................................ FAILED 22 Non-zero exit status: 22 Bad plan.  You planned 42 tests but ran 22.
  [stdio] 

Test todo-passed:

MANIFEST messages:
  MANIFEST did not declare '.mailmap'

Compiler messages:

About this smoke:
    smoking-perl: 5.26.1
  smoker-version: 1.78/0.046
       timestamp: 2022-05-09 02:56:33+00
          tester: tib

-- 
Report generated by Test::Smoke::Gateway v0.10