Show logfile
Automated smoke report for branch blead 5.35.12 patch 300ff263fbad8007ca52d84a8be8b98fba791a3c v5.35.11-140-g300ff26
sv02: Intel(R) Core(TM) i5 CPU 660 @ 3.33GHz (GenuineIntel 1199MHz) (x86_64/1[2 cores] cpus)
    on        linux 4.12.14-lp151.28.91-default [openSUSE Leap 15.1]
    using     ccache cc version 7.5.0 (*1)
    smoketime 4 hours 30 minutes (average 33 minutes 51 seconds)

Summary: FAIL(F)

O = OK  F = Failure(s), extended report at the bottom
X = Failure(s) under TEST but not under harness
? = still running or test results not (yet) available
Build failures during:       - = unknown or N/A
c = Configure, m = make, M = make (after miniperl), t = make test-prep

v5.35.11-140-g300ff26
---------------------- ----------------------------------------------------
F  F  F  F  F  F        -Duselongdouble (*1)
F  F  F  F  F  F        -Duse64bitall (*1)
F  F  F  F  F  F        -Duseithreads -Duselongdouble (*1)
F  F  F  F  F  F        -Duseithreads -Duse64bitall (*1)
|  |  |  |  |  |
|  |  |  |  |  +------  locale:en_US.utf8 DEBUGGING
|  |  |  |  +---------  perlio DEBUGGING
|  |  |  +------------  stdio DEBUGGING
|  |  +---------------  locale:en_US.utf8
|  +------------------  perlio
+---------------------  stdio

Applied patches:

Skipped tests:
  None

Test failures:
~~ ../t/porting/regen.t ........................................ FAILED 22 Non-zero exit status: 22 Bad plan.  You planned 42 tests but ran 22.
  [stdio] -Duseithreads -Duse64bitall DEBUGGING
  [stdio] -Duse64bitall DEBUGGING
  [stdio] -Duse64bitall
  [stdio] -Duseithreads -Duselongdouble
  [stdio] -Duselongdouble DEBUGGING
  [stdio] -Duseithreads -Duselongdouble DEBUGGING
  [stdio] -Duseithreads -Duse64bitall
  [stdio] -Duselongdouble
~~ ../t/porting/regen.t ........................................ FAILED 22 Non-zero exit status: 255 Bad plan.  You planned 42 tests but ran 22.
  [perlio/locale:en_US.utf8] -Duseithreads -Duselongdouble
  [perlio/locale:en_US.utf8] -Duse64bitall DEBUGGING
  [perlio/locale:en_US.utf8] -Duse64bitall
  [perlio/locale:en_US.utf8] -Duseithreads -Duse64bitall DEBUGGING
  [perlio/locale:en_US.utf8] -Duselongdouble
  [perlio/locale:en_US.utf8] -Duseithreads -Duse64bitall
  [perlio/locale:en_US.utf8] -Duselongdouble DEBUGGING
  [perlio/locale:en_US.utf8] -Duseithreads -Duselongdouble DEBUGGING
~~ ../t/porting/podcheck.t ..................................... FAILED 193-194
  [stdio/perlio/locale:en_US.utf8] -Duselongdouble DEBUGGING
  [stdio/perlio/locale:en_US.utf8] -Duseithreads -Duselongdouble DEBUGGING
  [perlio/locale:en_US.utf8] -Duselongdouble
  [stdio/perlio/locale:en_US.utf8] -Duseithreads -Duse64bitall
  [stdio/perlio/locale:en_US.utf8] -Duse64bitall
  [stdio/perlio/locale:en_US.utf8] -Duse64bitall DEBUGGING
  [stdio/perlio/locale:en_US.utf8] -Duseithreads -Duse64bitall DEBUGGING
  [stdio/perlio/locale:en_US.utf8] -Duseithreads -Duselongdouble

Test todo-passed:

MANIFEST messages:
  MANIFEST did not declare '.mailmap'

Compiler messages:

About this smoke:
    smoking-perl: 5.28.0
  smoker-version: 1.79/0.046
       timestamp: 2022-05-08 20:05:06+00
          tester: merijn

Status overview available here: https://tux.nl/perl5/smoke/
-- 
Report generated by Test::Smoke::Gateway v0.10