Show logfile
Automated smoke report for branch blead 5.35.12 patch 300ff263fbad8007ca52d84a8be8b98fba791a3c v5.35.11-140-g300ff263fb
abeltjepi: ARMv7 Processor rev 3 (v7l) (300 MHz) (armv7l/4 cpus)
    on        linux 5.10.63-v7l+ [Raspbian GNU/Linux 10.11 (buster)]
    using     cc version 8.3.0 (*1)
    smoketime 4 hours 50 minutes (average 2 hours 25 minutes)

Summary: FAIL(F)

O = OK  F = Failure(s), extended report at the bottom
X = Failure(s) under TEST but not under harness
? = still running or test results not (yet) available
Build failures during:       - = unknown or N/A
c = Configure, m = make, M = make (after miniperl), t = make test-prep

v5.35.11-140-g300ff263fb
---------------------- ----------------------------------------------------
F  F  F  F  F  F         (*1)
|  |  |  |  |  |
|  |  |  |  |  +------  locale:en_US.utf8 DEBUGGING
|  |  |  |  +---------  perlio DEBUGGING
|  |  |  +------------  stdio DEBUGGING
|  |  +---------------  locale:en_US.utf8
|  +------------------  perlio
+---------------------  stdio

Applied patches:

Skipped tests:
  None

Test failures:
~~ ../t/porting/podcheck.t ..................................... FAILED 193-194
  [perlio/locale:en_US.utf8] 
  [stdio/perlio/locale:en_US.utf8]  DEBUGGING
~~ ../t/porting/regen.t ........................................ FAILED 22 Non-zero exit status: 22 Bad plan.  You planned 42 tests but ran 22.
  [stdio] 
  [stdio]  DEBUGGING
~~ ../t/porting/regen.t ........................................ FAILED 22 Non-zero exit status: 255 Bad plan.  You planned 42 tests but ran 22.
  [perlio/locale:en_US.utf8]  DEBUGGING
  [perlio/locale:en_US.utf8] 

Test todo-passed:

MANIFEST messages:
  MANIFEST did not declare '.mailmap'

Compiler messages:

About this smoke:
    smoking-perl: 5.28.1
  smoker-version: 1.77/0.046
       timestamp: 2022-05-08 18:47:06+00
          tester: pi

Check: https://perl5.test-smoke.org
-- 
Report generated by Test::Smoke::Gateway v0.10