Show logfile
Automated smoke report for branch blead 5.35.12 patch 300ff263fbad8007ca52d84a8be8b98fba791a3c v5.35.11-140-g300ff26
lx02: Intel(R) Xeon(R) CPU E5-2620 0 @ 2.00GHz (GenuineIntel 2447MHz) (x86_64/1[12 cores] cpus)
    on        linux 3.10.0-1160.31.1.el7.x86_64 [CentOS Linux 7.9.2009 (Core)]
    using     ccache cc version 4.8.5 20150623 (Red Hat 4.8.5-44) (*1)
    smoketime 2 hours 57 minutes (average 22 minutes 11 seconds)

Summary: FAIL(F)

O = OK  F = Failure(s), extended report at the bottom
X = Failure(s) under TEST but not under harness
? = still running or test results not (yet) available
Build failures during:       - = unknown or N/A
c = Configure, m = make, M = make (after miniperl), t = make test-prep

v5.35.11-140-g300ff26
---------------------- ----------------------------------------------------
F  F  F  F  F  F         (*1)
F  F  F  F  F  F        -Duse64bitall -Duselongdouble (*1)
F  F  F  F  F  F        -Duseithreads (*1)
F  F  F  F  F  F        -Duseithreads -Duse64bitall -Duselongdouble (*1)
|  |  |  |  |  |
|  |  |  |  |  +------  locale:en_US.utf8 DEBUGGING
|  |  |  |  +---------  perlio DEBUGGING
|  |  |  +------------  stdio DEBUGGING
|  |  +---------------  locale:en_US.utf8
|  +------------------  perlio
+---------------------  stdio

Applied patches:

Skipped tests:
  None

Test failures:
~~ ../t/porting/podcheck.t ..................................... FAILED 193-194
  [stdio/perlio/locale:en_US.utf8] -Duse64bitall -Duselongdouble
  [perlio/locale:en_US.utf8] 
  [stdio/perlio/locale:en_US.utf8]  DEBUGGING
  [stdio/perlio/locale:en_US.utf8] -Duse64bitall -Duselongdouble DEBUGGING
  [stdio/perlio/locale:en_US.utf8] -Duseithreads -Duse64bitall -Duselongdouble DEBUGGING
  [stdio/perlio/locale:en_US.utf8] -Duseithreads -Duse64bitall -Duselongdouble
  [stdio/perlio/locale:en_US.utf8] -Duseithreads DEBUGGING
  [stdio/perlio/locale:en_US.utf8] -Duseithreads
~~ ../t/porting/regen.t ........................................ FAILED 22 Non-zero exit status: 2 Bad plan.  You planned 42 tests but ran 22.
  [stdio] -Duse64bitall -Duselongdouble
  [stdio] 
  [stdio]  DEBUGGING
  [stdio] -Duse64bitall -Duselongdouble DEBUGGING
  [stdio] -Duseithreads -Duse64bitall -Duselongdouble DEBUGGING
  [stdio] -Duseithreads -Duse64bitall -Duselongdouble
  [stdio] -Duseithreads
  [stdio] -Duseithreads DEBUGGING
~~ ../t/porting/regen.t ........................................ FAILED 22 Non-zero exit status: 255 Bad plan.  You planned 42 tests but ran 22.
  [perlio/locale:en_US.utf8] -Duseithreads -Duse64bitall -Duselongdouble
  [perlio/locale:en_US.utf8] -Duseithreads DEBUGGING
  [perlio/locale:en_US.utf8] -Duseithreads
  [perlio/locale:en_US.utf8] -Duseithreads -Duse64bitall -Duselongdouble DEBUGGING
  [perlio/locale:en_US.utf8]  DEBUGGING
  [perlio/locale:en_US.utf8] -Duse64bitall -Duselongdouble DEBUGGING
  [perlio/locale:en_US.utf8] 
  [perlio/locale:en_US.utf8] -Duse64bitall -Duselongdouble

Test todo-passed:

MANIFEST messages:
  MANIFEST did not declare '.mailmap'

Compiler messages:

About this smoke:
    smoking-perl: 5.32.1
  smoker-version: 1.79/0.046
       timestamp: 2022-05-08 20:05:09+00
          tester: merijn

Status overview available here: https://tux.nl/perl5/smoke/
-- 
Report generated by Test::Smoke::Gateway v0.10