Show logfile
Automated smoke report for branch blead 5.35.12 patch 62f3b341abe5afee086f3dce28acffd9fd436164 v5.35.11-122-g62f3b34
lx09: Intel(R) Core(TM) i7-6820HQ CPU @ 2.70GHz (GenuineIntel 2700MHz) (x86_64/1[8 cores] cpus)
    on        linux 5.17.4-1-default [openSUSE Tumbleweed 20220506]
    using     cc version 11.2.1 20220420 [revision 691af15031e00227ba6d5935c1d737026cda4129] (*1)
    smoketime 2 hours 22 minutes (average 17 minutes 50 seconds)

Summary: FAIL(F)

O = OK  F = Failure(s), extended report at the bottom
X = Failure(s) under TEST but not under harness
? = still running or test results not (yet) available
Build failures during:       - = unknown or N/A
c = Configure, m = make, M = make (after miniperl), t = make test-prep

v5.35.11-122-g62f3b34
---------------------- ----------------------------------------------------
F  F  F  F  F  F         (*1)
F  F  F  F  F  F        -Duse64bitall -Dusequadmath (*1)
F  F  F  F  F  F        -Duseithreads (*1)
F  F  F  F  F  F        -Duseithreads -Duse64bitall -Dusequadmath (*1)
|  |  |  |  |  |
|  |  |  |  |  +------  locale:en_US.utf8 DEBUGGING
|  |  |  |  +---------  perlio DEBUGGING
|  |  |  +------------  stdio DEBUGGING
|  |  +---------------  locale:en_US.utf8
|  +------------------  perlio
+---------------------  stdio

Applied patches:

Skipped tests:
  None

Test failures:
~~ ../cpan/IO-Compress/t/cz-06gzsetp.t ......................... FAILED 1 Non-zero exit status: 1
  [stdio/perlio/locale:en_US.utf8] -Duseithreads -Duse64bitall -Dusequadmath
  [stdio/perlio/locale:en_US.utf8] -Duseithreads -Duse64bitall -Dusequadmath DEBUGGING
  [stdio/perlio/locale:en_US.utf8]  DEBUGGING
  [stdio/perlio/locale:en_US.utf8] 
  [stdio/perlio/locale:en_US.utf8] -Duse64bitall -Dusequadmath DEBUGGING
  [stdio/perlio/locale:en_US.utf8] -Duseithreads
  [stdio/perlio/locale:en_US.utf8] -Duseithreads DEBUGGING
  [stdio/perlio/locale:en_US.utf8] -Duse64bitall -Dusequadmath
~~ ../cpan/Compress-Raw-Zlib/t/01version.t ..................... FAILED 2 Non-zero exit status: 1
  [stdio/perlio/locale:en_US.utf8] 
  [stdio/perlio/locale:en_US.utf8] -Duseithreads -Duse64bitall -Dusequadmath DEBUGGING
  [stdio/perlio/locale:en_US.utf8]  DEBUGGING
  [stdio/perlio/locale:en_US.utf8] -Duseithreads -Duse64bitall -Dusequadmath
  [stdio/perlio/locale:en_US.utf8] -Duse64bitall -Dusequadmath
  [stdio/perlio/locale:en_US.utf8] -Duseithreads DEBUGGING
  [stdio/perlio/locale:en_US.utf8] -Duseithreads
  [stdio/perlio/locale:en_US.utf8] -Duse64bitall -Dusequadmath DEBUGGING
~~ ../cpan/Compress-Raw-Zlib/t/19nonpv.t ....................... FAILED 2 Non-zero exit status: 1
  [stdio/perlio/locale:en_US.utf8] 
  [stdio/perlio/locale:en_US.utf8]  DEBUGGING
  [stdio/perlio/locale:en_US.utf8] -Duseithreads -Duse64bitall -Dusequadmath DEBUGGING
  [stdio/perlio/locale:en_US.utf8] -Duseithreads -Duse64bitall -Dusequadmath
  [stdio/perlio/locale:en_US.utf8] -Duseithreads
  [stdio/perlio/locale:en_US.utf8] -Duseithreads DEBUGGING
  [stdio/perlio/locale:en_US.utf8] -Duse64bitall -Dusequadmath
  [stdio/perlio/locale:en_US.utf8] -Duse64bitall -Dusequadmath DEBUGGING
~~ ../cpan/Compress-Raw-Zlib/t/02zlib.t ........................ FAILED 2 126 134 Non-zero exit status: 3
  [stdio/perlio/locale:en_US.utf8] -Duseithreads
  [stdio/perlio/locale:en_US.utf8] -Duseithreads DEBUGGING
  [stdio/perlio/locale:en_US.utf8] -Duse64bitall -Dusequadmath
  [stdio/perlio/locale:en_US.utf8] -Duse64bitall -Dusequadmath DEBUGGING
  [stdio/perlio/locale:en_US.utf8] -Duseithreads -Duse64bitall -Dusequadmath DEBUGGING
  [stdio/perlio/locale:en_US.utf8]  DEBUGGING
  [stdio/perlio/locale:en_US.utf8] 
  [stdio/perlio/locale:en_US.utf8] -Duseithreads -Duse64bitall -Dusequadmath
~~ ../cpan/IO-Compress/t/cz-01version.t ........................ FAILED 2 Non-zero exit status: 1
  [stdio/perlio/locale:en_US.utf8] -Duseithreads DEBUGGING
  [stdio/perlio/locale:en_US.utf8] -Duseithreads
  [stdio/perlio/locale:en_US.utf8] -Duse64bitall -Dusequadmath
  [stdio/perlio/locale:en_US.utf8] -Duse64bitall -Dusequadmath DEBUGGING
  [stdio/perlio/locale:en_US.utf8] 
  [stdio/perlio/locale:en_US.utf8]  DEBUGGING
  [stdio/perlio/locale:en_US.utf8] -Duseithreads -Duse64bitall -Dusequadmath DEBUGGING
  [stdio/perlio/locale:en_US.utf8] -Duseithreads -Duse64bitall -Dusequadmath
~~ ../cpan/IO-Compress/t/cz-03zlib-v1.t ........................ FAILED 4 196 Non-zero exit status: 2
  [stdio/perlio/locale:en_US.utf8] 
  [stdio/perlio/locale:en_US.utf8] -Duseithreads -Duse64bitall -Dusequadmath DEBUGGING
  [stdio/perlio/locale:en_US.utf8]  DEBUGGING
  [stdio/perlio/locale:en_US.utf8] -Duseithreads -Duse64bitall -Dusequadmath
  [stdio/perlio/locale:en_US.utf8] -Duseithreads DEBUGGING
  [stdio/perlio/locale:en_US.utf8] -Duseithreads
  [stdio/perlio/locale:en_US.utf8] -Duse64bitall -Dusequadmath
  [stdio/perlio/locale:en_US.utf8] -Duse64bitall -Dusequadmath DEBUGGING
~~ ../cpan/IO-Compress/t/cz-14gzopen.t ......................... FAILED 3 Non-zero exit status: 1
  [stdio/perlio/locale:en_US.utf8] -Duse64bitall -Dusequadmath
  [stdio/perlio/locale:en_US.utf8] -Duseithreads
  [stdio/perlio/locale:en_US.utf8] -Duseithreads DEBUGGING
  [stdio/perlio/locale:en_US.utf8] -Duse64bitall -Dusequadmath DEBUGGING
  [stdio/perlio/locale:en_US.utf8] 
  [stdio/perlio/locale:en_US.utf8]  DEBUGGING
  [stdio/perlio/locale:en_US.utf8] -Duseithreads -Duse64bitall -Dusequadmath DEBUGGING
  [stdio/perlio/locale:en_US.utf8] -Duseithreads -Duse64bitall -Dusequadmath
~~ ../cpan/IO-Compress/t/cz-08encoding.t ....................... FAILED 2 Non-zero exit status: 1
  [stdio/perlio/locale:en_US.utf8] 
  [stdio/perlio/locale:en_US.utf8] -Duseithreads -Duse64bitall -Dusequadmath DEBUGGING
  [stdio/perlio/locale:en_US.utf8]  DEBUGGING
  [stdio/perlio/locale:en_US.utf8] -Duseithreads -Duse64bitall -Dusequadmath
  [stdio/perlio/locale:en_US.utf8] -Duse64bitall -Dusequadmath
  [stdio/perlio/locale:en_US.utf8] -Duseithreads
  [stdio/perlio/locale:en_US.utf8] -Duseithreads DEBUGGING
  [stdio/perlio/locale:en_US.utf8] -Duse64bitall -Dusequadmath DEBUGGING
~~ ../cpan/Compress-Raw-Zlib/t/18lvalue.t ...................... FAILED 2 Non-zero exit status: 1
  [stdio/perlio/locale:en_US.utf8] -Duseithreads -Duse64bitall -Dusequadmath DEBUGGING
  [stdio/perlio/locale:en_US.utf8]  DEBUGGING
  [stdio/perlio/locale:en_US.utf8] 
  [stdio/perlio/locale:en_US.utf8] -Duseithreads -Duse64bitall -Dusequadmath
  [stdio/perlio/locale:en_US.utf8] -Duseithreads DEBUGGING
  [stdio/perlio/locale:en_US.utf8] -Duseithreads
  [stdio/perlio/locale:en_US.utf8] -Duse64bitall -Dusequadmath
  [stdio/perlio/locale:en_US.utf8] -Duse64bitall -Dusequadmath DEBUGGING

Test todo-passed:

MANIFEST messages:
  MANIFEST did not declare '.mailmap'

Compiler messages:
  makefile:258: warning: ignoring prerequisites on suffix rule definition
  makefile:254: warning: ignoring prerequisites on suffix rule definition

About this smoke:
    smoking-perl: 5.34.0
  smoker-version: 1.79/0.046
       timestamp: 2022-05-08 09:33:18+00
          tester: merijn

Status overview available here: https://tux.nl/perl5/smoke/
-- 
Report generated by Test::Smoke::Gateway v0.10