Show logfile
Automated smoke report for branch blead 5.35.11 patch f5469426bb7bc14a72843f9855d2494b01f8df0f v5.35.10-102-gf5469426bb
cjg-impish: Intel(R) Xeon(R) CPU E5-2620 v2 @ 2.10GHz (GenuineIntel 2065MHz) (x86_64/1 cpus)
    on        linux 5.13.0-39-generic [Ubuntu 21.10 (impish)]
    using     g++ version 11.2.0 (*1)
    smoketime 7 hours 26 minutes (average 37 minutes 11 seconds)

Summary: FAIL(F)

O = OK  F = Failure(s), extended report at the bottom
X = Failure(s) under TEST but not under harness
? = still running or test results not (yet) available
Build failures during:       - = unknown or N/A
c = Configure, m = make, M = make (after miniperl), t = make test-prep

v5.35.10-102-gf5469426bb
---------------------- ----------------------------------------------------
O  O                    -Dcc=g++ (*1)
F  F                    -Dcc=g++ -Duse64bitall (*1)
O  O                    -Dcc=g++ -Dusequadmath (*1)
F  O                    -Dcc=g++ -Duseithreads (*1)
F  F                    -Dcc=g++ -Duseithreads -Duse64bitall (*1)
O  O                    -Dcc=g++ -Duseithreads -Dusequadmath (*1)
|  |
|  +------------------  stdio DEBUGGING
+---------------------  stdio

Applied patches:

Skipped tests:
      # One test name on a line

Test failures:
~~ ../cpan/ExtUtils-MakeMaker/t/eu_command.t ................... FAILED 8 Non-zero exit status: 1
  [stdio] -Dcc=g++ -Duseithreads
  [stdio] -Dcc=g++ -Duseithreads -Duse64bitall DEBUGGING
~~ ../dist/Time-HiRes/t/usleep.t ............................... FAILED 6 Non-zero exit status: 1
  [stdio] -Dcc=g++ -Duse64bitall
  [stdio] -Dcc=g++ -Duseithreads -Duse64bitall
~~ ../dist/IO/t/io_poll.t ...................................... FAILED 12
  [stdio] -Dcc=g++ -Duse64bitall DEBUGGING
~~ ../dist/Time-HiRes/t/alarm.t ................................ FAILED 2 Non-zero exit status: 1
  [stdio] -Dcc=g++ -Duseithreads -Duse64bitall DEBUGGING

Test todo-passed:

MANIFEST messages:
  MANIFEST did not declare '.mailmap'

Compiler messages:
  awk: cmd. line:1: warning: regexp escape sequence `\=' is not a known regexp operator
  Makefile:258: warning: ignoring prerequisites on suffix rule definition
  Makefile:254: warning: ignoring prerequisites on suffix rule definition
  makefile:258: warning: ignoring prerequisites on suffix rule definition
  makefile:254: warning: ignoring prerequisites on suffix rule definition
  builtin.c:400:1: warning: missing initializer for member 'BuiltinFuncDescriptor::xsub' [-Wmissing-field-initializers]
  builtin.c:400:1: warning: missing initializer for member 'BuiltinFuncDescriptor::checker' [-Wmissing-field-initializers]
  builtin.c:400:1: warning: missing initializer for member 'BuiltinFuncDescriptor::ckval' [-Wmissing-field-initializers]
  compress.c: In function 'void generateMTFValues(EState*)':
  compress.c:190:29: warning: ISO C++17 does not allow 'register' storage class specifier [-Wregister]
  compress.c:191:29: warning: ISO C++17 does not allow 'register' storage class specifier [-Wregister]
  compress.c:192:29: warning: ISO C++17 does not allow 'register' storage class specifier [-Wregister]
  compress.c:198:31: warning: ISO C++17 does not allow 'register' storage class specifier [-Wregister]
  compress.c: In function 'void sendMTFValues(EState*)':
  compress.c:361:29: warning: ISO C++17 does not allow 'register' storage class specifier [-Wregister]
  compress.c:361:37: warning: ISO C++17 does not allow 'register' storage class specifier [-Wregister]
  compress.c:361:45: warning: ISO C++17 does not allow 'register' storage class specifier [-Wregister]
  compress.c:362:29: warning: ISO C++17 does not allow 'register' storage class specifier [-Wregister]
  deflate.c: In function 'uInt longest_match(deflate_state*, IPos)':
  deflate.c:1280:21: warning: ISO C++17 does not allow 'register' storage class specifier [-Wregister]
  deflate.c:1281:21: warning: ISO C++17 does not allow 'register' storage class specifier [-Wregister]
  deflate.c:1282:18: warning: ISO C++17 does not allow 'register' storage class specifier [-Wregister]
  deflate.c:1301:21: warning: ISO C++17 does not allow 'register' storage class specifier [-Wregister]
  deflate.c:1302:19: warning: ISO C++17 does not allow 'register' storage class specifier [-Wregister]
  deflate.c:1303:19: warning: ISO C++17 does not allow 'register' storage class specifier [-Wregister]
  trees.c: In function 'unsigned int bi_reverse(unsigned int, int)':
  trees.c:1143:23: warning: ISO C++17 does not allow 'register' storage class specifier [-Wregister]
  MD5.xs: In function 'MD5_CTX* get_md5_ctx(SV*)':
  MD5.xs:470:34: warning: type qualifiers ignored on cast result type [-Wignored-qualifiers]
  MD5.xs: In function 'SV* new_md5_ctx(MD5_CTX*, const char*)':
  MD5.xs:492:47: warning: type qualifiers ignored on cast result type [-Wignored-qualifiers]
  ../../embed.h:635:70: note: in definition of macro 'sv_magicext'
  byte_t.c:7:32: warning: option '-Wc++-compat' is valid for C/ObjC but not for C++ [-Wpragmas]
  cp_00_t.c:7:32: warning: option '-Wc++-compat' is valid for C/ObjC but not for C++ [-Wpragmas]
  eu_01_t.c:7:32: warning: option '-Wc++-compat' is valid for C/ObjC but not for C++ [-Wpragmas]
  gb_02_t.c:7:32: warning: option '-Wc++-compat' is valid for C/ObjC but not for C++ [-Wpragmas]
  gb_03_t.c:7:32: warning: option '-Wc++-compat' is valid for C/ObjC but not for C++ [-Wpragmas]
  ir_04_t.c:7:32: warning: option '-Wc++-compat' is valid for C/ObjC but not for C++ [-Wpragmas]
  ma_05_t.c:7:32: warning: option '-Wc++-compat' is valid for C/ObjC but not for C++ [-Wpragmas]
  ebcdic_t.c:7:32: warning: option '-Wc++-compat' is valid for C/ObjC but not for C++ [-Wpragmas]
  ji_02_t.c:7:32: warning: option '-Wc++-compat' is valid for C/ObjC but not for C++ [-Wpragmas]
  ji_03_t.c:7:32: warning: option '-Wc++-compat' is valid for C/ObjC but not for C++ [-Wpragmas]
  ji_04_t.c:7:32: warning: option '-Wc++-compat' is valid for C/ObjC but not for C++ [-Wpragmas]
  sh_06_t.c:7:32: warning: option '-Wc++-compat' is valid for C/ObjC but not for C++ [-Wpragmas]
  jo_02_t.c:7:32: warning: option '-Wc++-compat' is valid for C/ObjC but not for C++ [-Wpragmas]
  ks_03_t.c:7:32: warning: option '-Wc++-compat' is valid for C/ObjC but not for C++ [-Wpragmas]
  ma_04_t.c:7:32: warning: option '-Wc++-compat' is valid for C/ObjC but not for C++ [-Wpragmas]
  symbol_t.c:7:32: warning: option '-Wc++-compat' is valid for C/ObjC but not for C++ [-Wpragmas]
  bi_00_t.c:7:32: warning: option '-Wc++-compat' is valid for C/ObjC but not for C++ [-Wpragmas]
  bi_01_t.c:7:32: warning: option '-Wc++-compat' is valid for C/ObjC but not for C++ [-Wpragmas]
  cp_02_t.c:7:32: warning: option '-Wc++-compat' is valid for C/ObjC but not for C++ [-Wpragmas]
  ma_03_t.c:7:32: warning: option '-Wc++-compat' is valid for C/ObjC but not for C++ [-Wpragmas]
  def_t.c:7:32: warning: option '-Wc++-compat' is valid for C/ObjC but not for C++ [-Wpragmas]
  Base64.xs: In function 'void XS_MIME__Base64_decode_base64(CV*)':
  Base64.xs:183:33: warning: ISO C++17 does not allow 'register' storage class specifier [-Wregister]
  Base64.xs: In function 'void XS_MIME__Base64_decoded_base64_length(CV*)':
  Base64.xs:279:33: warning: ISO C++17 does not allow 'register' storage class specifier [-Wregister]
  Socket.xs: In function 'void XS_Socket_inet_aton(CV*)':
  Socket.xs:773:35: warning: missing initializer for member 'addrinfo::ai_family' [-Wmissing-field-initializers]
  Socket.xs:773:35: warning: missing initializer for member 'addrinfo::ai_socktype' [-Wmissing-field-initializers]
  Socket.xs:773:35: warning: missing initializer for member 'addrinfo::ai_protocol' [-Wmissing-field-initializers]
  Socket.xs:773:35: warning: missing initializer for member 'addrinfo::ai_addrlen' [-Wmissing-field-initializers]
  Socket.xs:773:35: warning: missing initializer for member 'addrinfo::ai_addr' [-Wmissing-field-initializers]
  Socket.xs:773:35: warning: missing initializer for member 'addrinfo::ai_canonname' [-Wmissing-field-initializers]
  Socket.xs:773:35: warning: missing initializer for member 'addrinfo::ai_next' [-Wmissing-field-initializers]
  HiRes.xs: In function 'void XS_Time__HiRes_setitimer(CV*)':
  ../../perl.h:570:30: warning: option '-Wc++-compat' is valid for C/ObjC but not for C++ [-Wpragmas]
  ../../perl.h:573:30: note: in expansion of macro 'GCC_DIAG_PRAGMA'
  ../../perl.h:581:33: note: in expansion of macro 'GCC_DIAG_IGNORE'
  HiRes.xs:1248:9: note: in expansion of macro 'GCC_DIAG_IGNORE_STMT'
  HiRes.xs: In function 'void XS_Time__HiRes_getitimer(CV*)':
  HiRes.xs:1268:9: note: in expansion of macro 'GCC_DIAG_IGNORE_STMT'
  MD5.xs: In function 'MD5_CTX* get_md5_ctx(PerlInterpreter*, SV*)':
  MD5.xs: In function 'SV* new_md5_ctx(PerlInterpreter*, MD5_CTX*, const char*)':
  Base64.xs: In function 'void XS_MIME__Base64_decode_base64(PerlInterpreter*, CV*)':
  Base64.xs: In function 'void XS_MIME__Base64_decoded_base64_length(PerlInterpreter*, CV*)':
  Socket.xs: In function 'void XS_Socket_inet_aton(PerlInterpreter*, CV*)':
  HiRes.xs: In function 'void XS_Time__HiRes_setitimer(PerlInterpreter*, CV*)':
  HiRes.xs: In function 'void XS_Time__HiRes_getitimer(PerlInterpreter*, CV*)':

About this smoke:
    smoking-perl: 5.30.2
  smoker-version: 1.71/0.046
       timestamp: 2022-04-15 02:04:58+00
          tester: core

-- 
Report generated by Test::Smoke::Gateway v0.10