Show logfile
Automated smoke report for branch blead 5.35.11 patch 05f622047dbee5058a27b2a9674a3081ffc0292f v5.35.10-21-g05f622047d
cjg-netbsd8: Intel 686-class (amd64/1 cpus)
    on        netbsd 8.2
    using     g++ version 5.5.0 (*1)
    smoketime 5 hours 32 minutes (average 41 minutes 37 seconds)

Summary: FAIL(F)

O = OK  F = Failure(s), extended report at the bottom
X = Failure(s) under TEST but not under harness
? = still running or test results not (yet) available
Build failures during:       - = unknown or N/A
c = Configure, m = make, M = make (after miniperl), t = make test-prep

v5.35.10-21-g05f622047d
---------------------- ----------------------------------------------------
F  F                    -Dcc=g++ (*1)
F  F                    -Dcc=g++ -Duse64bitall (*1)
F  F                    -Dcc=g++ -Duseithreads (*1)
F  F                    -Dcc=g++ -Duseithreads -Duse64bitall (*1)
|  |
|  +------------------  stdio DEBUGGING
+---------------------  stdio

Applied patches:

Skipped tests:
      # One test name on a line

Test failures:
~~ ../t/porting/cmp_version.t .................................. FAILED 2
  [stdio] -Dcc=g++ -Duse64bitall
  [stdio] -Dcc=g++ -Duseithreads -Duse64bitall DEBUGGING
  [stdio] -Dcc=g++ DEBUGGING
  [stdio] -Dcc=g++ -Duseithreads
  [stdio] -Dcc=g++
  [stdio] -Dcc=g++ -Duse64bitall DEBUGGING
  [stdio] -Dcc=g++ -Duseithreads DEBUGGING
  [stdio] -Dcc=g++ -Duseithreads -Duse64bitall

Test todo-passed:

MANIFEST messages:
  MANIFEST did not declare '.mailmap'

Compiler messages:
  builtin.c:365:1: warning: missing initializer for member 'BuiltinFuncDescriptor::xsub' [-Wmissing-field-initializers]
  builtin.c:365:1: warning: missing initializer for member 'BuiltinFuncDescriptor::checker' [-Wmissing-field-initializers]
  builtin.c:365:1: warning: missing initializer for member 'BuiltinFuncDescriptor::ckval' [-Wmissing-field-initializers]
  /usr/include/sys/cdefs_elf.h:67:20: error: missing binary operator before token "("
  /usr/include/sys/cdefs_elf.h:73:20: error: missing binary operator before token "("
  /usr/include/sys/cdefs_elf.h:79:20: error: missing binary operator before token "("
  Socket.xs: In function 'void XS_Socket_inet_aton(CV*)':
  Socket.xs:773:28: warning: missing initializer for member 'addrinfo::ai_family' [-Wmissing-field-initializers]
  Socket.xs:773:28: warning: missing initializer for member 'addrinfo::ai_socktype' [-Wmissing-field-initializers]
  Socket.xs:773:28: warning: missing initializer for member 'addrinfo::ai_protocol' [-Wmissing-field-initializers]
  Socket.xs:773:28: warning: missing initializer for member 'addrinfo::ai_addrlen' [-Wmissing-field-initializers]
  Socket.xs:773:28: warning: missing initializer for member 'addrinfo::ai_canonname' [-Wmissing-field-initializers]
  Socket.xs:773:28: warning: missing initializer for member 'addrinfo::ai_addr' [-Wmissing-field-initializers]
  Socket.xs:773:28: warning: missing initializer for member 'addrinfo::ai_next' [-Wmissing-field-initializers]
  Socket.c: In function 'void XS_Socket_pack_ip_mreq_source(CV*)':
  Socket.c:1698:7: warning: variable 'interface' set but not used [-Wunused-but-set-variable]
  const-c.inc:351:42: warning: unused parameter 'iv_return' [-Wunused-parameter]
  re_exec.c: In function 'bool S_regtry(regmatch_info*, char**)':
  re_exec.c:7070:53: warning: 'fold_array' may be used uninitialized in this function [-Wmaybe-uninitialized]
  re_exec.c:6974:24: note: 'fold_array' was declared here
  re_exec.c:7076:35: warning: 'folder' may be used uninitialized in this function [-Wmaybe-uninitialized]
  re_exec.c:6973:23: note: 'folder' was declared here
  util.c: In function 'I32 Perl_xs_handshake(U32, void*, const char*, ...)':
  util.c:5765:36: warning: comparison is always true due to limited range of data type [-Wtype-limits]
  regexec.c: In function 'bool S_regtry(regmatch_info*, char**)':
  regexec.c:7070:53: warning: 'fold_array' may be used uninitialized in this function [-Wmaybe-uninitialized]
  regexec.c:6974:24: note: 'fold_array' was declared here
  regexec.c:7076:35: warning: 'folder' may be used uninitialized in this function [-Wmaybe-uninitialized]
  regexec.c:6973:23: note: 'folder' was declared here
  Socket.xs: In function 'void XS_Socket_inet_aton(PerlInterpreter*, CV*)':
  Socket.c: In function 'void XS_Socket_pack_ip_mreq_source(PerlInterpreter*, CV*)':
  re_exec.c: In function 'bool S_regtry(PerlInterpreter*, regmatch_info*, char**)':
  regexec.c: In function 'bool S_regtry(PerlInterpreter*, regmatch_info*, char**)':

About this smoke:
    smoking-perl: 5.26.1
  smoker-version: 1.71/0.046
       timestamp: 2022-03-27 11:22:15+00
          tester: core

-- 
Report generated by Test::Smoke::Gateway v0.10