Show logfile
Automated smoke report for branch blead 5.35.11 patch 0f7529f0ca9df6069f41f1b9bfacac94db2c7bed v5.35.10-14-g0f7529f0ca
cjg-omniosce: i86pc (2078MHz) (i386/1 cpus)
    on        Solaris 2.11
    using     g++ version 10.3.0 (*1)
    smoketime 9 hours 24 minutes (average 47 minutes)

Summary: FAIL(F)

O = OK  F = Failure(s), extended report at the bottom
X = Failure(s) under TEST but not under harness
? = still running or test results not (yet) available
Build failures during:       - = unknown or N/A
c = Configure, m = make, M = make (after miniperl), t = make test-prep

v5.35.10-14-g0f7529f0ca
---------------------- ----------------------------------------------------
F  F                    -Dcc=g++ (*1)
F  F                    -Dcc=g++ -Duse64bitall (*1)
F  F                    -Dcc=g++ -Duselongdouble (*1)
F  F                    -Dcc=g++ -Duseithreads (*1)
F  F                    -Dcc=g++ -Duseithreads -Duse64bitall (*1)
F  F                    -Dcc=g++ -Duseithreads -Duselongdouble (*1)
|  |
|  +------------------  stdio DEBUGGING
+---------------------  stdio

Applied patches:

Skipped tests:
      # One test name on a line

Test failures:
~~ ../t/porting/podcheck.t ..................................... FAILED 270
  [stdio] -Dcc=g++ -Duseithreads -Duse64bitall DEBUGGING
  [stdio] -Dcc=g++ -Duse64bitall
  [stdio] -Dcc=g++ DEBUGGING
  [stdio] -Dcc=g++ -Duseithreads -Duselongdouble DEBUGGING
  [stdio] -Dcc=g++
  [stdio] -Dcc=g++ -Duse64bitall DEBUGGING
  [stdio] -Dcc=g++ -Duselongdouble DEBUGGING
  [stdio] -Dcc=g++ -Duseithreads
  [stdio] -Dcc=g++ -Duselongdouble
  [stdio] -Dcc=g++ -Duseithreads -Duselongdouble
  [stdio] -Dcc=g++ -Duseithreads DEBUGGING
  [stdio] -Dcc=g++ -Duseithreads -Duse64bitall
~~ ../t/run/runenv_hashseed.t .................................. FAILED 421
  [stdio] -Dcc=g++ DEBUGGING
~~ ../dist/Time-HiRes/t/alarm.t ................................ FAILED 8-9 Non-zero exit status: 2
  [stdio] -Dcc=g++ -Duselongdouble

Test todo-passed:

MANIFEST messages:
  MANIFEST did not declare '.mailmap'

Compiler messages:

About this smoke:
    smoking-perl: 5.30.2
  smoker-version: 1.71/0.046
       timestamp: 2022-03-24 16:39:12+00
          tester: core

-- 
Report generated by Test::Smoke::Gateway v0.10