Show logfile
Automated smoke report for branch blead 5.35.11 patch 0f7529f0ca9df6069f41f1b9bfacac94db2c7bed v5.35.10-14-g0f7529f0ca
cjg-netbsd8: Intel 686-class (amd64/1 cpus)
    on        netbsd 8.2
    using     gcc version 5.5.0 (*1)
    smoketime 5 hours 49 minutes (average 43 minutes 41 seconds)

Summary: FAIL(F)

O = OK  F = Failure(s), extended report at the bottom
X = Failure(s) under TEST but not under harness
? = still running or test results not (yet) available
Build failures during:       - = unknown or N/A
c = Configure, m = make, M = make (after miniperl), t = make test-prep

v5.35.10-14-g0f7529f0ca
---------------------- ----------------------------------------------------
F  F                    -Dcc=gcc (*1)
F  F                    -Dcc=gcc -Duse64bitall (*1)
F  F                    -Dcc=gcc -Duseithreads (*1)
F  F                    -Dcc=gcc -Duseithreads -Duse64bitall (*1)
|  |
|  +------------------  stdio DEBUGGING
+---------------------  stdio

Applied patches:

Skipped tests:
      # One test name on a line

Test failures:
~~ ../t/porting/podcheck.t ..................................... FAILED 270
  [stdio] -Dcc=gcc
  [stdio] -Dcc=gcc -Duse64bitall DEBUGGING
  [stdio] -Dcc=gcc -Duseithreads
  [stdio] -Dcc=gcc -Duse64bitall
  [stdio] -Dcc=gcc DEBUGGING
  [stdio] -Dcc=gcc -Duseithreads DEBUGGING
  [stdio] -Dcc=gcc -Duseithreads -Duse64bitall
  [stdio] -Dcc=gcc -Duseithreads -Duse64bitall DEBUGGING

Test todo-passed:

MANIFEST messages:
  MANIFEST did not declare '.mailmap'

Compiler messages:
  /usr/include/sys/cdefs_elf.h:67:20: error: missing binary operator before token "("
  /usr/include/sys/cdefs_elf.h:73:20: error: missing binary operator before token "("
  /usr/include/sys/cdefs_elf.h:79:20: error: missing binary operator before token "("
  Socket.c: In function 'XS_Socket_pack_ip_mreq_source':
  Socket.c:1698:7: warning: variable 'interface' set but not used [-Wunused-but-set-variable]
  const-c.inc: In function 'constant_19':
  const-c.inc:351:42: warning: unused parameter 'iv_return' [-Wunused-parameter]
  re_exec.c: In function 'S_regtry':
  re_exec.c:7070:44: warning: 'fold_array' may be used uninitialized in this function [-Wmaybe-uninitialized]
  re_exec.c:6974:24: note: 'fold_array' was declared here
  re_exec.c:7076:29: warning: 'folder' may be used uninitialized in this function [-Wmaybe-uninitialized]
  re_exec.c:6973:23: note: 'folder' was declared here
  util.c: In function 'Perl_xs_handshake':
  util.c:5765:36: warning: comparison is always true due to limited range of data type [-Wtype-limits]
  regexec.c: In function 'S_regtry':
  regexec.c:7070:44: warning: 'fold_array' may be used uninitialized in this function [-Wmaybe-uninitialized]
  regexec.c:6974:24: note: 'fold_array' was declared here
  regexec.c:7076:29: warning: 'folder' may be used uninitialized in this function [-Wmaybe-uninitialized]
  regexec.c:6973:23: note: 'folder' was declared here

About this smoke:
    smoking-perl: 5.26.1
  smoker-version: 1.71/0.046
       timestamp: 2022-03-24 15:41:45+00
          tester: core

-- 
Report generated by Test::Smoke::Gateway v0.10