Show logfile
Automated smoke report for branch blead 5.35.11 patch 0f7529f0ca9df6069f41f1b9bfacac94db2c7bed v5.35.10-14-g0f7529f0ca
cjg-netbsd9: Intel 686-class (amd64/1 cpus)
    on        netbsd 9.2
    using     g++ version 7.5.0 (*1)
    smoketime 5 hours 41 minutes (average 42 minutes 40 seconds)

Summary: FAIL(F)

O = OK  F = Failure(s), extended report at the bottom
X = Failure(s) under TEST but not under harness
? = still running or test results not (yet) available
Build failures during:       - = unknown or N/A
c = Configure, m = make, M = make (after miniperl), t = make test-prep

v5.35.10-14-g0f7529f0ca
---------------------- ----------------------------------------------------
F  F                    -Dcc=g++ (*1)
F  F                    -Dcc=g++ -Duse64bitall (*1)
F  F                    -Dcc=g++ -Duseithreads (*1)
F  F                    -Dcc=g++ -Duseithreads -Duse64bitall (*1)
|  |
|  +------------------  stdio DEBUGGING
+---------------------  stdio

Applied patches:

Skipped tests:
      # One test name on a line

Test failures:
~~ ../t/porting/podcheck.t ..................................... FAILED 270
  [stdio] -Dcc=g++
  [stdio] -Dcc=g++ -Duse64bitall DEBUGGING
  [stdio] -Dcc=g++ -Duseithreads
  [stdio] -Dcc=g++ -Duseithreads -Duse64bitall DEBUGGING
  [stdio] -Dcc=g++ -Duse64bitall
  [stdio] -Dcc=g++ DEBUGGING
  [stdio] -Dcc=g++ -Duseithreads DEBUGGING
  [stdio] -Dcc=g++ -Duseithreads -Duse64bitall

Test todo-passed:

MANIFEST messages:
  MANIFEST did not declare '.mailmap'

Compiler messages:
  builtin.c:365:1: warning: missing initializer for member 'BuiltinFuncDescriptor::xsub' [-Wmissing-field-initializers]
  builtin.c:365:1: warning: missing initializer for member 'BuiltinFuncDescriptor::checker' [-Wmissing-field-initializers]
  builtin.c:365:1: warning: missing initializer for member 'BuiltinFuncDescriptor::ckval' [-Wmissing-field-initializers]
  /usr/include/sys/cdefs_elf.h:67:20: error: missing binary operator before token "("
  /usr/include/sys/cdefs_elf.h:73:20: error: missing binary operator before token "("
  /usr/include/sys/cdefs_elf.h:79:20: error: missing binary operator before token "("
  inflate.c: In function 'int inflate(z_streamp, int)':
  inflate.c:724:25: warning: this statement may fall through [-Wimplicit-fallthrough=]
  inflate.c:725:9: note: here
  inflate.c:732:25: warning: this statement may fall through [-Wimplicit-fallthrough=]
  inflate.c:733:9: note: here
  inflate.c:947:25: warning: this statement may fall through [-Wimplicit-fallthrough=]
  inflate.c:948:9: note: here
  inflate.c:968:25: warning: this statement may fall through [-Wimplicit-fallthrough=]
  inflate.c:969:9: note: here
  Socket.xs: In function 'void XS_Socket_inet_aton(CV*)':
  Socket.xs:773:28: warning: missing initializer for member 'addrinfo::ai_family' [-Wmissing-field-initializers]
  Socket.xs:773:28: warning: missing initializer for member 'addrinfo::ai_socktype' [-Wmissing-field-initializers]
  Socket.xs:773:28: warning: missing initializer for member 'addrinfo::ai_protocol' [-Wmissing-field-initializers]
  Socket.xs:773:28: warning: missing initializer for member 'addrinfo::ai_addrlen' [-Wmissing-field-initializers]
  Socket.xs:773:28: warning: missing initializer for member 'addrinfo::ai_canonname' [-Wmissing-field-initializers]
  Socket.xs:773:28: warning: missing initializer for member 'addrinfo::ai_addr' [-Wmissing-field-initializers]
  Socket.xs:773:28: warning: missing initializer for member 'addrinfo::ai_next' [-Wmissing-field-initializers]
  Socket.c: In function 'void XS_Socket_pack_ip_mreq_source(CV*)':
  Socket.c:1698:7: warning: variable 'interface' set but not used [-Wunused-but-set-variable]
  const-c.inc: In function 'int constant_19(const char*, IV*)':
  const-c.inc:351:42: warning: unused parameter 'iv_return' [-Wunused-parameter]
  HiRes.xs: In function 'void XS_Time__HiRes_setitimer(CV*)':
  HiRes.xs:1248:42: warning: option '-Wc++-compat' is valid for C/ObjC but not for C++ [-Wpragmas]
  HiRes.xs: In function 'void XS_Time__HiRes_getitimer(CV*)':
  HiRes.xs:1268:42: warning: option '-Wc++-compat' is valid for C/ObjC but not for C++ [-Wpragmas]
  Piece.xs: In function 'char* _strptime(const char*, const char*, tm*, int*)':
  Piece.xs:719:8: warning: 'len' may be used uninitialized in this function [-Wmaybe-uninitialized]
  re_exec.c: In function 'bool S_regtry(regmatch_info*, char**)':
  re_exec.c:7070:53: warning: 'fold_array' may be used uninitialized in this function [-Wmaybe-uninitialized]
  re_exec.c:6974:24: note: 'fold_array' was declared here
  re_exec.c:7076:35: warning: 'folder' may be used uninitialized in this function [-Wmaybe-uninitialized]
  re_exec.c:6973:23: note: 'folder' was declared here
  regexec.c: In function 'bool S_regtry(regmatch_info*, char**)':
  regexec.c:7070:53: warning: 'fold_array' may be used uninitialized in this function [-Wmaybe-uninitialized]
  regexec.c:6974:24: note: 'fold_array' was declared here
  regexec.c:7076:35: warning: 'folder' may be used uninitialized in this function [-Wmaybe-uninitialized]
  regexec.c:6973:23: note: 'folder' was declared here
  Socket.xs: In function 'void XS_Socket_inet_aton(PerlInterpreter*, CV*)':
  Socket.c: In function 'void XS_Socket_pack_ip_mreq_source(PerlInterpreter*, CV*)':
  const-c.inc: In function 'int constant_19(PerlInterpreter*, const char*, IV*)':
  HiRes.xs: In function 'void XS_Time__HiRes_setitimer(PerlInterpreter*, CV*)':
  HiRes.xs: In function 'void XS_Time__HiRes_getitimer(PerlInterpreter*, CV*)':
  Piece.xs: In function 'char* _strptime(PerlInterpreter*, const char*, const char*, tm*, int*)':
  re_exec.c: In function 'bool S_regtry(PerlInterpreter*, regmatch_info*, char**)':
  regexec.c: In function 'bool S_regtry(PerlInterpreter*, regmatch_info*, char**)':

About this smoke:
    smoking-perl: 5.30.2
  smoker-version: 1.71/0.046
       timestamp: 2022-03-24 15:14:07+00
          tester: core

-- 
Report generated by Test::Smoke::Gateway v0.10