Show logfile
Automated smoke report for branch blead 5.35.7 patch caa9af33e832c2614fd55d0d5a06dc716baf9c17 v5.35.6-11-gcaa9af33e8
cjg-netbsd8: Intel 686-class (amd64/1 cpus)
    on        netbsd 8.2
    using     gcc version 5.5.0 (*1)
    smoketime 5 hours 40 minutes (average 42 minutes 30 seconds)

Summary: PASS

O = OK  F = Failure(s), extended report at the bottom
X = Failure(s) under TEST but not under harness
? = still running or test results not (yet) available
Build failures during:       - = unknown or N/A
c = Configure, m = make, M = make (after miniperl), t = make test-prep

v5.35.6-11-gcaa9af33e8
---------------------- ----------------------------------------------------
O  O                    -Dcc=gcc (*1)
O  O                    -Dcc=gcc -Duse64bitall (*1)
O  O                    -Dcc=gcc -Duseithreads (*1)
O  O                    -Dcc=gcc -Duseithreads -Duse64bitall (*1)
|  |
|  +------------------  stdio DEBUGGING
+---------------------  stdio

Applied patches:

Skipped tests:
      # One test name on a line

Test failures:

Test todo-passed:

MANIFEST messages:
  MANIFEST did not declare '.mailmap'

Compiler messages:
  /usr/include/sys/cdefs_elf.h:67:20: error: missing binary operator before token "("
  /usr/include/sys/cdefs_elf.h:73:20: error: missing binary operator before token "("
  /usr/include/sys/cdefs_elf.h:79:20: error: missing binary operator before token "("
  DB_File.xs: In function 'ParseOpenInfo':
  DB_File.xs:476:44: warning: suggest braces around empty body in an 'if' statement [-Wempty-body]
  DB_File.xs:1044:13: note: in expansion of macro 'croak_and_free'
  DB_File.xs:1050:13: note: in expansion of macro 'croak_and_free'
  DB_File.xs:1056:17: note: in expansion of macro 'croak_and_free'
  DB_File.xs:1091:17: note: in expansion of macro 'croak_and_free'
  DB_File.xs:1140:17: note: in expansion of macro 'croak_and_free'
  DB_File.xs:1229:13: note: in expansion of macro 'croak_and_free'
  ListUtil.xs: In function 'XS_List__Util_zip':
  ListUtil.xs:1619:33: warning: comparison between signed and unsigned integer expressions [-Wsign-compare]
  ListUtil.xs:1624:33: warning: comparison between signed and unsigned integer expressions [-Wsign-compare]
  ListUtil.xs:1639:31: warning: comparison between signed and unsigned integer expressions [-Wsign-compare]
  ListUtil.xs:1658:31: warning: comparison between signed and unsigned integer expressions [-Wsign-compare]
  Socket.c: In function 'XS_Socket_pack_ip_mreq_source':
  Socket.c:1698:7: warning: variable 'interface' set but not used [-Wunused-but-set-variable]
  const-c.inc: In function 'constant_19':
  const-c.inc:351:42: warning: unused parameter 'iv_return' [-Wunused-parameter]
  re_exec.c: In function 'S_regtry':
  re_exec.c:7069:44: warning: 'fold_array' may be used uninitialized in this function [-Wmaybe-uninitialized]
  re_exec.c:6973:24: note: 'fold_array' was declared here
  re_exec.c:7075:29: warning: 'folder' may be used uninitialized in this function [-Wmaybe-uninitialized]
  re_exec.c:6972:23: note: 'folder' was declared here
  util.c: In function 'Perl_xs_handshake':
  util.c:5646:36: warning: comparison is always true due to limited range of data type [-Wtype-limits]
  regexec.c: In function 'S_regtry':
  regexec.c:7069:44: warning: 'fold_array' may be used uninitialized in this function [-Wmaybe-uninitialized]
  regexec.c:6973:24: note: 'fold_array' was declared here
  regexec.c:7075:29: warning: 'folder' may be used uninitialized in this function [-Wmaybe-uninitialized]
  regexec.c:6972:23: note: 'folder' was declared here

About this smoke:
    smoking-perl: 5.26.1
  smoker-version: 1.71/0.046
       timestamp: 2021-11-24 19:12:12+00
          tester: core

-- 
Report generated by Test::Smoke::Gateway v0.09