Show logfile
Automated smoke report for branch smoke-me/khw-cygwin 5.35.4 patch ecc6d863b761e3e9f1420127b5b5fcf57b9451ff v5.35.3-169-gecc6d863b7
cjg-netbsd9: Intel 686-class (amd64/1 cpus)
    on        netbsd 9.2
    using     g++ version 7.5.0 (*1)
    smoketime 5 hours 26 minutes (average 40 minutes 51 seconds)

Summary: FAIL(F)

O = OK  F = Failure(s), extended report at the bottom
X = Failure(s) under TEST but not under harness
? = still running or test results not (yet) available
Build failures during:       - = unknown or N/A
c = Configure, m = make, M = make (after miniperl), t = make test-prep

v5.35.3-169-gecc6d863b7
---------------------- ----------------------------------------------------
F  F                    -Dcc=g++ (*1)
F  F                    -Dcc=g++ -Duse64bitall (*1)
F  F                    -Dcc=g++ -Duseithreads (*1)
F  F                    -Dcc=g++ -Duseithreads -Duse64bitall (*1)
|  |
|  +------------------  stdio DEBUGGING
+---------------------  stdio

Applied patches:

Skipped tests:
      # One test name on a line

Test failures:
~~ ../t/porting/diag.t ......................................... FAILED 14-16
  [stdio] -Dcc=g++ -Duse64bitall DEBUGGING
  [stdio] -Dcc=g++ -Duseithreads DEBUGGING
  [stdio] -Dcc=g++
  [stdio] -Dcc=g++ -Duse64bitall
  [stdio] -Dcc=g++ -Duseithreads
  [stdio] -Dcc=g++ -Duseithreads -Duse64bitall DEBUGGING
  [stdio] -Dcc=g++ DEBUGGING
  [stdio] -Dcc=g++ -Duseithreads -Duse64bitall

Test todo-passed:

MANIFEST messages:
  MANIFEST did not declare '.mailmap'

Compiler messages:
  /usr/include/sys/cdefs_elf.h:67:20: error: missing binary operator before token "("
  /usr/include/sys/cdefs_elf.h:73:20: error: missing binary operator before token "("
  /usr/include/sys/cdefs_elf.h:79:20: error: missing binary operator before token "("
  inflate.c: In function 'int inflate(z_streamp, int)':
  inflate.c:724:25: warning: this statement may fall through [-Wimplicit-fallthrough=]
  inflate.c:725:9: note: here
  inflate.c:732:25: warning: this statement may fall through [-Wimplicit-fallthrough=]
  inflate.c:733:9: note: here
  inflate.c:947:25: warning: this statement may fall through [-Wimplicit-fallthrough=]
  inflate.c:948:9: note: here
  inflate.c:968:25: warning: this statement may fall through [-Wimplicit-fallthrough=]
  inflate.c:969:9: note: here
  DB_File.xs: In function 'DB_File_type* ParseOpenInfo(int, char*, int, int, SV*)':
  DB_File.xs:476:44: warning: suggest braces around empty body in an 'if' statement [-Wempty-body]
  DB_File.xs:1044:13: note: in expansion of macro 'croak_and_free'
  DB_File.xs:1050:13: note: in expansion of macro 'croak_and_free'
  DB_File.xs:1056:17: note: in expansion of macro 'croak_and_free'
  DB_File.xs:1091:17: note: in expansion of macro 'croak_and_free'
  DB_File.xs:1140:17: note: in expansion of macro 'croak_and_free'
  DB_File.xs:1229:13: note: in expansion of macro 'croak_and_free'
  ListUtil.xs: In function 'void XS_List__Util_zip(CV*)':
  ../../pp.h:371:40: warning: comparison of unsigned expression < 0 is always false [-Wtype-limits]
  ../../perl.h:3804:62: note: in definition of macro 'EXPECT'
  ../../perl.h:3825:52: note: in expansion of macro 'cBOOL'
  ../../pp.h:390:30: note: in expansion of macro 'UNLIKELY'
  ../../pp.h:390:39: note: in expansion of macro '_EXTEND_NEEDS_GROW'
  ListUtil.xs:1628:9: note: in expansion of macro 'EXTEND'
  ../../pp.h:371:66: warning: comparison between signed and unsigned integer expressions [-Wsign-compare]
  ListUtil.xs:1645:9: note: in expansion of macro 'EXTEND'
  Socket.xs: In function 'void XS_Socket_inet_aton(CV*)':
  Socket.xs:773:28: warning: missing initializer for member 'addrinfo::ai_family' [-Wmissing-field-initializers]
  Socket.xs:773:28: warning: missing initializer for member 'addrinfo::ai_socktype' [-Wmissing-field-initializers]
  Socket.xs:773:28: warning: missing initializer for member 'addrinfo::ai_protocol' [-Wmissing-field-initializers]
  Socket.xs:773:28: warning: missing initializer for member 'addrinfo::ai_addrlen' [-Wmissing-field-initializers]
  Socket.xs:773:28: warning: missing initializer for member 'addrinfo::ai_canonname' [-Wmissing-field-initializers]
  Socket.xs:773:28: warning: missing initializer for member 'addrinfo::ai_addr' [-Wmissing-field-initializers]
  Socket.xs:773:28: warning: missing initializer for member 'addrinfo::ai_next' [-Wmissing-field-initializers]
  Socket.c: In function 'void XS_Socket_pack_ip_mreq_source(CV*)':
  Socket.c:1698:7: warning: variable 'interface' set but not used [-Wunused-but-set-variable]
  const-c.inc: In function 'int constant_19(const char*, IV*)':
  const-c.inc:351:42: warning: unused parameter 'iv_return' [-Wunused-parameter]
  HiRes.xs: In function 'void XS_Time__HiRes_setitimer(CV*)':
  HiRes.xs:1248:42: warning: option '-Wc++-compat' is valid for C/ObjC but not for C++ [-Wpragmas]
  HiRes.xs: In function 'void XS_Time__HiRes_getitimer(CV*)':
  HiRes.xs:1268:42: warning: option '-Wc++-compat' is valid for C/ObjC but not for C++ [-Wpragmas]
  Piece.xs: In function 'char* _strptime(const char*, const char*, tm*, int*)':
  Piece.xs:719:8: warning: 'len' may be used uninitialized in this function [-Wmaybe-uninitialized]
  re_exec.c: In function 'bool S_regtry(regmatch_info*, char**)':
  re_exec.c:7069:53: warning: 'fold_array' may be used uninitialized in this function [-Wmaybe-uninitialized]
  re_exec.c:6973:24: note: 'fold_array' was declared here
  re_exec.c:7075:35: warning: 'folder' may be used uninitialized in this function [-Wmaybe-uninitialized]
  re_exec.c:6972:23: note: 'folder' was declared here
  regexec.c: In function 'bool S_regtry(regmatch_info*, char**)':
  regexec.c:7069:53: warning: 'fold_array' may be used uninitialized in this function [-Wmaybe-uninitialized]
  regexec.c:6973:24: note: 'fold_array' was declared here
  regexec.c:7075:35: warning: 'folder' may be used uninitialized in this function [-Wmaybe-uninitialized]
  regexec.c:6972:23: note: 'folder' was declared here
  ../../embed.h: In function 'void XS_List__Util_reduce(CV*)':
  ../../embed.h:68:35: warning: 'retvals' may be used uninitialized in this function [-Wmaybe-uninitialized]
  ListUtil.xs:535:9: note: 'retvals' was declared here
  DB_File.xs: In function 'DB_File_type* ParseOpenInfo(PerlInterpreter*, int, char*, int, int, SV*)':
  ListUtil.xs: In function 'void XS_List__Util_zip(PerlInterpreter*, CV*)':
  Socket.xs: In function 'void XS_Socket_inet_aton(PerlInterpreter*, CV*)':
  Socket.c: In function 'void XS_Socket_pack_ip_mreq_source(PerlInterpreter*, CV*)':
  const-c.inc: In function 'int constant_19(PerlInterpreter*, const char*, IV*)':
  HiRes.xs: In function 'void XS_Time__HiRes_setitimer(PerlInterpreter*, CV*)':
  HiRes.xs: In function 'void XS_Time__HiRes_getitimer(PerlInterpreter*, CV*)':
  Piece.xs: In function 'char* _strptime(PerlInterpreter*, const char*, const char*, tm*, int*)':
  re_exec.c: In function 'bool S_regtry(PerlInterpreter*, regmatch_info*, char**)':
  regexec.c: In function 'bool S_regtry(PerlInterpreter*, regmatch_info*, char**)':
  ../../embed.h: In function 'void XS_List__Util_reduce(PerlInterpreter*, CV*)':

About this smoke:
    smoking-perl: 5.30.2
  smoker-version: 1.71/0.046
       timestamp: 2021-09-14 20:01:10+00
          tester: core

-- 
Report generated by Test::Smoke::Gateway v0.09