Show logfile
Automated smoke report for branch smoke-me/jkeenan/g++10-build-time-warnings-20210913 5.35.4 patch 8bf774e084616f9fb8aa361e4af1254ecb207fb9 v5.35.3-152-g8bf774e084
cjg-netbsd8: Intel 686-class (amd64/1 cpus)
    on        netbsd 8.2
    using     g++ version 5.5.0 (*1)
    smoketime 5 hours 26 minutes (average 40 minutes 45 seconds)

Summary: PASS

O = OK  F = Failure(s), extended report at the bottom
X = Failure(s) under TEST but not under harness
? = still running or test results not (yet) available
Build failures during:       - = unknown or N/A
c = Configure, m = make, M = make (after miniperl), t = make test-prep

v5.35.3-152-g8bf774e084
---------------------- ----------------------------------------------------
O  O                    -Dcc=g++ (*1)
O  O                    -Dcc=g++ -Duse64bitall (*1)
O  O                    -Dcc=g++ -Duseithreads (*1)
O  O                    -Dcc=g++ -Duseithreads -Duse64bitall (*1)
|  |
|  +------------------  stdio DEBUGGING
+---------------------  stdio

Applied patches:

Skipped tests:
      # One test name on a line

Test failures:

Test todo-passed:

MANIFEST messages:
  MANIFEST did not declare '.mailmap'

Compiler messages:
  /usr/include/sys/cdefs_elf.h:67:20: error: missing binary operator before token "("
  /usr/include/sys/cdefs_elf.h:73:20: error: missing binary operator before token "("
  /usr/include/sys/cdefs_elf.h:79:20: error: missing binary operator before token "("
  DB_File.xs: In function 'DB_File_type* ParseOpenInfo(int, char*, int, int, SV*)':
  DB_File.xs:476:44: warning: suggest braces around empty body in an 'if' statement [-Wempty-body]
  DB_File.xs:1044:13: note: in expansion of macro 'croak_and_free'
  DB_File.xs:1050:13: note: in expansion of macro 'croak_and_free'
  DB_File.xs:1056:17: note: in expansion of macro 'croak_and_free'
  DB_File.xs:1091:17: note: in expansion of macro 'croak_and_free'
  DB_File.xs:1140:17: note: in expansion of macro 'croak_and_free'
  DB_File.xs:1229:13: note: in expansion of macro 'croak_and_free'
  ListUtil.xs: In function 'void XS_List__Util_zip(CV*)':
  ../../pp.h:371:40: warning: comparison of unsigned expression < 0 is always false [-Wtype-limits]
  ../../perl.h:3804:62: note: in definition of macro 'EXPECT'
  ../../perl.h:3825:52: note: in expansion of macro 'cBOOL'
  ../../pp.h:390:30: note: in expansion of macro 'UNLIKELY'
  ../../pp.h:390:39: note: in expansion of macro '_EXTEND_NEEDS_GROW'
  ListUtil.xs:1628:9: note: in expansion of macro 'EXTEND'
  ../../pp.h:371:66: warning: comparison between signed and unsigned integer expressions [-Wsign-compare]
  ../../pp.h:337:55: warning: comparison between signed and unsigned integer expressions [-Wsign-compare]
  ../../embed.h:571:53: note: in definition of macro 'stack_grow'
  ../../pp.h:391:49: note: in expansion of macro '_EXTEND_SAFE_N'
  ListUtil.xs:1645:9: note: in expansion of macro 'EXTEND'
  Socket.xs: In function 'void XS_Socket_inet_aton(CV*)':
  Socket.xs:773:28: warning: missing initializer for member 'addrinfo::ai_family' [-Wmissing-field-initializers]
  Socket.xs:773:28: warning: missing initializer for member 'addrinfo::ai_socktype' [-Wmissing-field-initializers]
  Socket.xs:773:28: warning: missing initializer for member 'addrinfo::ai_protocol' [-Wmissing-field-initializers]
  Socket.xs:773:28: warning: missing initializer for member 'addrinfo::ai_addrlen' [-Wmissing-field-initializers]
  Socket.xs:773:28: warning: missing initializer for member 'addrinfo::ai_canonname' [-Wmissing-field-initializers]
  Socket.xs:773:28: warning: missing initializer for member 'addrinfo::ai_addr' [-Wmissing-field-initializers]
  Socket.xs:773:28: warning: missing initializer for member 'addrinfo::ai_next' [-Wmissing-field-initializers]
  Socket.c: In function 'void XS_Socket_pack_ip_mreq_source(CV*)':
  Socket.c:1698:7: warning: variable 'interface' set but not used [-Wunused-but-set-variable]
  const-c.inc:351:42: warning: unused parameter 'iv_return' [-Wunused-parameter]
  re_exec.c: In function 'bool S_regtry(regmatch_info*, char**)':
  re_exec.c:7069:53: warning: 'fold_array' may be used uninitialized in this function [-Wmaybe-uninitialized]
  re_exec.c:6973:24: note: 'fold_array' was declared here
  re_exec.c:7075:35: warning: 'folder' may be used uninitialized in this function [-Wmaybe-uninitialized]
  re_exec.c:6972:23: note: 'folder' was declared here
  util.c: In function 'I32 Perl_xs_handshake(U32, void*, const char*, ...)':
  util.c:5672:36: warning: comparison is always true due to limited range of data type [-Wtype-limits]
  regexec.c: In function 'bool S_regtry(regmatch_info*, char**)':
  regexec.c:7069:53: warning: 'fold_array' may be used uninitialized in this function [-Wmaybe-uninitialized]
  regexec.c:6973:24: note: 'fold_array' was declared here
  regexec.c:7075:35: warning: 'folder' may be used uninitialized in this function [-Wmaybe-uninitialized]
  regexec.c:6972:23: note: 'folder' was declared here
  ListUtil.xs: In function 'void XS_List__Util_reduce(CV*)':
  ListUtil.xs:581:47: warning: 'retvals' may be used uninitialized in this function [-Wmaybe-uninitialized]
  ListUtil.xs:535:9: note: 'retvals' was declared here
  DB_File.xs: In function 'DB_File_type* ParseOpenInfo(PerlInterpreter*, int, char*, int, int, SV*)':
  ListUtil.xs: In function 'void XS_List__Util_zip(PerlInterpreter*, CV*)':
  Socket.xs: In function 'void XS_Socket_inet_aton(PerlInterpreter*, CV*)':
  Socket.c: In function 'void XS_Socket_pack_ip_mreq_source(PerlInterpreter*, CV*)':
  re_exec.c: In function 'bool S_regtry(PerlInterpreter*, regmatch_info*, char**)':
  regexec.c: In function 'bool S_regtry(PerlInterpreter*, regmatch_info*, char**)':
  ListUtil.xs: In function 'void XS_List__Util_reduce(PerlInterpreter*, CV*)':

About this smoke:
    smoking-perl: 5.26.1
  smoker-version: 1.71/0.046
       timestamp: 2021-09-14 17:00:53+00
          tester: core

-- 
Report generated by Test::Smoke::Gateway v0.09