Automated smoke report for branch blead 5.35.2 patch 158b05f88107501586f35dde9afd3c1444e148e1 v5.35.1-102-g158b05f881
shredder: x86_64 (x86_64/? cpus)
    on        haiku 1
    using     gcc version 8.3.0 (*1)
    smoketime 1 hour 4 minutes (average 1 hour 4 minutes)

Summary: FAIL(F)

O = OK  F = Failure(s), extended report at the bottom
X = Failure(s) under TEST but not under harness
? = still running or test results not (yet) available
Build failures during:       - = unknown or N/A
c = Configure, m = make, M = make (after miniperl), t = make test-prep

v5.35.1-102-g158b05f881
---------------------- ----------------------------------------------------
F  F  -  -               (*1)
|  |  |  |
|  |  |  +------------  perlio DEBUGGING
|  |  +---------------  stdio DEBUGGING
|  +------------------  perlio
+---------------------  stdio

Applied patches:

Skipped tests:
  None

Test failures:
~~ ../dist/Net-Ping/t/010_pingecho.t ........................... FAILED 2 Non-zero exit status: 1
  [stdio/perlio] 
~~ ../cpan/ExtUtils-MakeMaker/t/recurs.t ....................... FAILED 25-26 Non-zero exit status: 2
  [stdio] 
~~ ../lib/File/stat.t .......................................... FAILED 3482 Non-zero exit status: 1
  [perlio] 
~~ ../ext/POSIX/t/wrappers.t ................................... FAILED 85-86 Non-zero exit status: 2
  [stdio/perlio] 
~~ ../dist/PathTools/t/cwd_enoent.t ............................ FAILED 1-4 Non-zero exit status: 4
  [stdio/perlio] 
~~ ../cpan/IO-Socket-IP/t/11sockopts.t ......................... FAILED 1-4 Non-zero exit status: 4
  [stdio/perlio] 
~~ ../cpan/Time-Piece/t/02core.t ............................... FAILED 30-31 Non-zero exit status: 2
  [stdio/perlio] 
~~ ../t/run/exit.t ............................................. FAILED 7-9 14-16
  [stdio/perlio] 
~~ ../t/op/time.t .............................................. FAILED 54 56
  [stdio/perlio] 
~~ ../cpan/IPC-SysV/t/msg.t .................................... FAILED 9 Non-zero exit status: 1
  [stdio/perlio] 
~~ ../cpan/IO-Socket-IP/t/18fdopen.t ........................... FAILED 1 Non-zero exit status: 1
  [stdio/perlio] 
~~ ../dist/IO/t/cachepropagate-unix.t .......................... FAILED 2 Non-zero exit status: 1
  [stdio/perlio] 
~~ ../dist/Net-Ping/t/450_service.t ............................ FAILED 9 18 Non-zero exit status: 2
  [stdio/perlio] 
~~ ../dist/Time-HiRes/t/utime.t ................................ FAILED 2-3 5-6 9 12-15 Non-zero exit status: 9
  [stdio/perlio] 
~~ ../dist/Time-HiRes/t/stat.t ................................. FAILED 6-7 13-14 20 27 34-35 41-42 Non-zero exit status: 10
  [perlio] 
~~ ../dist/Time-HiRes/t/stat.t ................................. FAILED 6-7 13-14 20 27 34-35 42 Non-zero exit status: 9
  [stdio] 

Test todo-passed:

MANIFEST messages:
  MANIFEST did not declare '.mailmap'

Compiler messages:

About this smoke:
    smoking-perl: 5.30.2
  smoker-version: 1.78/0.046
       timestamp: 2021-07-08T09:12:53
          tester: user

-- 
Report generated by Test::Smoke::Gateway v0.12