Show logfile
Automated smoke report for branch smoke-me/jkeenan/jmacdotorg-perldocstyle 5.33.5 patch 77b552924301b927f3117c96b34deb588be3da91 v5.33.4-210-g77b5529243
perl-reporter-08: Intel 686-class (amd64/2 cpus)
    on        netbsd 8.0
    using     cc version 5.5.0 (*1)
    smoketime 1 hour 58 minutes (average 29 minutes 38 seconds)

Summary: FAIL(F)

O = OK  F = Failure(s), extended report at the bottom
X = Failure(s) under TEST but not under harness
? = still running or test results not (yet) available
Build failures during:       - = unknown or N/A
c = Configure, m = make, M = make (after miniperl), t = make test-prep

v5.33.4-210-g77b5529243
---------------------- ----------------------------------------------------
F  F  F  F               (*1)
F  F  F  F              -Duseithreads (*1)
|  |  |  |
|  |  |  +------------  perlio DEBUGGING
|  |  +---------------  stdio DEBUGGING
|  +------------------  perlio
+---------------------  stdio

Applied patches:
  SMOKE77b552924301b927f3117c96b34deb588be3da91

Skipped tests:
      # One test name on a line

Test failures:
~~ ../cpan/ExtUtils-MakeMaker/t/eu_command.t ................... FAILED 8 Non-zero exit status: 1
  [stdio/perlio]  DEBUGGING
  [stdio/perlio] -Duseithreads DEBUGGING
  [stdio/perlio] -Duseithreads
  [stdio/perlio] 
~~ ../t/op/sselect.t ........................................... FAILED 13
  [perlio] -Duseithreads DEBUGGING
~~ ../dist/Time-HiRes/t/nanosleep.t ............................ FAILED 3 Non-zero exit status: 1
  [stdio/perlio]  DEBUGGING
  [stdio/perlio] -Duseithreads DEBUGGING
  [stdio/perlio] -Duseithreads
  [stdio/perlio] 
~~ ../t/op/sleep.t ............................................. FAILED 1 3
  [perlio] -Duseithreads DEBUGGING
  [stdio/perlio] -Duseithreads
~~ ../t/op/alarm.t ............................................. FAILED 2
  [perlio] -Duseithreads
  [stdio] -Duseithreads DEBUGGING
~~ ../dist/Time-HiRes/t/ualarm.t ............................... FAILED 5-6 Bad plan.  You planned 12 tests but ran 6.
  [stdio] 
~~ ../t/op/alarm.t ............................................. FAILED 4
  [stdio]  DEBUGGING
  [stdio] -Duseithreads
  [stdio/perlio] 
~~ ../dist/Time-HiRes/t/ualarm.t ............................... FAILED 5-7 9-10 Non-zero exit status: 5
  [perlio] 
  [stdio/perlio] -Duseithreads DEBUGGING
  [stdio/perlio] -Duseithreads
  [stdio/perlio]  DEBUGGING
~~ ../dist/IO/t/io_poll.t ...................................... FAILED 12
  [stdio/perlio] 
  [perlio]  DEBUGGING
  [stdio/perlio] -Duseithreads DEBUGGING
  [perlio] -Duseithreads
~~ ../dist/Time-HiRes/t/usleep.t ............................... FAILED 3-6 Non-zero exit status: 4
  [stdio/perlio] 
  [stdio/perlio]  DEBUGGING
  [stdio/perlio] -Duseithreads
  [stdio/perlio] -Duseithreads DEBUGGING
~~ ../t/op/sselect.t ........................................... FAILED 14
  [perlio] -Duseithreads
~~ ../ext/POSIX/t/waitpid.t .................................... FAILED 2 Non-zero exit status: 1
  [stdio/perlio] 
  [stdio/perlio]  DEBUGGING
  [stdio/perlio] -Duseithreads
  [stdio/perlio] -Duseithreads DEBUGGING

Test todo-passed:

MANIFEST messages:
  MANIFEST did not declare '.mailmap'

Compiler messages:
  regexec.c: In function 'S_regtry':
  regexec.c:6767:30: warning: 'fold_array' may be used uninitialized in this function [-Wmaybe-uninitialized]
  regexec.c:6671:17: note: 'fold_array' was declared here
  regexec.c:6773:22: warning: 'folder' may be used uninitialized in this function [-Wmaybe-uninitialized]
  regexec.c:6670:16: note: 'folder' was declared here
  /usr/include/sys/cdefs_elf.h:67:20: error: missing binary operator before token "("
  /usr/include/sys/cdefs_elf.h:73:20: error: missing binary operator before token "("
  /usr/include/sys/cdefs_elf.h:79:20: error: missing binary operator before token "("
  DB_File.xs: In function 'ParseOpenInfo':
  DB_File.xs:476:44: warning: suggest braces around empty body in an 'if' statement [-Wempty-body]
  DB_File.xs:1044:13: note: in expansion of macro 'croak_and_free'
  DB_File.xs:1050:13: note: in expansion of macro 'croak_and_free'
  DB_File.xs:1056:17: note: in expansion of macro 'croak_and_free'
  DB_File.xs:1091:17: note: in expansion of macro 'croak_and_free'
  DB_File.xs:1140:17: note: in expansion of macro 'croak_and_free'
  DB_File.xs:1229:13: note: in expansion of macro 'croak_and_free'
  Socket.c: In function 'XS_Socket_pack_ip_mreq_source':
  Socket.c:1673:7: warning: variable 'interface' set but not used [-Wunused-but-set-variable]
  const-c.inc: In function 'constant_19':
  const-c.inc:351:42: warning: unused parameter 'iv_return' [-Wunused-parameter]
  re_exec.c: In function 'S_regtry':
  re_exec.c:6767:30: warning: 'fold_array' may be used uninitialized in this function [-Wmaybe-uninitialized]
  re_exec.c:6671:17: note: 'fold_array' was declared here
  re_exec.c:6773:22: warning: 'folder' may be used uninitialized in this function [-Wmaybe-uninitialized]
  re_exec.c:6670:16: note: 'folder' was declared here

About this smoke:
    smoking-perl: 5.30.1
  smoker-version: 1.73/0.046
       timestamp: 2020-12-19T14:48:58
          tester: jkeenan

-- 
Report generated by Test::Smoke::Gateway v0.12