Show report
[2022-08-05 01:35:27-0400] ==> Starting synctree
[2022-08-05 01:35:27-0400] qx[/usr/bin/git clone file:///home/core/smoke/git /export/home/core/smoke/git-perl 2>&1]
[2022-08-05 01:37:59-0400] qx[/usr/bin/git remote update --prune 2>&1]
[2022-08-05 01:37:59-0400] qx[/usr/bin/git checkout blead
[2022-08-05 01:37:59-0400]  2>&1]
Already on 'blead'
[2022-08-05 01:37:59-0400] qx[/usr/bin/git reset --hard origin/blead
[2022-08-05 01:37:59-0400]  2>&1]
[2022-08-05 01:37:59-0400] qx[/usr/bin/git clone /export/home/core/smoke/git-perl /export/home/core/smoke/perl-current 2>&1]
[2022-08-05 01:38:01-0400] qx[/usr/bin/git clean -dfx 2>&1]
[2022-08-05 01:38:01-0400] qx[/usr/bin/git fetch origin 2>&1]
[2022-08-05 01:38:02-0400] qx[/usr/bin/git checkout blead
[2022-08-05 01:38:02-0400]  2>&1]
Already on 'blead'
[2022-08-05 01:38:02-0400] qx[/usr/bin/git reset --hard origin/blead
[2022-08-05 01:38:02-0400]  2>&1]
[2022-08-05 01:38:02-0400] qx[/export/home/core/bin/perl-5.30.2/bin/perl5.30.2 Porting/make_dot_patch.pl > .patch]
[2022-08-05 01:38:03-0400] /export/home/core/smoke/perl-current is now up to patchlevel e91a97a6c44e190cf576e37ff52bd8bd7005cf73
[2022-08-05 01:38:03-0400] ==> Starting runsmoke
[2022-08-05 01:38:03-0400] [./tssmokeperl.pl] chdir(/export/home/core/smoke/perl-current)
[2022-08-05 01:38:03-0400] qx[/export/home/core/bin/perl-5.30.2/bin/perl5.30.2 -e "require q[/export/home/core/smoke/perl-current/cpan/Test-Harness/lib/Test/Harness.pm];print Test::Harness->VERSION" 2>&1]
[2022-08-05 01:38:04-0400] Found: Test::Harness version 3.44.
[2022-08-05 01:38:04-0400] Reading build configurations from /export/home/core/smoke/TestSmoke/perlcurrent.cfg
[2022-08-05 01:38:04-0400] Reading 'Policy.sh' from default content (v=1)
[2022-08-05 01:38:04-0400] Running smoke tests without $ENV{PERLIO}
[2022-08-05 01:38:04-0400] Running test suite only with 'harness'
[2022-08-05 01:38:04-0400] make distclean ...
[2022-08-05 01:38:04-0400] Smoking patch e91a97a6c44e190cf576e37ff52bd8bd7005cf73 v5.37.2-80-ge91a97a6c4
[2022-08-05 01:38:04-0400] Smoking branch blead
[2022-08-05 01:38:04-0400] Locally applied patches from '/export/home/core/smoke/perl-current/patchlevel.h'
[2022-08-05 01:38:04-0400] Patches: 'uncommitted-changes'
[2022-08-05 01:38:04-0400] Adding 'SMOKEe91a97a6c44e190cf576e37ff52bd8bd7005cf73' to the registered patches.
[2022-08-05 01:38:04-0400] 
[2022-08-05 01:38:04-0400] Configuration: -Dusedevel -Dcc=gcc
[2022-08-05 01:38:04-0400] ------------------------------------------------------------------------------
[2022-08-05 01:38:04-0400] make distclean ...
[2022-08-05 01:38:04-0400] 
[2022-08-05 01:38:04-0400] Copy Policy.sh ...
[2022-08-05 01:38:04-0400] 
[2022-08-05 01:38:04-0400] Configure ...

NOTE: You are using GNU as(1).  GNU as(1) might not build Perl.  If you
have trouble, you can use /usr/ccs/bin/as by including -B/usr/ccs/bin/
in your gcc command.  (Note that the trailing "/" is required.)

make: Warning: Both `makefile' and `Makefile' exist
Current working directory /export/home/core/smoke/perl-current
make: Warning: Both `makefile' and `Makefile' exist
Current working directory /export/home/core/smoke/perl-current
[2022-08-05 01:39:10-0400] 
[2022-08-05 01:39:10-0400] make ...
make: Warning: Both `makefile' and `Makefile' exist
regexec.c: In function 'S_setup_EXACTISH_ST':
regexec.c:4919:26: warning: array subscript has type 'char' [-Wchar-subscripts]
 4919 |                 lengths[m->count] = UVCHR_SKIP(fold_from);
      |                         ~^~~~~~~
regexec.c:4928:26: warning: array subscript has type 'char' [-Wchar-subscripts]
 4928 |                 matches[m->count][0] = fold_from;
      |                         ~^~~~~~~
regexec.c:4929:26: warning: array subscript has type 'char' [-Wchar-subscripts]
 4929 |                 lengths[m->count] = 1;
      |                         ~^~~~~~~
SysV.xs: In function 'XS_IPC__SysV_shmdt':
SysV.xs:417:20: warning: request for implicit conversion from 'void *' to 'char *' not permitted in C++ [-Wc++-compat]
  417 |     int rv = shmdt((Shmat_t)caddr);
      |                    ^~~~~~~~~~~~~~
Warning (mostly harmless): No library found for -lndbm
Warning (mostly harmless): No library found for -ldbm
Warning (mostly harmless): No library found for -ldbm
ODBM_File.xs:24:5: warning: identifier 'delete' conflicts with C++ keyword [-Wc++-compat]
   24 | int delete(datum key);
      |     ^~~~~~
Warning (mostly harmless): No library found for -lposix
Warning (mostly harmless): No library found for -lcposix
Warning (mostly harmless): No library found for -lsunmath
In file included from HiRes.xs:860:
const-c.inc: In function 'constant_19':
const-c.inc:351:42: warning: unused parameter 'iv_return' [-Wunused-parameter]
  351 | constant_19 (pTHX_ const char *name, IV *iv_return) {
      |                                      ~~~~^~~~~~~~~
re_exec.c: In function 'S_setup_EXACTISH_ST':
re_exec.c:4919:26: warning: array subscript has type 'char' [-Wchar-subscripts]
 4919 |                 lengths[m->count] = UVCHR_SKIP(fold_from);
      |                         ~^~~~~~~
re_exec.c:4928:26: warning: array subscript has type 'char' [-Wchar-subscripts]
 4928 |                 matches[m->count][0] = fold_from;
      |                         ~^~~~~~~
re_exec.c:4929:26: warning: array subscript has type 'char' [-Wchar-subscripts]
 4929 |                 lengths[m->count] = 1;
      |                         ~^~~~~~~
[2022-08-05 01:45:04-0400] Skip tests from '/export/home/core/smoke/TestSmoke/smokecurrent.skiptests'
[2022-08-05 01:45:04-0400] 
[2022-08-05 01:45:04-0400]  Tests start here:
[2022-08-05 01:45:04-0400] TSTENV = stdio	
make: Warning: Both `makefile' and `Makefile' exist
# Failed test 45 - setsockopt works for a constant that is once stringified at ./test.pl line 1177
#      got "Unexpected SO_RCVBUF value: 33232"
# expected "Ok."
# PROG: 
# use warnings;
# use strict;
# 
# use Socket qw'PF_INET SOCK_STREAM IPPROTO_TCP SOL_SOCKET SO_RCVBUF';
# 
# use constant { RCVBUF_SIZE => 32768 };
# 
# socket(my $sock, PF_INET, SOCK_STREAM, IPPROTO_TCP)
#   or die "Could not create socket - $!\n";
# 
# setsockopt($sock,SOL_SOCKET,SO_RCVBUF,RCVBUF_SIZE)
#   or die "Could not set SO_RCVBUF on socket - $!\n";
# 
# my $rcvBuf=getsockopt($sock,SOL_SOCKET,SO_RCVBUF)
#   or die "Could not get SO_RCVBUF on socket - $!\n";
# 
# $rcvBuf=unpack('i',$rcvBuf);
# 
# die "Unexpected SO_RCVBUF value: $rcvBuf\n"
#   unless($rcvBuf == RCVBUF_SIZE || $rcvBuf == 2*RCVBUF_SIZE);
# 
# print "Ok.\n";
# exit;
# 
# sub bug {RCVBUF_SIZE.''}
# STATUS: 7424
make: Fatal error: Command failed for target `test_harness'

error while running harness target 'test_harness': 1 at /export/home/core/smoke/TestSmoke/Test/Smoke/App/RunSmoke.pm line 118.
[2022-08-05 02:13:23-0400] 
[2022-08-05 02:13:23-0400] ../t/io/socket.t............................................FAILED
[2022-08-05 02:13:23-0400]     45
[2022-08-05 02:13:23-0400] Archived results...
[2022-08-05 02:13:23-0400] Unskip tests from '/export/home/core/smoke/TestSmoke/smokecurrent.skiptests'
[2022-08-05 02:13:23-0400] 
[2022-08-05 02:13:23-0400] Configuration: -Dusedevel -Dcc=gcc -DDEBUGGING
[2022-08-05 02:13:23-0400] ------------------------------------------------------------------------------
[2022-08-05 02:13:23-0400] make distclean ...
[2022-08-05 02:13:51-0400] 
[2022-08-05 02:13:51-0400] Copy Policy.sh ...
[2022-08-05 02:13:51-0400] 
[2022-08-05 02:13:51-0400] Configure ...

NOTE: You are using GNU as(1).  GNU as(1) might not build Perl.  If you
have trouble, you can use /usr/ccs/bin/as by including -B/usr/ccs/bin/
in your gcc command.  (Note that the trailing "/" is required.)

make: Warning: Both `makefile' and `Makefile' exist
Current working directory /export/home/core/smoke/perl-current
make: Warning: Both `makefile' and `Makefile' exist
Current working directory /export/home/core/smoke/perl-current
[2022-08-05 02:15:04-0400] 
[2022-08-05 02:15:04-0400] make ...
make: Warning: Both `makefile' and `Makefile' exist
regexec.c: In function 'S_setup_EXACTISH_ST':
regexec.c:4919:26: warning: array subscript has type 'char' [-Wchar-subscripts]
 4919 |                 lengths[m->count] = UVCHR_SKIP(fold_from);
      |                         ~^~~~~~~
regexec.c:4928:26: warning: array subscript has type 'char' [-Wchar-subscripts]
 4928 |                 matches[m->count][0] = fold_from;
      |                         ~^~~~~~~
regexec.c:4929:26: warning: array subscript has type 'char' [-Wchar-subscripts]
 4929 |                 lengths[m->count] = 1;
      |                         ~^~~~~~~
SysV.xs: In function 'XS_IPC__SysV_shmdt':
SysV.xs:417:20: warning: request for implicit conversion from 'void *' to 'char *' not permitted in C++ [-Wc++-compat]
  417 |     int rv = shmdt((Shmat_t)caddr);
      |                    ^~~~~~~~~~~~~~
Warning (mostly harmless): No library found for -lndbm
Warning (mostly harmless): No library found for -ldbm
Warning (mostly harmless): No library found for -ldbm
ODBM_File.xs:24:5: warning: identifier 'delete' conflicts with C++ keyword [-Wc++-compat]
   24 | int delete(datum key);
      |     ^~~~~~
Warning (mostly harmless): No library found for -lposix
Warning (mostly harmless): No library found for -lcposix
Warning (mostly harmless): No library found for -lsunmath
In file included from HiRes.xs:860:
const-c.inc: In function 'constant_19':
const-c.inc:351:42: warning: unused parameter 'iv_return' [-Wunused-parameter]
  351 | constant_19 (pTHX_ const char *name, IV *iv_return) {
      |                                      ~~~~^~~~~~~~~
re_exec.c: In function 'S_setup_EXACTISH_ST':
re_exec.c:4919:26: warning: array subscript has type 'char' [-Wchar-subscripts]
 4919 |                 lengths[m->count] = UVCHR_SKIP(fold_from);
      |                         ~^~~~~~~
re_exec.c:4928:26: warning: array subscript has type 'char' [-Wchar-subscripts]
 4928 |                 matches[m->count][0] = fold_from;
      |                         ~^~~~~~~
re_exec.c:4929:26: warning: array subscript has type 'char' [-Wchar-subscripts]
 4929 |                 lengths[m->count] = 1;
      |                         ~^~~~~~~
[2022-08-05 02:24:06-0400] Skip tests from '/export/home/core/smoke/TestSmoke/smokecurrent.skiptests'
[2022-08-05 02:24:06-0400] 
[2022-08-05 02:24:06-0400]  Tests start here:
[2022-08-05 02:24:06-0400] TSTENV = stdio	
make: Warning: Both `makefile' and `Makefile' exist
# Failed test 45 - setsockopt works for a constant that is once stringified at ./test.pl line 1177
#      got "Unexpected SO_RCVBUF value: 33232"
# expected "Ok."
# PROG: 
# use warnings;
# use strict;
# 
# use Socket qw'PF_INET SOCK_STREAM IPPROTO_TCP SOL_SOCKET SO_RCVBUF';
# 
# use constant { RCVBUF_SIZE => 32768 };
# 
# socket(my $sock, PF_INET, SOCK_STREAM, IPPROTO_TCP)
#   or die "Could not create socket - $!\n";
# 
# setsockopt($sock,SOL_SOCKET,SO_RCVBUF,RCVBUF_SIZE)
#   or die "Could not set SO_RCVBUF on socket - $!\n";
# 
# my $rcvBuf=getsockopt($sock,SOL_SOCKET,SO_RCVBUF)
#   or die "Could not get SO_RCVBUF on socket - $!\n";
# 
# $rcvBuf=unpack('i',$rcvBuf);
# 
# die "Unexpected SO_RCVBUF value: $rcvBuf\n"
#   unless($rcvBuf == RCVBUF_SIZE || $rcvBuf == 2*RCVBUF_SIZE);
# 
# print "Ok.\n";
# exit;
# 
# sub bug {RCVBUF_SIZE.''}
# STATUS: 7424
make: Fatal error: Command failed for target `test_harness'

error while running harness target 'test_harness': 1 at /export/home/core/smoke/TestSmoke/Test/Smoke/App/RunSmoke.pm line 118.
[2022-08-05 02:59:13-0400] 
[2022-08-05 02:59:13-0400] ../t/io/socket.t............................................FAILED
[2022-08-05 02:59:13-0400]     45
[2022-08-05 02:59:13-0400] Archived results...
[2022-08-05 02:59:13-0400] Unskip tests from '/export/home/core/smoke/TestSmoke/smokecurrent.skiptests'
[2022-08-05 02:59:13-0400] 
[2022-08-05 02:59:13-0400] Configuration: -Dusedevel -Dcc=gcc -Duse64bitall
[2022-08-05 02:59:13-0400] ------------------------------------------------------------------------------
[2022-08-05 02:59:13-0400] make distclean ...
[2022-08-05 02:59:46-0400] 
[2022-08-05 02:59:46-0400] Copy Policy.sh ...
[2022-08-05 02:59:46-0400] 
[2022-08-05 02:59:46-0400] Configure ...

NOTE: You are using GNU as(1).  GNU as(1) might not build Perl.  If you
have trouble, you can use /usr/ccs/bin/as by including -B/usr/ccs/bin/
in your gcc command.  (Note that the trailing "/" is required.)

make: Warning: Both `makefile' and `Makefile' exist
Current working directory /export/home/core/smoke/perl-current
make: Warning: Both `makefile' and `Makefile' exist
Current working directory /export/home/core/smoke/perl-current
[2022-08-05 03:00:50-0400] 
[2022-08-05 03:00:50-0400] make ...
make: Warning: Both `makefile' and `Makefile' exist
regexec.c: In function 'S_setup_EXACTISH_ST':
regexec.c:4919:26: warning: array subscript has type 'char' [-Wchar-subscripts]
 4919 |                 lengths[m->count] = UVCHR_SKIP(fold_from);
      |                         ~^~~~~~~
regexec.c:4928:26: warning: array subscript has type 'char' [-Wchar-subscripts]
 4928 |                 matches[m->count][0] = fold_from;
      |                         ~^~~~~~~
regexec.c:4929:26: warning: array subscript has type 'char' [-Wchar-subscripts]
 4929 |                 lengths[m->count] = 1;
      |                         ~^~~~~~~
SysV.xs: In function 'XS_IPC__SysV_shmdt':
SysV.xs:417:20: warning: request for implicit conversion from 'void *' to 'char *' not permitted in C++ [-Wc++-compat]
  417 |     int rv = shmdt((Shmat_t)caddr);
      |                    ^~~~~~~~~~~~~~
Warning (mostly harmless): No library found for -lndbm
Warning (mostly harmless): No library found for -ldbm
Warning (mostly harmless): No library found for -ldbm
ODBM_File.xs:24:5: warning: identifier 'delete' conflicts with C++ keyword [-Wc++-compat]
   24 | int delete(datum key);
      |     ^~~~~~
Warning (mostly harmless): No library found for -lposix
Warning (mostly harmless): No library found for -lcposix
Warning (mostly harmless): No library found for -lsunmath
In file included from HiRes.xs:860:
const-c.inc: In function 'constant_19':
const-c.inc:351:42: warning: unused parameter 'iv_return' [-Wunused-parameter]
  351 | constant_19 (pTHX_ const char *name, IV *iv_return) {
      |                                      ~~~~^~~~~~~~~
re_exec.c: In function 'S_setup_EXACTISH_ST':
re_exec.c:4919:26: warning: array subscript has type 'char' [-Wchar-subscripts]
 4919 |                 lengths[m->count] = UVCHR_SKIP(fold_from);
      |                         ~^~~~~~~
re_exec.c:4928:26: warning: array subscript has type 'char' [-Wchar-subscripts]
 4928 |                 matches[m->count][0] = fold_from;
      |                         ~^~~~~~~
re_exec.c:4929:26: warning: array subscript has type 'char' [-Wchar-subscripts]
 4929 |                 lengths[m->count] = 1;
      |                         ~^~~~~~~
[2022-08-05 03:06:48-0400] Skip tests from '/export/home/core/smoke/TestSmoke/smokecurrent.skiptests'
[2022-08-05 03:06:48-0400] 
[2022-08-05 03:06:48-0400]  Tests start here:
[2022-08-05 03:06:48-0400] TSTENV = stdio	
make: Warning: Both `makefile' and `Makefile' exist
# Failed test 45 - setsockopt works for a constant that is once stringified at ./test.pl line 1177
#      got "Unexpected SO_RCVBUF value: 33232"
# expected "Ok."
# PROG: 
# use warnings;
# use strict;
# 
# use Socket qw'PF_INET SOCK_STREAM IPPROTO_TCP SOL_SOCKET SO_RCVBUF';
# 
# use constant { RCVBUF_SIZE => 32768 };
# 
# socket(my $sock, PF_INET, SOCK_STREAM, IPPROTO_TCP)
#   or die "Could not create socket - $!\n";
# 
# setsockopt($sock,SOL_SOCKET,SO_RCVBUF,RCVBUF_SIZE)
#   or die "Could not set SO_RCVBUF on socket - $!\n";
# 
# my $rcvBuf=getsockopt($sock,SOL_SOCKET,SO_RCVBUF)
#   or die "Could not get SO_RCVBUF on socket - $!\n";
# 
# $rcvBuf=unpack('i',$rcvBuf);
# 
# die "Unexpected SO_RCVBUF value: $rcvBuf\n"
#   unless($rcvBuf == RCVBUF_SIZE || $rcvBuf == 2*RCVBUF_SIZE);
# 
# print "Ok.\n";
# exit;
# 
# sub bug {RCVBUF_SIZE.''}
# STATUS: 7424
make: Fatal error: Command failed for target `test_harness'

error while running harness target 'test_harness': 1 at /export/home/core/smoke/TestSmoke/Test/Smoke/App/RunSmoke.pm line 118.
[2022-08-05 03:35:13-0400] 
[2022-08-05 03:35:13-0400] ../t/io/socket.t............................................FAILED
[2022-08-05 03:35:13-0400]     45
[2022-08-05 03:35:13-0400] Archived results...
[2022-08-05 03:35:13-0400] Unskip tests from '/export/home/core/smoke/TestSmoke/smokecurrent.skiptests'
[2022-08-05 03:35:13-0400] 
[2022-08-05 03:35:13-0400] Configuration: -Dusedevel -Dcc=gcc -Duse64bitall -DDEBUGGING
[2022-08-05 03:35:13-0400] ------------------------------------------------------------------------------
[2022-08-05 03:35:13-0400] make distclean ...
[2022-08-05 03:35:43-0400] 
[2022-08-05 03:35:43-0400] Copy Policy.sh ...
[2022-08-05 03:35:43-0400] 
[2022-08-05 03:35:43-0400] Configure ...

NOTE: You are using GNU as(1).  GNU as(1) might not build Perl.  If you
have trouble, you can use /usr/ccs/bin/as by including -B/usr/ccs/bin/
in your gcc command.  (Note that the trailing "/" is required.)

make: Warning: Both `makefile' and `Makefile' exist
Current working directory /export/home/core/smoke/perl-current
make: Warning: Both `makefile' and `Makefile' exist
Current working directory /export/home/core/smoke/perl-current
[2022-08-05 03:36:53-0400] 
[2022-08-05 03:36:53-0400] make ...
make: Warning: Both `makefile' and `Makefile' exist
regexec.c: In function 'S_setup_EXACTISH_ST':
regexec.c:4919:26: warning: array subscript has type 'char' [-Wchar-subscripts]
 4919 |                 lengths[m->count] = UVCHR_SKIP(fold_from);
      |                         ~^~~~~~~
regexec.c:4928:26: warning: array subscript has type 'char' [-Wchar-subscripts]
 4928 |                 matches[m->count][0] = fold_from;
      |                         ~^~~~~~~
regexec.c:4929:26: warning: array subscript has type 'char' [-Wchar-subscripts]
 4929 |                 lengths[m->count] = 1;
      |                         ~^~~~~~~
SysV.xs: In function 'XS_IPC__SysV_shmdt':
SysV.xs:417:20: warning: request for implicit conversion from 'void *' to 'char *' not permitted in C++ [-Wc++-compat]
  417 |     int rv = shmdt((Shmat_t)caddr);
      |                    ^~~~~~~~~~~~~~
Warning (mostly harmless): No library found for -lndbm
Warning (mostly harmless): No library found for -ldbm
Warning (mostly harmless): No library found for -ldbm
ODBM_File.xs:24:5: warning: identifier 'delete' conflicts with C++ keyword [-Wc++-compat]
   24 | int delete(datum key);
      |     ^~~~~~
Warning (mostly harmless): No library found for -lposix
Warning (mostly harmless): No library found for -lcposix
Warning (mostly harmless): No library found for -lsunmath
In file included from HiRes.xs:860:
const-c.inc: In function 'constant_19':
const-c.inc:351:42: warning: unused parameter 'iv_return' [-Wunused-parameter]
  351 | constant_19 (pTHX_ const char *name, IV *iv_return) {
      |                                      ~~~~^~~~~~~~~
re_exec.c: In function 'S_setup_EXACTISH_ST':
re_exec.c:4919:26: warning: array subscript has type 'char' [-Wchar-subscripts]
 4919 |                 lengths[m->count] = UVCHR_SKIP(fold_from);
      |                         ~^~~~~~~
re_exec.c:4928:26: warning: array subscript has type 'char' [-Wchar-subscripts]
 4928 |                 matches[m->count][0] = fold_from;
      |                         ~^~~~~~~
re_exec.c:4929:26: warning: array subscript has type 'char' [-Wchar-subscripts]
 4929 |                 lengths[m->count] = 1;
      |                         ~^~~~~~~
[2022-08-05 03:45:32-0400] Skip tests from '/export/home/core/smoke/TestSmoke/smokecurrent.skiptests'
[2022-08-05 03:45:32-0400] 
[2022-08-05 03:45:32-0400]  Tests start here:
[2022-08-05 03:45:32-0400] TSTENV = stdio	
make: Warning: Both `makefile' and `Makefile' exist
# Failed test 45 - setsockopt works for a constant that is once stringified at ./test.pl line 1177
#      got "Unexpected SO_RCVBUF value: 33232"
# expected "Ok."
# PROG: 
# use warnings;
# use strict;
# 
# use Socket qw'PF_INET SOCK_STREAM IPPROTO_TCP SOL_SOCKET SO_RCVBUF';
# 
# use constant { RCVBUF_SIZE => 32768 };
# 
# socket(my $sock, PF_INET, SOCK_STREAM, IPPROTO_TCP)
#   or die "Could not create socket - $!\n";
# 
# setsockopt($sock,SOL_SOCKET,SO_RCVBUF,RCVBUF_SIZE)
#   or die "Could not set SO_RCVBUF on socket - $!\n";
# 
# my $rcvBuf=getsockopt($sock,SOL_SOCKET,SO_RCVBUF)
#   or die "Could not get SO_RCVBUF on socket - $!\n";
# 
# $rcvBuf=unpack('i',$rcvBuf);
# 
# die "Unexpected SO_RCVBUF value: $rcvBuf\n"
#   unless($rcvBuf == RCVBUF_SIZE || $rcvBuf == 2*RCVBUF_SIZE);
# 
# print "Ok.\n";
# exit;
# 
# sub bug {RCVBUF_SIZE.''}
# STATUS: 7424
make: Fatal error: Command failed for target `test_harness'

error while running harness target 'test_harness': 1 at /export/home/core/smoke/TestSmoke/Test/Smoke/App/RunSmoke.pm line 118.
[2022-08-05 04:20:41-0400] 
[2022-08-05 04:20:41-0400] ../t/io/socket.t............................................FAILED
[2022-08-05 04:20:41-0400]     45
[2022-08-05 04:20:41-0400] Archived results...
[2022-08-05 04:20:41-0400] Unskip tests from '/export/home/core/smoke/TestSmoke/smokecurrent.skiptests'
[2022-08-05 04:20:41-0400] 
[2022-08-05 04:20:41-0400] Configuration: -Dusedevel -Dcc=gcc -Duselongdouble
[2022-08-05 04:20:41-0400] ------------------------------------------------------------------------------
[2022-08-05 04:20:41-0400] make distclean ...
[2022-08-05 04:21:17-0400] 
[2022-08-05 04:21:17-0400] Copy Policy.sh ...
[2022-08-05 04:21:17-0400] 
[2022-08-05 04:21:17-0400] Configure ...

NOTE: You are using GNU as(1).  GNU as(1) might not build Perl.  If you
have trouble, you can use /usr/ccs/bin/as by including -B/usr/ccs/bin/
in your gcc command.  (Note that the trailing "/" is required.)

make: Warning: Both `makefile' and `Makefile' exist
Current working directory /export/home/core/smoke/perl-current
make: Warning: Both `makefile' and `Makefile' exist
Current working directory /export/home/core/smoke/perl-current
[2022-08-05 04:22:23-0400] 
[2022-08-05 04:22:23-0400] make ...
make: Warning: Both `makefile' and `Makefile' exist
regexec.c: In function 'S_setup_EXACTISH_ST':
regexec.c:4919:26: warning: array subscript has type 'char' [-Wchar-subscripts]
 4919 |                 lengths[m->count] = UVCHR_SKIP(fold_from);
      |                         ~^~~~~~~
regexec.c:4928:26: warning: array subscript has type 'char' [-Wchar-subscripts]
 4928 |                 matches[m->count][0] = fold_from;
      |                         ~^~~~~~~
regexec.c:4929:26: warning: array subscript has type 'char' [-Wchar-subscripts]
 4929 |                 lengths[m->count] = 1;
      |                         ~^~~~~~~
SysV.xs: In function 'XS_IPC__SysV_shmdt':
SysV.xs:417:20: warning: request for implicit conversion from 'void *' to 'char *' not permitted in C++ [-Wc++-compat]
  417 |     int rv = shmdt((Shmat_t)caddr);
      |                    ^~~~~~~~~~~~~~
Warning (mostly harmless): No library found for -lndbm
Warning (mostly harmless): No library found for -ldbm
Warning (mostly harmless): No library found for -ldbm
ODBM_File.xs:24:5: warning: identifier 'delete' conflicts with C++ keyword [-Wc++-compat]
   24 | int delete(datum key);
      |     ^~~~~~
Warning (mostly harmless): No library found for -lposix
Warning (mostly harmless): No library found for -lcposix
Warning (mostly harmless): No library found for -lsunmath
In file included from HiRes.xs:860:
const-c.inc: In function 'constant_19':
const-c.inc:351:42: warning: unused parameter 'iv_return' [-Wunused-parameter]
  351 | constant_19 (pTHX_ const char *name, IV *iv_return) {
      |                                      ~~~~^~~~~~~~~
re_exec.c: In function 'S_setup_EXACTISH_ST':
re_exec.c:4919:26: warning: array subscript has type 'char' [-Wchar-subscripts]
 4919 |                 lengths[m->count] = UVCHR_SKIP(fold_from);
      |                         ~^~~~~~~
re_exec.c:4928:26: warning: array subscript has type 'char' [-Wchar-subscripts]
 4928 |                 matches[m->count][0] = fold_from;
      |                         ~^~~~~~~
re_exec.c:4929:26: warning: array subscript has type 'char' [-Wchar-subscripts]
 4929 |                 lengths[m->count] = 1;
      |                         ~^~~~~~~
[2022-08-05 04:28:23-0400] Skip tests from '/export/home/core/smoke/TestSmoke/smokecurrent.skiptests'
[2022-08-05 04:28:23-0400] 
[2022-08-05 04:28:23-0400]  Tests start here:
[2022-08-05 04:28:23-0400] TSTENV = stdio	
make: Warning: Both `makefile' and `Makefile' exist
# Failed test 45 - setsockopt works for a constant that is once stringified at ./test.pl line 1177
#      got "Unexpected SO_RCVBUF value: 33232"
# expected "Ok."
# PROG: 
# use warnings;
# use strict;
# 
# use Socket qw'PF_INET SOCK_STREAM IPPROTO_TCP SOL_SOCKET SO_RCVBUF';
# 
# use constant { RCVBUF_SIZE => 32768 };
# 
# socket(my $sock, PF_INET, SOCK_STREAM, IPPROTO_TCP)
#   or die "Could not create socket - $!\n";
# 
# setsockopt($sock,SOL_SOCKET,SO_RCVBUF,RCVBUF_SIZE)
#   or die "Could not set SO_RCVBUF on socket - $!\n";
# 
# my $rcvBuf=getsockopt($sock,SOL_SOCKET,SO_RCVBUF)
#   or die "Could not get SO_RCVBUF on socket - $!\n";
# 
# $rcvBuf=unpack('i',$rcvBuf);
# 
# die "Unexpected SO_RCVBUF value: $rcvBuf\n"
#   unless($rcvBuf == RCVBUF_SIZE || $rcvBuf == 2*RCVBUF_SIZE);
# 
# print "Ok.\n";
# exit;
# 
# sub bug {RCVBUF_SIZE.''}
# STATUS: 7424
make: Fatal error: Command failed for target `test_harness'

error while running harness target 'test_harness': 1 at /export/home/core/smoke/TestSmoke/Test/Smoke/App/RunSmoke.pm line 118.
[2022-08-05 04:56:43-0400] 
[2022-08-05 04:56:43-0400] ../t/io/socket.t............................................FAILED
[2022-08-05 04:56:43-0400]     45
[2022-08-05 04:56:43-0400] Archived results...
[2022-08-05 04:56:43-0400] Unskip tests from '/export/home/core/smoke/TestSmoke/smokecurrent.skiptests'
[2022-08-05 04:56:43-0400] 
[2022-08-05 04:56:43-0400] Configuration: -Dusedevel -Dcc=gcc -Duselongdouble -DDEBUGGING
[2022-08-05 04:56:43-0400] ------------------------------------------------------------------------------
[2022-08-05 04:56:43-0400] make distclean ...
[2022-08-05 04:57:11-0400] 
[2022-08-05 04:57:11-0400] Copy Policy.sh ...
[2022-08-05 04:57:11-0400] 
[2022-08-05 04:57:11-0400] Configure ...

NOTE: You are using GNU as(1).  GNU as(1) might not build Perl.  If you
have trouble, you can use /usr/ccs/bin/as by including -B/usr/ccs/bin/
in your gcc command.  (Note that the trailing "/" is required.)

make: Warning: Both `makefile' and `Makefile' exist
Current working directory /export/home/core/smoke/perl-current
make: Warning: Both `makefile' and `Makefile' exist
Current working directory /export/home/core/smoke/perl-current
[2022-08-05 04:58:21-0400] 
[2022-08-05 04:58:21-0400] make ...
make: Warning: Both `makefile' and `Makefile' exist
regexec.c: In function 'S_setup_EXACTISH_ST':
regexec.c:4919:26: warning: array subscript has type 'char' [-Wchar-subscripts]
 4919 |                 lengths[m->count] = UVCHR_SKIP(fold_from);
      |                         ~^~~~~~~
regexec.c:4928:26: warning: array subscript has type 'char' [-Wchar-subscripts]
 4928 |                 matches[m->count][0] = fold_from;
      |                         ~^~~~~~~
regexec.c:4929:26: warning: array subscript has type 'char' [-Wchar-subscripts]
 4929 |                 lengths[m->count] = 1;
      |                         ~^~~~~~~
SysV.xs: In function 'XS_IPC__SysV_shmdt':
SysV.xs:417:20: warning: request for implicit conversion from 'void *' to 'char *' not permitted in C++ [-Wc++-compat]
  417 |     int rv = shmdt((Shmat_t)caddr);
      |                    ^~~~~~~~~~~~~~
Warning (mostly harmless): No library found for -lndbm
Warning (mostly harmless): No library found for -ldbm
Warning (mostly harmless): No library found for -ldbm
ODBM_File.xs:24:5: warning: identifier 'delete' conflicts with C++ keyword [-Wc++-compat]
   24 | int delete(datum key);
      |     ^~~~~~
Warning (mostly harmless): No library found for -lposix
Warning (mostly harmless): No library found for -lcposix
Warning (mostly harmless): No library found for -lsunmath
In file included from HiRes.xs:860:
const-c.inc: In function 'constant_19':
const-c.inc:351:42: warning: unused parameter 'iv_return' [-Wunused-parameter]
  351 | constant_19 (pTHX_ const char *name, IV *iv_return) {
      |                                      ~~~~^~~~~~~~~
re_exec.c: In function 'S_setup_EXACTISH_ST':
re_exec.c:4919:26: warning: array subscript has type 'char' [-Wchar-subscripts]
 4919 |                 lengths[m->count] = UVCHR_SKIP(fold_from);
      |                         ~^~~~~~~
re_exec.c:4928:26: warning: array subscript has type 'char' [-Wchar-subscripts]
 4928 |                 matches[m->count][0] = fold_from;
      |                         ~^~~~~~~
re_exec.c:4929:26: warning: array subscript has type 'char' [-Wchar-subscripts]
 4929 |                 lengths[m->count] = 1;
      |                         ~^~~~~~~
[2022-08-05 05:07:04-0400] Skip tests from '/export/home/core/smoke/TestSmoke/smokecurrent.skiptests'
[2022-08-05 05:07:04-0400] 
[2022-08-05 05:07:04-0400]  Tests start here:
[2022-08-05 05:07:04-0400] TSTENV = stdio	
make: Warning: Both `makefile' and `Makefile' exist
# Failed test 45 - setsockopt works for a constant that is once stringified at ./test.pl line 1177
#      got "Unexpected SO_RCVBUF value: 33232"
# expected "Ok."
# PROG: 
# use warnings;
# use strict;
# 
# use Socket qw'PF_INET SOCK_STREAM IPPROTO_TCP SOL_SOCKET SO_RCVBUF';
# 
# use constant { RCVBUF_SIZE => 32768 };
# 
# socket(my $sock, PF_INET, SOCK_STREAM, IPPROTO_TCP)
#   or die "Could not create socket - $!\n";
# 
# setsockopt($sock,SOL_SOCKET,SO_RCVBUF,RCVBUF_SIZE)
#   or die "Could not set SO_RCVBUF on socket - $!\n";
# 
# my $rcvBuf=getsockopt($sock,SOL_SOCKET,SO_RCVBUF)
#   or die "Could not get SO_RCVBUF on socket - $!\n";
# 
# $rcvBuf=unpack('i',$rcvBuf);
# 
# die "Unexpected SO_RCVBUF value: $rcvBuf\n"
#   unless($rcvBuf == RCVBUF_SIZE || $rcvBuf == 2*RCVBUF_SIZE);
# 
# print "Ok.\n";
# exit;
# 
# sub bug {RCVBUF_SIZE.''}
# STATUS: 7424
make: Fatal error: Command failed for target `test_harness'

error while running harness target 'test_harness': 1 at /export/home/core/smoke/TestSmoke/Test/Smoke/App/RunSmoke.pm line 118.
[2022-08-05 05:42:08-0400] 
[2022-08-05 05:42:08-0400] ../t/io/socket.t............................................FAILED
[2022-08-05 05:42:08-0400]     45
[2022-08-05 05:42:08-0400] Archived results...
[2022-08-05 05:42:08-0400] Unskip tests from '/export/home/core/smoke/TestSmoke/smokecurrent.skiptests'
[2022-08-05 05:42:08-0400] 
[2022-08-05 05:42:08-0400] Configuration: -Dusedevel -Dcc=gcc -Duseithreads
[2022-08-05 05:42:08-0400] ------------------------------------------------------------------------------
[2022-08-05 05:42:08-0400] make distclean ...
[2022-08-05 05:42:41-0400] 
[2022-08-05 05:42:41-0400] Copy Policy.sh ...
[2022-08-05 05:42:41-0400] 
[2022-08-05 05:42:41-0400] Configure ...

NOTE: You are using GNU as(1).  GNU as(1) might not build Perl.  If you
have trouble, you can use /usr/ccs/bin/as by including -B/usr/ccs/bin/
in your gcc command.  (Note that the trailing "/" is required.)

make: Warning: Both `makefile' and `Makefile' exist
Current working directory /export/home/core/smoke/perl-current
make: Warning: Both `makefile' and `Makefile' exist
Current working directory /export/home/core/smoke/perl-current
[2022-08-05 05:43:52-0400] 
[2022-08-05 05:43:52-0400] make ...
make: Warning: Both `makefile' and `Makefile' exist
regexec.c: In function 'S_setup_EXACTISH_ST':
regexec.c:4919:26: warning: array subscript has type 'char' [-Wchar-subscripts]
 4919 |                 lengths[m->count] = UVCHR_SKIP(fold_from);
      |                         ~^~~~~~~
regexec.c:4928:26: warning: array subscript has type 'char' [-Wchar-subscripts]
 4928 |                 matches[m->count][0] = fold_from;
      |                         ~^~~~~~~
regexec.c:4929:26: warning: array subscript has type 'char' [-Wchar-subscripts]
 4929 |                 lengths[m->count] = 1;
      |                         ~^~~~~~~
SysV.xs: In function 'XS_IPC__SysV_shmdt':
SysV.xs:417:20: warning: request for implicit conversion from 'void *' to 'char *' not permitted in C++ [-Wc++-compat]
  417 |     int rv = shmdt((Shmat_t)caddr);
      |                    ^~~~~~~~~~~~~~
Warning (mostly harmless): No library found for -lndbm
Warning (mostly harmless): No library found for -ldbm
Warning (mostly harmless): No library found for -ldbm
ODBM_File.xs:24:5: warning: identifier 'delete' conflicts with C++ keyword [-Wc++-compat]
   24 | int delete(datum key);
      |     ^~~~~~
Warning (mostly harmless): No library found for -lposix
Warning (mostly harmless): No library found for -lcposix
Warning (mostly harmless): No library found for -lsunmath
In file included from HiRes.xs:860:
const-c.inc: In function 'constant_19':
const-c.inc:351:42: warning: unused parameter 'iv_return' [-Wunused-parameter]
  351 | constant_19 (pTHX_ const char *name, IV *iv_return) {
      |                                      ~~~~^~~~~~~~~
re_exec.c: In function 'S_setup_EXACTISH_ST':
re_exec.c:4919:26: warning: array subscript has type 'char' [-Wchar-subscripts]
 4919 |                 lengths[m->count] = UVCHR_SKIP(fold_from);
      |                         ~^~~~~~~
re_exec.c:4928:26: warning: array subscript has type 'char' [-Wchar-subscripts]
 4928 |                 matches[m->count][0] = fold_from;
      |                         ~^~~~~~~
re_exec.c:4929:26: warning: array subscript has type 'char' [-Wchar-subscripts]
 4929 |                 lengths[m->count] = 1;
      |                         ~^~~~~~~
[2022-08-05 05:50:21-0400] Skip tests from '/export/home/core/smoke/TestSmoke/smokecurrent.skiptests'
[2022-08-05 05:50:21-0400] 
[2022-08-05 05:50:21-0400]  Tests start here:
[2022-08-05 05:50:21-0400] TSTENV = stdio	
make: Warning: Both `makefile' and `Makefile' exist
# Failed test 45 - setsockopt works for a constant that is once stringified at ./test.pl line 1177
#      got "Unexpected SO_RCVBUF value: 33232"
# expected "Ok."
# PROG: 
# use warnings;
# use strict;
# 
# use Socket qw'PF_INET SOCK_STREAM IPPROTO_TCP SOL_SOCKET SO_RCVBUF';
# 
# use constant { RCVBUF_SIZE => 32768 };
# 
# socket(my $sock, PF_INET, SOCK_STREAM, IPPROTO_TCP)
#   or die "Could not create socket - $!\n";
# 
# setsockopt($sock,SOL_SOCKET,SO_RCVBUF,RCVBUF_SIZE)
#   or die "Could not set SO_RCVBUF on socket - $!\n";
# 
# my $rcvBuf=getsockopt($sock,SOL_SOCKET,SO_RCVBUF)
#   or die "Could not get SO_RCVBUF on socket - $!\n";
# 
# $rcvBuf=unpack('i',$rcvBuf);
# 
# die "Unexpected SO_RCVBUF value: $rcvBuf\n"
#   unless($rcvBuf == RCVBUF_SIZE || $rcvBuf == 2*RCVBUF_SIZE);
# 
# print "Ok.\n";
# exit;
# 
# sub bug {RCVBUF_SIZE.''}
# STATUS: 7424
make: Fatal error: Command failed for target `test_harness'

error while running harness target 'test_harness': 1 at /export/home/core/smoke/TestSmoke/Test/Smoke/App/RunSmoke.pm line 118.
[2022-08-05 06:22:37-0400] 
[2022-08-05 06:22:37-0400] ../t/io/socket.t............................................FAILED
[2022-08-05 06:22:37-0400]     45
[2022-08-05 06:22:37-0400] Archived results...
[2022-08-05 06:22:37-0400] Unskip tests from '/export/home/core/smoke/TestSmoke/smokecurrent.skiptests'
[2022-08-05 06:22:37-0400] 
[2022-08-05 06:22:37-0400] Configuration: -Dusedevel -Dcc=gcc -Duseithreads -DDEBUGGING
[2022-08-05 06:22:37-0400] ------------------------------------------------------------------------------
[2022-08-05 06:22:37-0400] make distclean ...
[2022-08-05 06:23:09-0400] 
[2022-08-05 06:23:09-0400] Copy Policy.sh ...
[2022-08-05 06:23:09-0400] 
[2022-08-05 06:23:09-0400] Configure ...

NOTE: You are using GNU as(1).  GNU as(1) might not build Perl.  If you
have trouble, you can use /usr/ccs/bin/as by including -B/usr/ccs/bin/
in your gcc command.  (Note that the trailing "/" is required.)

make: Warning: Both `makefile' and `Makefile' exist
Current working directory /export/home/core/smoke/perl-current
make: Warning: Both `makefile' and `Makefile' exist
Current working directory /export/home/core/smoke/perl-current
[2022-08-05 06:24:25-0400] 
[2022-08-05 06:24:25-0400] make ...
make: Warning: Both `makefile' and `Makefile' exist
regexec.c: In function 'S_setup_EXACTISH_ST':
regexec.c:4919:26: warning: array subscript has type 'char' [-Wchar-subscripts]
 4919 |                 lengths[m->count] = UVCHR_SKIP(fold_from);
      |                         ~^~~~~~~
regexec.c:4928:26: warning: array subscript has type 'char' [-Wchar-subscripts]
 4928 |                 matches[m->count][0] = fold_from;
      |                         ~^~~~~~~
regexec.c:4929:26: warning: array subscript has type 'char' [-Wchar-subscripts]
 4929 |                 lengths[m->count] = 1;
      |                         ~^~~~~~~
SysV.xs: In function 'XS_IPC__SysV_shmdt':
SysV.xs:417:20: warning: request for implicit conversion from 'void *' to 'char *' not permitted in C++ [-Wc++-compat]
  417 |     int rv = shmdt((Shmat_t)caddr);
      |                    ^~~~~~~~~~~~~~
Warning (mostly harmless): No library found for -lndbm
Warning (mostly harmless): No library found for -ldbm
Warning (mostly harmless): No library found for -ldbm
ODBM_File.xs:24:5: warning: identifier 'delete' conflicts with C++ keyword [-Wc++-compat]
   24 | int delete(datum key);
      |     ^~~~~~
Warning (mostly harmless): No library found for -lposix
Warning (mostly harmless): No library found for -lcposix
Warning (mostly harmless): No library found for -lsunmath
In file included from HiRes.xs:860:
const-c.inc: In function 'constant_19':
const-c.inc:351:42: warning: unused parameter 'iv_return' [-Wunused-parameter]
  351 | constant_19 (pTHX_ const char *name, IV *iv_return) {
      |                                      ~~~~^~~~~~~~~
re_exec.c: In function 'S_setup_EXACTISH_ST':
re_exec.c:4919:26: warning: array subscript has type 'char' [-Wchar-subscripts]
 4919 |                 lengths[m->count] = UVCHR_SKIP(fold_from);
      |                         ~^~~~~~~
re_exec.c:4928:26: warning: array subscript has type 'char' [-Wchar-subscripts]
 4928 |                 matches[m->count][0] = fold_from;
      |                         ~^~~~~~~
re_exec.c:4929:26: warning: array subscript has type 'char' [-Wchar-subscripts]
 4929 |                 lengths[m->count] = 1;
      |                         ~^~~~~~~
[2022-08-05 06:33:39-0400] Skip tests from '/export/home/core/smoke/TestSmoke/smokecurrent.skiptests'
[2022-08-05 06:33:39-0400] 
[2022-08-05 06:33:39-0400]  Tests start here:
[2022-08-05 06:33:39-0400] TSTENV = stdio	
make: Warning: Both `makefile' and `Makefile' exist
# Failed test 45 - setsockopt works for a constant that is once stringified at ./test.pl line 1177
#      got "Unexpected SO_RCVBUF value: 33232"
# expected "Ok."
# PROG: 
# use warnings;
# use strict;
# 
# use Socket qw'PF_INET SOCK_STREAM IPPROTO_TCP SOL_SOCKET SO_RCVBUF';
# 
# use constant { RCVBUF_SIZE => 32768 };
# 
# socket(my $sock, PF_INET, SOCK_STREAM, IPPROTO_TCP)
#   or die "Could not create socket - $!\n";
# 
# setsockopt($sock,SOL_SOCKET,SO_RCVBUF,RCVBUF_SIZE)
#   or die "Could not set SO_RCVBUF on socket - $!\n";
# 
# my $rcvBuf=getsockopt($sock,SOL_SOCKET,SO_RCVBUF)
#   or die "Could not get SO_RCVBUF on socket - $!\n";
# 
# $rcvBuf=unpack('i',$rcvBuf);
# 
# die "Unexpected SO_RCVBUF value: $rcvBuf\n"
#   unless($rcvBuf == RCVBUF_SIZE || $rcvBuf == 2*RCVBUF_SIZE);
# 
# print "Ok.\n";
# exit;
# 
# sub bug {RCVBUF_SIZE.''}
# STATUS: 7424
make: Fatal error: Command failed for target `test_harness'

error while running harness target 'test_harness': 1 at /export/home/core/smoke/TestSmoke/Test/Smoke/App/RunSmoke.pm line 118.
[2022-08-05 07:15:17-0400] 
[2022-08-05 07:15:17-0400] ../t/io/socket.t............................................FAILED
[2022-08-05 07:15:17-0400]     45
[2022-08-05 07:15:17-0400] Archived results...
[2022-08-05 07:15:17-0400] Unskip tests from '/export/home/core/smoke/TestSmoke/smokecurrent.skiptests'
[2022-08-05 07:15:17-0400] 
[2022-08-05 07:15:17-0400] Configuration: -Dusedevel -Dcc=gcc -Duseithreads -Duse64bitall
[2022-08-05 07:15:17-0400] ------------------------------------------------------------------------------
[2022-08-05 07:15:17-0400] make distclean ...
[2022-08-05 07:15:57-0400] 
[2022-08-05 07:15:57-0400] Copy Policy.sh ...
[2022-08-05 07:15:57-0400] 
[2022-08-05 07:15:57-0400] Configure ...

NOTE: You are using GNU as(1).  GNU as(1) might not build Perl.  If you
have trouble, you can use /usr/ccs/bin/as by including -B/usr/ccs/bin/
in your gcc command.  (Note that the trailing "/" is required.)

make: Warning: Both `makefile' and `Makefile' exist
Current working directory /export/home/core/smoke/perl-current
make: Warning: Both `makefile' and `Makefile' exist
Current working directory /export/home/core/smoke/perl-current
[2022-08-05 07:17:14-0400] 
[2022-08-05 07:17:14-0400] make ...
make: Warning: Both `makefile' and `Makefile' exist
regexec.c: In function 'S_setup_EXACTISH_ST':
regexec.c:4919:26: warning: array subscript has type 'char' [-Wchar-subscripts]
 4919 |                 lengths[m->count] = UVCHR_SKIP(fold_from);
      |                         ~^~~~~~~
regexec.c:4928:26: warning: array subscript has type 'char' [-Wchar-subscripts]
 4928 |                 matches[m->count][0] = fold_from;
      |                         ~^~~~~~~
regexec.c:4929:26: warning: array subscript has type 'char' [-Wchar-subscripts]
 4929 |                 lengths[m->count] = 1;
      |                         ~^~~~~~~
SysV.xs: In function 'XS_IPC__SysV_shmdt':
SysV.xs:417:20: warning: request for implicit conversion from 'void *' to 'char *' not permitted in C++ [-Wc++-compat]
  417 |     int rv = shmdt((Shmat_t)caddr);
      |                    ^~~~~~~~~~~~~~
Warning (mostly harmless): No library found for -lndbm
Warning (mostly harmless): No library found for -ldbm
Warning (mostly harmless): No library found for -ldbm
ODBM_File.xs:24:5: warning: identifier 'delete' conflicts with C++ keyword [-Wc++-compat]
   24 | int delete(datum key);
      |     ^~~~~~
Warning (mostly harmless): No library found for -lposix
Warning (mostly harmless): No library found for -lcposix
Warning (mostly harmless): No library found for -lsunmath
In file included from HiRes.xs:860:
const-c.inc: In function 'constant_19':
const-c.inc:351:42: warning: unused parameter 'iv_return' [-Wunused-parameter]
  351 | constant_19 (pTHX_ const char *name, IV *iv_return) {
      |                                      ~~~~^~~~~~~~~
re_exec.c: In function 'S_setup_EXACTISH_ST':
re_exec.c:4919:26: warning: array subscript has type 'char' [-Wchar-subscripts]
 4919 |                 lengths[m->count] = UVCHR_SKIP(fold_from);
      |                         ~^~~~~~~
re_exec.c:4928:26: warning: array subscript has type 'char' [-Wchar-subscripts]
 4928 |                 matches[m->count][0] = fold_from;
      |                         ~^~~~~~~
re_exec.c:4929:26: warning: array subscript has type 'char' [-Wchar-subscripts]
 4929 |                 lengths[m->count] = 1;
      |                         ~^~~~~~~
[2022-08-05 07:23:44-0400] Skip tests from '/export/home/core/smoke/TestSmoke/smokecurrent.skiptests'
[2022-08-05 07:23:44-0400] 
[2022-08-05 07:23:44-0400]  Tests start here:
[2022-08-05 07:23:44-0400] TSTENV = stdio	
make: Warning: Both `makefile' and `Makefile' exist
# Failed test 45 - setsockopt works for a constant that is once stringified at ./test.pl line 1177
#      got "Unexpected SO_RCVBUF value: 33232"
# expected "Ok."
# PROG: 
# use warnings;
# use strict;
# 
# use Socket qw'PF_INET SOCK_STREAM IPPROTO_TCP SOL_SOCKET SO_RCVBUF';
# 
# use constant { RCVBUF_SIZE => 32768 };
# 
# socket(my $sock, PF_INET, SOCK_STREAM, IPPROTO_TCP)
#   or die "Could not create socket - $!\n";
# 
# setsockopt($sock,SOL_SOCKET,SO_RCVBUF,RCVBUF_SIZE)
#   or die "Could not set SO_RCVBUF on socket - $!\n";
# 
# my $rcvBuf=getsockopt($sock,SOL_SOCKET,SO_RCVBUF)
#   or die "Could not get SO_RCVBUF on socket - $!\n";
# 
# $rcvBuf=unpack('i',$rcvBuf);
# 
# die "Unexpected SO_RCVBUF value: $rcvBuf\n"
#   unless($rcvBuf == RCVBUF_SIZE || $rcvBuf == 2*RCVBUF_SIZE);
# 
# print "Ok.\n";
# exit;
# 
# sub bug {RCVBUF_SIZE.''}
# STATUS: 7424
make: Fatal error: Command failed for target `test_harness'

error while running harness target 'test_harness': 1 at /export/home/core/smoke/TestSmoke/Test/Smoke/App/RunSmoke.pm line 118.
[2022-08-05 07:56:38-0400] 
[2022-08-05 07:56:38-0400] ../t/io/socket.t............................................FAILED
[2022-08-05 07:56:38-0400]     45
[2022-08-05 07:56:38-0400] Archived results...
[2022-08-05 07:56:38-0400] Unskip tests from '/export/home/core/smoke/TestSmoke/smokecurrent.skiptests'
[2022-08-05 07:56:38-0400] 
[2022-08-05 07:56:38-0400] Configuration: -Dusedevel -Dcc=gcc -Duseithreads -Duse64bitall -DDEBUGGING
[2022-08-05 07:56:38-0400] ------------------------------------------------------------------------------
[2022-08-05 07:56:38-0400] make distclean ...
[2022-08-05 07:57:09-0400] 
[2022-08-05 07:57:09-0400] Copy Policy.sh ...
[2022-08-05 07:57:09-0400] 
[2022-08-05 07:57:09-0400] Configure ...

NOTE: You are using GNU as(1).  GNU as(1) might not build Perl.  If you
have trouble, you can use /usr/ccs/bin/as by including -B/usr/ccs/bin/
in your gcc command.  (Note that the trailing "/" is required.)

make: Warning: Both `makefile' and `Makefile' exist
Current working directory /export/home/core/smoke/perl-current
make: Warning: Both `makefile' and `Makefile' exist
Current working directory /export/home/core/smoke/perl-current
[2022-08-05 07:58:30-0400] 
[2022-08-05 07:58:30-0400] make ...
make: Warning: Both `makefile' and `Makefile' exist
regexec.c: In function 'S_setup_EXACTISH_ST':
regexec.c:4919:26: warning: array subscript has type 'char' [-Wchar-subscripts]
 4919 |                 lengths[m->count] = UVCHR_SKIP(fold_from);
      |                         ~^~~~~~~
regexec.c:4928:26: warning: array subscript has type 'char' [-Wchar-subscripts]
 4928 |                 matches[m->count][0] = fold_from;
      |                         ~^~~~~~~
regexec.c:4929:26: warning: array subscript has type 'char' [-Wchar-subscripts]
 4929 |                 lengths[m->count] = 1;
      |                         ~^~~~~~~
SysV.xs: In function 'XS_IPC__SysV_shmdt':
SysV.xs:417:20: warning: request for implicit conversion from 'void *' to 'char *' not permitted in C++ [-Wc++-compat]
  417 |     int rv = shmdt((Shmat_t)caddr);
      |                    ^~~~~~~~~~~~~~
Warning (mostly harmless): No library found for -lndbm
Warning (mostly harmless): No library found for -ldbm
Warning (mostly harmless): No library found for -ldbm
ODBM_File.xs:24:5: warning: identifier 'delete' conflicts with C++ keyword [-Wc++-compat]
   24 | int delete(datum key);
      |     ^~~~~~
Warning (mostly harmless): No library found for -lposix
Warning (mostly harmless): No library found for -lcposix
Warning (mostly harmless): No library found for -lsunmath
In file included from HiRes.xs:860:
const-c.inc: In function 'constant_19':
const-c.inc:351:42: warning: unused parameter 'iv_return' [-Wunused-parameter]
  351 | constant_19 (pTHX_ const char *name, IV *iv_return) {
      |                                      ~~~~^~~~~~~~~
re_exec.c: In function 'S_setup_EXACTISH_ST':
re_exec.c:4919:26: warning: array subscript has type 'char' [-Wchar-subscripts]
 4919 |                 lengths[m->count] = UVCHR_SKIP(fold_from);
      |                         ~^~~~~~~
re_exec.c:4928:26: warning: array subscript has type 'char' [-Wchar-subscripts]
 4928 |                 matches[m->count][0] = fold_from;
      |                         ~^~~~~~~
re_exec.c:4929:26: warning: array subscript has type 'char' [-Wchar-subscripts]
 4929 |                 lengths[m->count] = 1;
      |                         ~^~~~~~~
[2022-08-05 08:08:08-0400] Skip tests from '/export/home/core/smoke/TestSmoke/smokecurrent.skiptests'
[2022-08-05 08:08:08-0400] 
[2022-08-05 08:08:08-0400]  Tests start here:
[2022-08-05 08:08:08-0400] TSTENV = stdio	
make: Warning: Both `makefile' and `Makefile' exist
# Failed test 45 - setsockopt works for a constant that is once stringified at ./test.pl line 1177
#      got "Unexpected SO_RCVBUF value: 33232"
# expected "Ok."
# PROG: 
# use warnings;
# use strict;
# 
# use Socket qw'PF_INET SOCK_STREAM IPPROTO_TCP SOL_SOCKET SO_RCVBUF';
# 
# use constant { RCVBUF_SIZE => 32768 };
# 
# socket(my $sock, PF_INET, SOCK_STREAM, IPPROTO_TCP)
#   or die "Could not create socket - $!\n";
# 
# setsockopt($sock,SOL_SOCKET,SO_RCVBUF,RCVBUF_SIZE)
#   or die "Could not set SO_RCVBUF on socket - $!\n";
# 
# my $rcvBuf=getsockopt($sock,SOL_SOCKET,SO_RCVBUF)
#   or die "Could not get SO_RCVBUF on socket - $!\n";
# 
# $rcvBuf=unpack('i',$rcvBuf);
# 
# die "Unexpected SO_RCVBUF value: $rcvBuf\n"
#   unless($rcvBuf == RCVBUF_SIZE || $rcvBuf == 2*RCVBUF_SIZE);
# 
# print "Ok.\n";
# exit;
# 
# sub bug {RCVBUF_SIZE.''}
# STATUS: 7424
make: Fatal error: Command failed for target `test_harness'

error while running harness target 'test_harness': 1 at /export/home/core/smoke/TestSmoke/Test/Smoke/App/RunSmoke.pm line 118.
[2022-08-05 08:49:33-0400] 
[2022-08-05 08:49:33-0400] ../t/io/socket.t............................................FAILED
[2022-08-05 08:49:33-0400]     45
[2022-08-05 08:49:33-0400] Archived results...
[2022-08-05 08:49:33-0400] Unskip tests from '/export/home/core/smoke/TestSmoke/smokecurrent.skiptests'
[2022-08-05 08:49:33-0400] 
[2022-08-05 08:49:33-0400] Configuration: -Dusedevel -Dcc=gcc -Duseithreads -Duselongdouble
[2022-08-05 08:49:33-0400] ------------------------------------------------------------------------------
[2022-08-05 08:49:33-0400] make distclean ...
[2022-08-05 08:50:09-0400] 
[2022-08-05 08:50:09-0400] Copy Policy.sh ...
[2022-08-05 08:50:09-0400] 
[2022-08-05 08:50:09-0400] Configure ...

NOTE: You are using GNU as(1).  GNU as(1) might not build Perl.  If you
have trouble, you can use /usr/ccs/bin/as by including -B/usr/ccs/bin/
in your gcc command.  (Note that the trailing "/" is required.)

make: Warning: Both `makefile' and `Makefile' exist
Current working directory /export/home/core/smoke/perl-current
make: Warning: Both `makefile' and `Makefile' exist
Current working directory /export/home/core/smoke/perl-current
[2022-08-05 08:51:21-0400] 
[2022-08-05 08:51:21-0400] make ...
make: Warning: Both `makefile' and `Makefile' exist
regexec.c: In function 'S_setup_EXACTISH_ST':
regexec.c:4919:26: warning: array subscript has type 'char' [-Wchar-subscripts]
 4919 |                 lengths[m->count] = UVCHR_SKIP(fold_from);
      |                         ~^~~~~~~
regexec.c:4928:26: warning: array subscript has type 'char' [-Wchar-subscripts]
 4928 |                 matches[m->count][0] = fold_from;
      |                         ~^~~~~~~
regexec.c:4929:26: warning: array subscript has type 'char' [-Wchar-subscripts]
 4929 |                 lengths[m->count] = 1;
      |                         ~^~~~~~~
SysV.xs: In function 'XS_IPC__SysV_shmdt':
SysV.xs:417:20: warning: request for implicit conversion from 'void *' to 'char *' not permitted in C++ [-Wc++-compat]
  417 |     int rv = shmdt((Shmat_t)caddr);
      |                    ^~~~~~~~~~~~~~
Warning (mostly harmless): No library found for -lndbm
Warning (mostly harmless): No library found for -ldbm
Warning (mostly harmless): No library found for -ldbm
ODBM_File.xs:24:5: warning: identifier 'delete' conflicts with C++ keyword [-Wc++-compat]
   24 | int delete(datum key);
      |     ^~~~~~
Warning (mostly harmless): No library found for -lposix
Warning (mostly harmless): No library found for -lcposix
Warning (mostly harmless): No library found for -lsunmath
In file included from HiRes.xs:860:
const-c.inc: In function 'constant_19':
const-c.inc:351:42: warning: unused parameter 'iv_return' [-Wunused-parameter]
  351 | constant_19 (pTHX_ const char *name, IV *iv_return) {
      |                                      ~~~~^~~~~~~~~
re_exec.c: In function 'S_setup_EXACTISH_ST':
re_exec.c:4919:26: warning: array subscript has type 'char' [-Wchar-subscripts]
 4919 |                 lengths[m->count] = UVCHR_SKIP(fold_from);
      |                         ~^~~~~~~
re_exec.c:4928:26: warning: array subscript has type 'char' [-Wchar-subscripts]
 4928 |                 matches[m->count][0] = fold_from;
      |                         ~^~~~~~~
re_exec.c:4929:26: warning: array subscript has type 'char' [-Wchar-subscripts]
 4929 |                 lengths[m->count] = 1;
      |                         ~^~~~~~~
[2022-08-05 08:57:31-0400] Skip tests from '/export/home/core/smoke/TestSmoke/smokecurrent.skiptests'
[2022-08-05 08:57:31-0400] 
[2022-08-05 08:57:31-0400]  Tests start here:
[2022-08-05 08:57:31-0400] TSTENV = stdio	
make: Warning: Both `makefile' and `Makefile' exist
# Failed test 45 - setsockopt works for a constant that is once stringified at ./test.pl line 1177
#      got "Unexpected SO_RCVBUF value: 33232"
# expected "Ok."
# PROG: 
# use warnings;
# use strict;
# 
# use Socket qw'PF_INET SOCK_STREAM IPPROTO_TCP SOL_SOCKET SO_RCVBUF';
# 
# use constant { RCVBUF_SIZE => 32768 };
# 
# socket(my $sock, PF_INET, SOCK_STREAM, IPPROTO_TCP)
#   or die "Could not create socket - $!\n";
# 
# setsockopt($sock,SOL_SOCKET,SO_RCVBUF,RCVBUF_SIZE)
#   or die "Could not set SO_RCVBUF on socket - $!\n";
# 
# my $rcvBuf=getsockopt($sock,SOL_SOCKET,SO_RCVBUF)
#   or die "Could not get SO_RCVBUF on socket - $!\n";
# 
# $rcvBuf=unpack('i',$rcvBuf);
# 
# die "Unexpected SO_RCVBUF value: $rcvBuf\n"
#   unless($rcvBuf == RCVBUF_SIZE || $rcvBuf == 2*RCVBUF_SIZE);
# 
# print "Ok.\n";
# exit;
# 
# sub bug {RCVBUF_SIZE.''}
# STATUS: 7424
make: Fatal error: Command failed for target `test_harness'

error while running harness target 'test_harness': 1 at /export/home/core/smoke/TestSmoke/Test/Smoke/App/RunSmoke.pm line 118.
[2022-08-05 09:30:04-0400] 
[2022-08-05 09:30:04-0400] ../t/io/socket.t............................................FAILED
[2022-08-05 09:30:04-0400]     45
[2022-08-05 09:30:04-0400] Archived results...
[2022-08-05 09:30:04-0400] Unskip tests from '/export/home/core/smoke/TestSmoke/smokecurrent.skiptests'
[2022-08-05 09:30:04-0400] 
[2022-08-05 09:30:04-0400] Configuration: -Dusedevel -Dcc=gcc -Duseithreads -Duselongdouble -DDEBUGGING
[2022-08-05 09:30:04-0400] ------------------------------------------------------------------------------
[2022-08-05 09:30:04-0400] make distclean ...
[2022-08-05 09:30:34-0400] 
[2022-08-05 09:30:34-0400] Copy Policy.sh ...
[2022-08-05 09:30:34-0400] 
[2022-08-05 09:30:34-0400] Configure ...

NOTE: You are using GNU as(1).  GNU as(1) might not build Perl.  If you
have trouble, you can use /usr/ccs/bin/as by including -B/usr/ccs/bin/
in your gcc command.  (Note that the trailing "/" is required.)

make: Warning: Both `makefile' and `Makefile' exist
Current working directory /export/home/core/smoke/perl-current
make: Warning: Both `makefile' and `Makefile' exist
Current working directory /export/home/core/smoke/perl-current
[2022-08-05 09:31:50-0400] 
[2022-08-05 09:31:50-0400] make ...
make: Warning: Both `makefile' and `Makefile' exist
regexec.c: In function 'S_setup_EXACTISH_ST':
regexec.c:4919:26: warning: array subscript has type 'char' [-Wchar-subscripts]
 4919 |                 lengths[m->count] = UVCHR_SKIP(fold_from);
      |                         ~^~~~~~~
regexec.c:4928:26: warning: array subscript has type 'char' [-Wchar-subscripts]
 4928 |                 matches[m->count][0] = fold_from;
      |                         ~^~~~~~~
regexec.c:4929:26: warning: array subscript has type 'char' [-Wchar-subscripts]
 4929 |                 lengths[m->count] = 1;
      |                         ~^~~~~~~
SysV.xs: In function 'XS_IPC__SysV_shmdt':
SysV.xs:417:20: warning: request for implicit conversion from 'void *' to 'char *' not permitted in C++ [-Wc++-compat]
  417 |     int rv = shmdt((Shmat_t)caddr);
      |                    ^~~~~~~~~~~~~~
Warning (mostly harmless): No library found for -lndbm
Warning (mostly harmless): No library found for -ldbm
Warning (mostly harmless): No library found for -ldbm
ODBM_File.xs:24:5: warning: identifier 'delete' conflicts with C++ keyword [-Wc++-compat]
   24 | int delete(datum key);
      |     ^~~~~~
Warning (mostly harmless): No library found for -lposix
Warning (mostly harmless): No library found for -lcposix
Warning (mostly harmless): No library found for -lsunmath
In file included from HiRes.xs:860:
const-c.inc: In function 'constant_19':
const-c.inc:351:42: warning: unused parameter 'iv_return' [-Wunused-parameter]
  351 | constant_19 (pTHX_ const char *name, IV *iv_return) {
      |                                      ~~~~^~~~~~~~~
re_exec.c: In function 'S_setup_EXACTISH_ST':
re_exec.c:4919:26: warning: array subscript has type 'char' [-Wchar-subscripts]
 4919 |                 lengths[m->count] = UVCHR_SKIP(fold_from);
      |                         ~^~~~~~~
re_exec.c:4928:26: warning: array subscript has type 'char' [-Wchar-subscripts]
 4928 |                 matches[m->count][0] = fold_from;
      |                         ~^~~~~~~
re_exec.c:4929:26: warning: array subscript has type 'char' [-Wchar-subscripts]
 4929 |                 lengths[m->count] = 1;
      |                         ~^~~~~~~
[2022-08-05 09:41:04-0400] Skip tests from '/export/home/core/smoke/TestSmoke/smokecurrent.skiptests'
[2022-08-05 09:41:04-0400] 
[2022-08-05 09:41:04-0400]  Tests start here:
[2022-08-05 09:41:04-0400] TSTENV = stdio	
make: Warning: Both `makefile' and `Makefile' exist
# Failed test 45 - setsockopt works for a constant that is once stringified at ./test.pl line 1177
#      got "Unexpected SO_RCVBUF value: 33232"
# expected "Ok."
# PROG: 
# use warnings;
# use strict;
# 
# use Socket qw'PF_INET SOCK_STREAM IPPROTO_TCP SOL_SOCKET SO_RCVBUF';
# 
# use constant { RCVBUF_SIZE => 32768 };
# 
# socket(my $sock, PF_INET, SOCK_STREAM, IPPROTO_TCP)
#   or die "Could not create socket - $!\n";
# 
# setsockopt($sock,SOL_SOCKET,SO_RCVBUF,RCVBUF_SIZE)
#   or die "Could not set SO_RCVBUF on socket - $!\n";
# 
# my $rcvBuf=getsockopt($sock,SOL_SOCKET,SO_RCVBUF)
#   or die "Could not get SO_RCVBUF on socket - $!\n";
# 
# $rcvBuf=unpack('i',$rcvBuf);
# 
# die "Unexpected SO_RCVBUF value: $rcvBuf\n"
#   unless($rcvBuf == RCVBUF_SIZE || $rcvBuf == 2*RCVBUF_SIZE);
# 
# print "Ok.\n";
# exit;
# 
# sub bug {RCVBUF_SIZE.''}
# STATUS: 7424
make: Fatal error: Command failed for target `test_harness'

error while running harness target 'test_harness': 1 at /export/home/core/smoke/TestSmoke/Test/Smoke/App/RunSmoke.pm line 118.
[2022-08-05 10:21:57-0400] 
[2022-08-05 10:21:57-0400] ../t/io/socket.t............................................FAILED
[2022-08-05 10:21:57-0400]     45
[2022-08-05 10:21:57-0400] Archived results...
[2022-08-05 10:21:57-0400] Unskip tests from '/export/home/core/smoke/TestSmoke/smokecurrent.skiptests'
[2022-08-05 10:21:57-0400] Finished smoking e91a97a6c44e190cf576e37ff52bd8bd7005cf73 v5.37.2-80-ge91a97a6c4 blead
[2022-08-05 10:21:57-0400] Reading smokeresult from /export/home/core/smoke/perl-current/mktest.out
[2022-08-05 10:21:57-0400] Processing [-Dcc=gcc]
[2022-08-05 10:21:57-0400] Processing [-DDEBUGGING -Dcc=gcc]
[2022-08-05 10:21:57-0400] Processing [-Dcc=gcc -Duse64bitall]
[2022-08-05 10:21:57-0400] Processing [-DDEBUGGING -Dcc=gcc -Duse64bitall]
[2022-08-05 10:21:57-0400] Processing [-Dcc=gcc -Duselongdouble]
[2022-08-05 10:21:57-0400] Processing [-DDEBUGGING -Dcc=gcc -Duselongdouble]
[2022-08-05 10:21:57-0400] Processing [-Dcc=gcc -Duseithreads]
[2022-08-05 10:21:57-0400] Processing [-DDEBUGGING -Dcc=gcc -Duseithreads]
[2022-08-05 10:21:57-0400] Processing [-Dcc=gcc -Duseithreads -Duse64bitall]
[2022-08-05 10:21:57-0400] Processing [-DDEBUGGING -Dcc=gcc -Duseithreads -Duse64bitall]
[2022-08-05 10:21:57-0400] Processing [-Dcc=gcc -Duseithreads -Duselongdouble]
[2022-08-05 10:21:57-0400] Processing [-DDEBUGGING -Dcc=gcc -Duseithreads -Duselongdouble]
[2022-08-05 10:21:57-0400] ==> Starting reporter
[2022-08-05 10:21:57-0400] Writing report to '/export/home/core/smoke/perl-current/mktest.rpt'
-- 
Report generated by Test::Smoke::Gateway v0.10