Show report
[2022-08-04 11:28:42+0200] ==> Starting synctree
[2022-08-04 11:28:42+0200] qx[/usr/bin/git clone https://github.com/Perl/perl5.git /home/ubuntu/perl5coresmoke/perl-from-github 2>&1]
[2022-08-04 11:29:46+0200] qx[/usr/bin/git remote update --prune 2>&1]
[2022-08-04 11:29:50+0200] qx[/usr/bin/git checkout blead 2>&1]
[2022-08-04 11:29:50+0200] qx[/usr/bin/git reset --hard origin/blead 2>&1]
[2022-08-04 11:29:50+0200] qx[/usr/bin/git clone /home/ubuntu/perl5coresmoke/perl-from-github /home/ubuntu/perl5coresmoke/perl-current 2>&1]
[2022-08-04 11:29:51+0200] qx[/usr/bin/git reset --hard HEAD 2>&1]
[2022-08-04 11:29:51+0200] qx[/usr/bin/git clean -dfx 2>&1]
[2022-08-04 11:29:51+0200] qx[/usr/bin/git fetch origin 2>&1]
[2022-08-04 11:29:51+0200] qx[/usr/bin/git checkout blead 2>&1]
[2022-08-04 11:29:51+0200] qx[/usr/bin/git reset --hard origin/blead 2>&1]
[2022-08-04 11:29:51+0200] qx[/usr/bin/perl Porting/make_dot_patch.pl > .patch]
[2022-08-04 11:29:51+0200] /home/ubuntu/perl5coresmoke/perl-current is now up to patchlevel dfbf5f46d1d33033c44ae80f74f875abf73e5e02
[2022-08-04 11:29:51+0200] ==> Starting runsmoke
[2022-08-04 11:29:51+0200] [/home/ubuntu/perl5coresmoke/bin/tssmokeperl.pl] chdir(/home/ubuntu/perl5coresmoke/perl-current)
[2022-08-04 11:29:51+0200] qx[/usr/bin/perl -e "require q[/home/ubuntu/perl5coresmoke/perl-current/cpan/Test-Harness/lib/Test/Harness.pm];print Test::Harness->VERSION" 2>&1]
[2022-08-04 11:29:51+0200] Found: Test::Harness version 3.44.
[2022-08-04 11:29:51+0200] Reading build configurations from /home/ubuntu/perl5coresmoke/etc/blead.buildcfg
[2022-08-04 11:29:51+0200] Reading 'Policy.sh' from default content (v=1)
[2022-08-04 11:29:51+0200] make distclean ...
[2022-08-04 11:29:51+0200] Smoking patch dfbf5f46d1d33033c44ae80f74f875abf73e5e02 v5.37.2-77-gdfbf5f46d1
[2022-08-04 11:29:51+0200] Smoking branch blead
[2022-08-04 11:29:51+0200] Locally applied patches from '/home/ubuntu/perl5coresmoke/perl-current/patchlevel.h'
[2022-08-04 11:29:51+0200] Patches: 'uncommitted-changes'
[2022-08-04 11:29:51+0200] Adding 'SMOKEdfbf5f46d1d33033c44ae80f74f875abf73e5e02' to the registered patches.
[2022-08-04 11:29:51+0200] 
[2022-08-04 11:29:51+0200] Configuration: -Dusedevel
[2022-08-04 11:29:51+0200] ------------------------------------------------------------------------------
[2022-08-04 11:29:51+0200] make distclean ...
[2022-08-04 11:29:51+0200] 
[2022-08-04 11:29:51+0200] Copy Policy.sh ...
[2022-08-04 11:29:51+0200] 
[2022-08-04 11:29:51+0200] Configure ...
[2022-08-04 11:30:19+0200] 
[2022-08-04 11:30:19+0200] make ...
[2022-08-04 11:32:12+0200] 
[2022-08-04 11:32:12+0200]  Tests start here:
[2022-08-04 11:32:12+0200] TSTENV = stdio	
[2022-08-04 11:32:12+0200] ./runtests choose
No such file or directory
No such file or directory
[2022-08-04 11:41:49+0200] All tests successful.
[2022-08-04 11:41:49+0200] Elapsed: 577 sec
[2022-08-04 11:41:49+0200] u=4.00  s=1.82  cu=291.31  cs=33.18  scripts=2483  tests=1174992
[2022-08-04 11:41:49+0200] 
[2022-08-04 11:41:49+0200] OK, archive results ...

[2022-08-04 11:41:49+0200] TSTENV = perlio	
[2022-08-04 11:41:49+0200] ./runtests choose
Can't open /dev/tty--run t/TEST outside of make.
# Failed test 45 - -t at op/stat.t line 379
-c on closed filehandle TTY at op/stat.t line 380.
# Failed test 46 - tty is -c at op/stat.t line 380
# Failed test 48 - -t on STDIN at op/stat.t line 387
[2022-08-04 11:44:03+0200] t/op/stat ........................................................ FAILED at test 45
Failed 1 test out of 2485, 99.96% okay.
### Since not all tests were successful, you may want to run some of
### them individually and examine any diagnostic messages they produce.
### See the INSTALL document's section on "make test".
### You have a good chance to get more information by running
###   ./perl harness
### in the 't' directory since most (>=80%) of the tests succeeded.
### You may have to set your dynamic library search path,
### LD_LIBRARY_PATH, to point to the build directory:
###   setenv LD_LIBRARY_PATH `pwd`:$LD_LIBRARY_PATH; cd t; ./perl harness
###   LD_LIBRARY_PATH=`pwd`:$LD_LIBRARY_PATH; export LD_LIBRARY_PATH; cd t; ./perl harness
###   export LD_LIBRARY_PATH=`pwd`:$LD_LIBRARY_PATH; cd t; ./perl harness
### for csh-style shells, like tcsh; or for traditional/modern
### Bourne-style shells, like bash, ksh, and zsh, respectively.
[2022-08-04 11:51:14+0200] Elapsed: 565 sec
[2022-08-04 11:51:14+0200] u=3.72  s=1.75  cu=276.64  cs=30.19  scripts=2485  tests=1174975
make: *** [makefile:800: _test] Error 1
[2022-08-04 11:51:14+0200] 
[2022-08-04 11:51:14+0200] Error while reading test-results: 2
[2022-08-04 11:51:14+0200] 
[2022-08-04 11:51:14+0200] Extending failures with harness:
[2022-08-04 11:51:14+0200] 	../t/op/stat.t
[2022-08-04 11:51:17+0200] ../t/op/stat.t .. ok

[2022-08-04 11:51:17+0200] All tests successful.

[2022-08-04 11:51:17+0200] Files=1, Tests=111,  3 wallclock secs ( 0.01 usr  0.01 sys +  0.02 cusr  0.02 csys =  0.06 CPU)

[2022-08-04 11:51:17+0200] Result: PASS

[2022-08-04 11:51:17+0200] 
[2022-08-04 11:51:17+0200] Inconsistent test results (between TEST and harness):
[2022-08-04 11:51:17+0200]     ../t/op/stat.t.......................... ........................................................ FAILED at test 45

[2022-08-04 11:51:17+0200] TSTENV = locale:en_US.utf8	
[2022-08-04 11:51:17+0200] ./runtests choose
[2022-08-04 12:00:47+0200] All tests successful.
[2022-08-04 12:00:47+0200] Elapsed: 570 sec
[2022-08-04 12:00:47+0200] u=3.75  s=1.63  cu=283.44  cs=29.47  scripts=2485  tests=1175143
[2022-08-04 12:00:47+0200] 
[2022-08-04 12:00:47+0200] OK, archive results ...

[2022-08-04 12:00:47+0200] 
[2022-08-04 12:00:47+0200] Configuration: -Dusedevel -DDEBUGGING
[2022-08-04 12:00:47+0200] ------------------------------------------------------------------------------
[2022-08-04 12:00:47+0200] make distclean ...
[2022-08-04 12:00:52+0200] 
[2022-08-04 12:00:52+0200] Copy Policy.sh ...
[2022-08-04 12:00:52+0200] 
[2022-08-04 12:00:52+0200] Configure ...
[2022-08-04 12:01:20+0200] 
[2022-08-04 12:01:20+0200] make ...
[2022-08-04 12:04:00+0200] 
[2022-08-04 12:04:00+0200]  Tests start here:
[2022-08-04 12:04:00+0200] TSTENV = stdio	
[2022-08-04 12:04:00+0200] ./runtests choose
No such file or directory
No such file or directory
[2022-08-04 12:14:11+0200] All tests successful.
[2022-08-04 12:14:11+0200] Elapsed: 611 sec
[2022-08-04 12:14:11+0200] u=4.67  s=1.91  cu=316.22  cs=36.41  scripts=2484  tests=1175005
[2022-08-04 12:14:11+0200] 
[2022-08-04 12:14:11+0200] OK, archive results ...

[2022-08-04 12:14:11+0200] TSTENV = perlio	
[2022-08-04 12:14:11+0200] ./runtests choose
[2022-08-04 12:24:32+0200] All tests successful.
[2022-08-04 12:24:32+0200] Elapsed: 621 sec
[2022-08-04 12:24:32+0200] u=4.69  s=1.73  cu=314.72  cs=34.62  scripts=2486  tests=1174937
[2022-08-04 12:24:32+0200] 
[2022-08-04 12:24:32+0200] OK, archive results ...

[2022-08-04 12:24:32+0200] TSTENV = locale:en_US.utf8	
[2022-08-04 12:24:32+0200] ./runtests choose
[2022-08-04 12:34:39+0200] All tests successful.
[2022-08-04 12:34:39+0200] Elapsed: 607 sec
[2022-08-04 12:34:39+0200] u=4.50  s=1.86  cu=301.26  cs=32.93  scripts=2486  tests=1174818
[2022-08-04 12:34:39+0200] 
[2022-08-04 12:34:39+0200] OK, archive results ...

[2022-08-04 12:34:39+0200] Finished smoking dfbf5f46d1d33033c44ae80f74f875abf73e5e02 v5.37.2-77-gdfbf5f46d1 blead
[2022-08-04 12:34:39+0200] Reading smokeresult from /home/ubuntu/perl5coresmoke/perl-current/mktest.out
[2022-08-04 12:34:39+0200] Processing []
[2022-08-04 12:34:39+0200] Processing [-DDEBUGGING]
[2022-08-04 12:34:39+0200] ==> Starting reporter
[2022-08-04 12:34:39+0200] Writing report to '/home/ubuntu/perl5coresmoke/perl-current/mktest.rpt'
[2022-08-04 12:34:39+0200] Locally applied patches from '/home/ubuntu/perl5coresmoke/perl-current/patchlevel.h'
[2022-08-04 12:34:39+0200] Patches: 'uncommitted-changes'
[2022-08-04 12:34:39+0200] Looking for cc messages: 'gcc'
-- 
Report generated by Test::Smoke::Gateway v0.10