Show report
[2022-08-03 08:45:38-0400] ==> Starting synctree
[2022-08-03 08:45:38-0400] qx[/usr/bin/git clone file:///home/core/smoke/git /home/core/smoke/git-perl 2>&1]
[2022-08-03 08:47:58-0400] qx[/usr/bin/git remote update --prune 2>&1]
[2022-08-03 08:47:58-0400] qx[/usr/bin/git checkout blead
[2022-08-03 08:47:58-0400]  2>&1]
Already on 'blead'
[2022-08-03 08:47:58-0400] qx[/usr/bin/git reset --hard origin/blead
[2022-08-03 08:47:58-0400]  2>&1]
[2022-08-03 08:47:59-0400] qx[/usr/bin/git clone /home/core/smoke/git-perl /home/core/smoke/perl-current 2>&1]
[2022-08-03 08:48:00-0400] qx[/usr/bin/git clean -dfx 2>&1]
[2022-08-03 08:48:00-0400] qx[/usr/bin/git fetch origin 2>&1]
[2022-08-03 08:48:00-0400] qx[/usr/bin/git checkout blead
[2022-08-03 08:48:00-0400]  2>&1]
Already on 'blead'
[2022-08-03 08:48:01-0400] qx[/usr/bin/git reset --hard origin/blead
[2022-08-03 08:48:01-0400]  2>&1]
[2022-08-03 08:48:01-0400] qx[/home/core/bin/perl-5.26.1/bin/perl5.26.1 Porting/make_dot_patch.pl > .patch]
[2022-08-03 08:48:01-0400] /home/core/smoke/perl-current is now up to patchlevel 182f0ba91d539c8b2bea45168fd6e72f9f0073bd
[2022-08-03 08:48:01-0400] ==> Starting runsmoke
[2022-08-03 08:48:01-0400] [./tssmokeperl.pl] chdir(/home/core/smoke/perl-current)
[2022-08-03 08:48:01-0400] qx[/home/core/bin/perl-5.26.1/bin/perl5.26.1 -e "require q[/home/core/smoke/perl-current/cpan/Test-Harness/lib/Test/Harness.pm];print Test::Harness->VERSION" 2>&1]
[2022-08-03 08:48:01-0400] Found: Test::Harness version 3.44.
[2022-08-03 08:48:01-0400] Reading build configurations from /home/core/smoke/TestSmoke/perlcurrent.cfg
[2022-08-03 08:48:01-0400] Reading 'Policy.sh' from default content (v=1)
[2022-08-03 08:48:01-0400] Running smoke tests without $ENV{PERLIO}
[2022-08-03 08:48:01-0400] Running test suite only with 'harness'
[2022-08-03 08:48:01-0400] make distclean ...
[2022-08-03 08:48:01-0400] Smoking patch 182f0ba91d539c8b2bea45168fd6e72f9f0073bd v5.37.2-72-g182f0ba91d
[2022-08-03 08:48:01-0400] Smoking branch blead
[2022-08-03 08:48:01-0400] Locally applied patches from '/home/core/smoke/perl-current/patchlevel.h'
[2022-08-03 08:48:01-0400] Patches: 'uncommitted-changes'
[2022-08-03 08:48:01-0400] Adding 'SMOKE182f0ba91d539c8b2bea45168fd6e72f9f0073bd' to the registered patches.
[2022-08-03 08:48:01-0400] 
[2022-08-03 08:48:01-0400] Configuration: -Dusedevel -Dcc=gcc
[2022-08-03 08:48:01-0400] ------------------------------------------------------------------------------
[2022-08-03 08:48:01-0400] make distclean ...
[2022-08-03 08:48:01-0400] 
[2022-08-03 08:48:01-0400] Copy Policy.sh ...
[2022-08-03 08:48:01-0400] 
[2022-08-03 08:48:01-0400] Configure ...
[2022-08-03 08:49:44-0400] 
[2022-08-03 08:49:44-0400] make ...
Warning (mostly harmless): No library found for -lposix
Warning (mostly harmless): No library found for -lcposix
[2022-08-03 08:54:55-0400] Skip tests from '/home/core/smoke/TestSmoke/smokecurrent.skiptests'
[2022-08-03 08:54:55-0400] 
[2022-08-03 08:54:55-0400]  Tests start here:
[2022-08-03 08:54:55-0400] TSTENV = stdio	
[2022-08-03 09:16:53-0400] 
[2022-08-03 09:16:53-0400] All tests successful.
[2022-08-03 09:16:53-0400] Archived results...
[2022-08-03 09:16:53-0400] Unskip tests from '/home/core/smoke/TestSmoke/smokecurrent.skiptests'
[2022-08-03 09:16:53-0400] 
[2022-08-03 09:16:53-0400] Configuration: -Dusedevel -Dcc=gcc -DDEBUGGING
[2022-08-03 09:16:53-0400] ------------------------------------------------------------------------------
[2022-08-03 09:16:53-0400] make distclean ...
[2022-08-03 09:17:09-0400] 
[2022-08-03 09:17:09-0400] Copy Policy.sh ...
[2022-08-03 09:17:09-0400] 
[2022-08-03 09:17:09-0400] Configure ...
[2022-08-03 09:18:54-0400] 
[2022-08-03 09:18:54-0400] make ...
Warning (mostly harmless): No library found for -lposix
Warning (mostly harmless): No library found for -lcposix
[2022-08-03 09:26:23-0400] Skip tests from '/home/core/smoke/TestSmoke/smokecurrent.skiptests'
[2022-08-03 09:26:23-0400] 
[2022-08-03 09:26:23-0400]  Tests start here:
[2022-08-03 09:26:23-0400] TSTENV = stdio	

#   Failed test at t/nanosleep.t line 35.
#     '0.930353164672852'
#         <
#     '0.9'
# # slept 0.930353164672852 secs 1659534367.29672 to 1659534368.22708
# Looks like you failed 1 test of 4.
make: *** [makefile:856: test_harness] Error 1

error while running harness target 'test_harness': 2 at /home/core/smoke/TestSmoke/Test/Smoke/App/RunSmoke.pm line 118.
[2022-08-03 09:51:40-0400] 
[2022-08-03 09:51:40-0400] ../dist/Time-HiRes/t/nanosleep.t............................FAILED
[2022-08-03 09:51:40-0400]     4
[2022-08-03 09:51:40-0400] ../dist/Time-HiRes/t/nanosleep.t............................FAILED
[2022-08-03 09:51:40-0400]     Non-zero exit status: 1
[2022-08-03 09:51:40-0400] Archived results...
[2022-08-03 09:51:40-0400] Unskip tests from '/home/core/smoke/TestSmoke/smokecurrent.skiptests'
[2022-08-03 09:51:40-0400] 
[2022-08-03 09:51:40-0400] Configuration: -Dusedevel -Dcc=gcc -Duse64bitall
[2022-08-03 09:51:40-0400] ------------------------------------------------------------------------------
[2022-08-03 09:51:40-0400] make distclean ...
[2022-08-03 09:51:58-0400] 
[2022-08-03 09:51:58-0400] Copy Policy.sh ...
[2022-08-03 09:51:58-0400] 
[2022-08-03 09:51:58-0400] Configure ...
[2022-08-03 09:53:40-0400] 
[2022-08-03 09:53:40-0400] make ...
Warning (mostly harmless): No library found for -lposix
Warning (mostly harmless): No library found for -lcposix
[2022-08-03 09:58:40-0400] Skip tests from '/home/core/smoke/TestSmoke/smokecurrent.skiptests'
[2022-08-03 09:58:40-0400] 
[2022-08-03 09:58:40-0400]  Tests start here:
[2022-08-03 09:58:40-0400] TSTENV = stdio	
[2022-08-03 10:20:14-0400] 
[2022-08-03 10:20:14-0400] All tests successful.
[2022-08-03 10:20:14-0400] Archived results...
[2022-08-03 10:20:14-0400] Unskip tests from '/home/core/smoke/TestSmoke/smokecurrent.skiptests'
[2022-08-03 10:20:14-0400] 
[2022-08-03 10:20:14-0400] Configuration: -Dusedevel -Dcc=gcc -Duse64bitall -DDEBUGGING
[2022-08-03 10:20:14-0400] ------------------------------------------------------------------------------
[2022-08-03 10:20:14-0400] make distclean ...
[2022-08-03 10:20:30-0400] 
[2022-08-03 10:20:30-0400] Copy Policy.sh ...
[2022-08-03 10:20:30-0400] 
[2022-08-03 10:20:30-0400] Configure ...
[2022-08-03 10:22:14-0400] 
[2022-08-03 10:22:14-0400] make ...
Warning (mostly harmless): No library found for -lposix
Warning (mostly harmless): No library found for -lcposix
[2022-08-03 10:29:23-0400] Skip tests from '/home/core/smoke/TestSmoke/smokecurrent.skiptests'
[2022-08-03 10:29:23-0400] 
[2022-08-03 10:29:23-0400]  Tests start here:
[2022-08-03 10:29:23-0400] TSTENV = stdio	
[2022-08-03 10:54:00-0400] 
[2022-08-03 10:54:00-0400] All tests successful.
[2022-08-03 10:54:00-0400] Archived results...
[2022-08-03 10:54:00-0400] Unskip tests from '/home/core/smoke/TestSmoke/smokecurrent.skiptests'
[2022-08-03 10:54:00-0400] 
[2022-08-03 10:54:00-0400] Configuration: -Dusedevel -Dcc=gcc -Dusequadmath
[2022-08-03 10:54:00-0400] ------------------------------------------------------------------------------
[2022-08-03 10:54:00-0400] make distclean ...
[2022-08-03 10:54:18-0400] 
[2022-08-03 10:54:18-0400] Copy Policy.sh ...
[2022-08-03 10:54:18-0400] 
[2022-08-03 10:54:18-0400] Configure ...
[2022-08-03 10:56:00-0400] 
[2022-08-03 10:56:00-0400] make ...
Warning (mostly harmless): No library found for -lposix
Warning (mostly harmless): No library found for -lcposix
[2022-08-03 11:00:57-0400] Skip tests from '/home/core/smoke/TestSmoke/smokecurrent.skiptests'
[2022-08-03 11:00:57-0400] 
[2022-08-03 11:00:57-0400]  Tests start here:
[2022-08-03 11:00:57-0400] TSTENV = stdio	

#   Failed test at t/alarm.t line 219.
# Looks like you failed 1 test of 10.
make: *** [makefile:856: test_harness] Error 1

error while running harness target 'test_harness': 2 at /home/core/smoke/TestSmoke/Test/Smoke/App/RunSmoke.pm line 118.
[2022-08-03 11:22:27-0400] 
[2022-08-03 11:22:27-0400] ../dist/Time-HiRes/t/alarm.t................................FAILED
[2022-08-03 11:22:27-0400]     8
[2022-08-03 11:22:27-0400] ../dist/Time-HiRes/t/alarm.t................................FAILED
[2022-08-03 11:22:27-0400]     Non-zero exit status: 1
[2022-08-03 11:22:27-0400] Archived results...
[2022-08-03 11:22:27-0400] Unskip tests from '/home/core/smoke/TestSmoke/smokecurrent.skiptests'
[2022-08-03 11:22:27-0400] 
[2022-08-03 11:22:27-0400] Configuration: -Dusedevel -Dcc=gcc -Dusequadmath -DDEBUGGING
[2022-08-03 11:22:27-0400] ------------------------------------------------------------------------------
[2022-08-03 11:22:27-0400] make distclean ...
[2022-08-03 11:22:43-0400] 
[2022-08-03 11:22:43-0400] Copy Policy.sh ...
[2022-08-03 11:22:43-0400] 
[2022-08-03 11:22:43-0400] Configure ...
[2022-08-03 11:24:26-0400] 
[2022-08-03 11:24:26-0400] make ...
Warning (mostly harmless): No library found for -lposix
Warning (mostly harmless): No library found for -lcposix
[2022-08-03 11:31:26-0400] Skip tests from '/home/core/smoke/TestSmoke/smokecurrent.skiptests'
[2022-08-03 11:31:26-0400] 
[2022-08-03 11:31:26-0400]  Tests start here:
[2022-08-03 11:31:26-0400] TSTENV = stdio	
[2022-08-03 11:55:59-0400] 
[2022-08-03 11:55:59-0400] All tests successful.
[2022-08-03 11:55:59-0400] Archived results...
[2022-08-03 11:55:59-0400] Unskip tests from '/home/core/smoke/TestSmoke/smokecurrent.skiptests'
[2022-08-03 11:55:59-0400] 
[2022-08-03 11:55:59-0400] Configuration: -Dusedevel -Dcc=gcc -Duseithreads
[2022-08-03 11:55:59-0400] ------------------------------------------------------------------------------
[2022-08-03 11:55:59-0400] make distclean ...
[2022-08-03 11:56:17-0400] 
[2022-08-03 11:56:17-0400] Copy Policy.sh ...
[2022-08-03 11:56:17-0400] 
[2022-08-03 11:56:17-0400] Configure ...
[2022-08-03 11:57:59-0400] 
[2022-08-03 11:57:59-0400] make ...
Warning (mostly harmless): No library found for -lposix
Warning (mostly harmless): No library found for -lcposix
[2022-08-03 12:03:08-0400] Skip tests from '/home/core/smoke/TestSmoke/smokecurrent.skiptests'
[2022-08-03 12:03:08-0400] 
[2022-08-03 12:03:08-0400]  Tests start here:
[2022-08-03 12:03:08-0400] TSTENV = stdio	

#   Failed test at t/alarm.t line 219.
# Looks like you failed 1 test of 10.
make: *** [makefile:856: test_harness] Error 1

error while running harness target 'test_harness': 2 at /home/core/smoke/TestSmoke/Test/Smoke/App/RunSmoke.pm line 118.
[2022-08-03 12:28:01-0400] 
[2022-08-03 12:28:01-0400] ../dist/Time-HiRes/t/alarm.t................................FAILED
[2022-08-03 12:28:01-0400]     8
[2022-08-03 12:28:01-0400] ../dist/Time-HiRes/t/alarm.t................................FAILED
[2022-08-03 12:28:01-0400]     Non-zero exit status: 1
[2022-08-03 12:28:01-0400] Archived results...
[2022-08-03 12:28:01-0400] Unskip tests from '/home/core/smoke/TestSmoke/smokecurrent.skiptests'
[2022-08-03 12:28:01-0400] 
[2022-08-03 12:28:01-0400] Configuration: -Dusedevel -Dcc=gcc -Duseithreads -DDEBUGGING
[2022-08-03 12:28:01-0400] ------------------------------------------------------------------------------
[2022-08-03 12:28:01-0400] make distclean ...
[2022-08-03 12:28:17-0400] 
[2022-08-03 12:28:17-0400] Copy Policy.sh ...
[2022-08-03 12:28:17-0400] 
[2022-08-03 12:28:17-0400] Configure ...
[2022-08-03 12:30:02-0400] 
[2022-08-03 12:30:02-0400] make ...
Warning (mostly harmless): No library found for -lposix
Warning (mostly harmless): No library found for -lcposix
[2022-08-03 12:37:21-0400] Skip tests from '/home/core/smoke/TestSmoke/smokecurrent.skiptests'
[2022-08-03 12:37:21-0400] 
[2022-08-03 12:37:21-0400]  Tests start here:
[2022-08-03 12:37:21-0400] TSTENV = stdio	
[2022-08-03 13:06:17-0400] 
[2022-08-03 13:06:17-0400] All tests successful.
[2022-08-03 13:06:17-0400] Archived results...
[2022-08-03 13:06:17-0400] Unskip tests from '/home/core/smoke/TestSmoke/smokecurrent.skiptests'
[2022-08-03 13:06:17-0400] 
[2022-08-03 13:06:17-0400] Configuration: -Dusedevel -Dcc=gcc -Duseithreads -Duse64bitall
[2022-08-03 13:06:17-0400] ------------------------------------------------------------------------------
[2022-08-03 13:06:17-0400] make distclean ...
[2022-08-03 13:06:36-0400] 
[2022-08-03 13:06:36-0400] Copy Policy.sh ...
[2022-08-03 13:06:36-0400] 
[2022-08-03 13:06:36-0400] Configure ...
[2022-08-03 13:08:21-0400] 
[2022-08-03 13:08:21-0400] make ...
Warning (mostly harmless): No library found for -lposix
Warning (mostly harmless): No library found for -lcposix
[2022-08-03 13:13:34-0400] Skip tests from '/home/core/smoke/TestSmoke/smokecurrent.skiptests'
[2022-08-03 13:13:34-0400] 
[2022-08-03 13:13:34-0400]  Tests start here:
[2022-08-03 13:13:34-0400] TSTENV = stdio	
[2022-08-03 13:38:18-0400] 
[2022-08-03 13:38:18-0400] All tests successful.
[2022-08-03 13:38:18-0400] Archived results...
[2022-08-03 13:38:18-0400] Unskip tests from '/home/core/smoke/TestSmoke/smokecurrent.skiptests'
[2022-08-03 13:38:18-0400] 
[2022-08-03 13:38:18-0400] Configuration: -Dusedevel -Dcc=gcc -Duseithreads -Duse64bitall -DDEBUGGING
[2022-08-03 13:38:18-0400] ------------------------------------------------------------------------------
[2022-08-03 13:38:18-0400] make distclean ...
[2022-08-03 13:38:34-0400] 
[2022-08-03 13:38:34-0400] Copy Policy.sh ...
[2022-08-03 13:38:34-0400] 
[2022-08-03 13:38:34-0400] Configure ...
[2022-08-03 13:40:21-0400] 
[2022-08-03 13:40:21-0400] make ...
Warning (mostly harmless): No library found for -lposix
Warning (mostly harmless): No library found for -lcposix
[2022-08-03 13:47:43-0400] Skip tests from '/home/core/smoke/TestSmoke/smokecurrent.skiptests'
[2022-08-03 13:47:43-0400] 
[2022-08-03 13:47:43-0400]  Tests start here:
[2022-08-03 13:47:43-0400] TSTENV = stdio	
[2022-08-03 14:16:04-0400] 
[2022-08-03 14:16:04-0400] All tests successful.
[2022-08-03 14:16:04-0400] Archived results...
[2022-08-03 14:16:04-0400] Unskip tests from '/home/core/smoke/TestSmoke/smokecurrent.skiptests'
[2022-08-03 14:16:04-0400] 
[2022-08-03 14:16:04-0400] Configuration: -Dusedevel -Dcc=gcc -Duseithreads -Dusequadmath
[2022-08-03 14:16:04-0400] ------------------------------------------------------------------------------
[2022-08-03 14:16:04-0400] make distclean ...
[2022-08-03 14:16:23-0400] 
[2022-08-03 14:16:23-0400] Copy Policy.sh ...
[2022-08-03 14:16:23-0400] 
[2022-08-03 14:16:23-0400] Configure ...
[2022-08-03 14:18:05-0400] 
[2022-08-03 14:18:05-0400] make ...
Warning (mostly harmless): No library found for -lposix
Warning (mostly harmless): No library found for -lcposix
[2022-08-03 14:23:05-0400] Skip tests from '/home/core/smoke/TestSmoke/smokecurrent.skiptests'
[2022-08-03 14:23:05-0400] 
[2022-08-03 14:23:05-0400]  Tests start here:
[2022-08-03 14:23:05-0400] TSTENV = stdio	
[2022-08-03 14:47:27-0400] 
[2022-08-03 14:47:27-0400] All tests successful.
[2022-08-03 14:47:27-0400] Archived results...
[2022-08-03 14:47:27-0400] Unskip tests from '/home/core/smoke/TestSmoke/smokecurrent.skiptests'
[2022-08-03 14:47:27-0400] 
[2022-08-03 14:47:27-0400] Configuration: -Dusedevel -Dcc=gcc -Duseithreads -Dusequadmath -DDEBUGGING
[2022-08-03 14:47:27-0400] ------------------------------------------------------------------------------
[2022-08-03 14:47:27-0400] make distclean ...
[2022-08-03 14:47:42-0400] 
[2022-08-03 14:47:42-0400] Copy Policy.sh ...
[2022-08-03 14:47:42-0400] 
[2022-08-03 14:47:42-0400] Configure ...
[2022-08-03 14:49:29-0400] 
[2022-08-03 14:49:29-0400] make ...
Warning (mostly harmless): No library found for -lposix
Warning (mostly harmless): No library found for -lcposix
[2022-08-03 14:56:40-0400] Skip tests from '/home/core/smoke/TestSmoke/smokecurrent.skiptests'
[2022-08-03 14:56:40-0400] 
[2022-08-03 14:56:40-0400]  Tests start here:
[2022-08-03 14:56:40-0400] TSTENV = stdio	
-- 
Report generated by Test::Smoke::Gateway v0.10