Show report
[2022-07-26 13:39:54+0200] ==> Starting synctree
[2022-07-26 13:39:54+0200] qx[/opt/homebrew/bin/git remote update --prune 2>&1]
[2022-07-26 13:40:01+0200] qx[/opt/homebrew/bin/git checkout blead 2>&1]
[2022-07-26 13:40:01+0200] qx[/opt/homebrew/bin/git reset --hard origin/blead 2>&1]
[2022-07-26 13:40:01+0200] qx[/opt/homebrew/bin/git clone /Users/abeltje/ztreet/perl5coresmoke/perl-from-git /Users/abeltje/ztreet/perl5coresmoke/perl-current 2>&1]
[2022-07-26 13:40:02+0200] qx[/opt/homebrew/bin/git reset --hard HEAD 2>&1]
[2022-07-26 13:40:02+0200] qx[/opt/homebrew/bin/git clean -dfx 2>&1]
[2022-07-26 13:40:02+0200] qx[/opt/homebrew/bin/git fetch origin 2>&1]
[2022-07-26 13:40:02+0200] qx[/opt/homebrew/bin/git checkout blead 2>&1]
[2022-07-26 13:40:02+0200] qx[/opt/homebrew/bin/git reset --hard origin/blead 2>&1]
[2022-07-26 13:40:03+0200] qx[/opt/homebrew/Cellar/perl/5.34.0/bin/perl Porting/make_dot_patch.pl > .patch]
[2022-07-26 13:40:03+0200] /Users/abeltje/ztreet/perl5coresmoke/perl-current is now up to patchlevel c8f18a28144cc5de90a4ff6ab2de23a05b749eb8
[2022-07-26 13:40:03+0200] ==> Starting runsmoke
[2022-07-26 13:40:03+0200] [/Users/abeltje/ztreet/perl5coresmoke/bin/tssmokeperl.pl] chdir(/Users/abeltje/ztreet/perl5coresmoke/perl-current)
[2022-07-26 13:40:03+0200] qx[/opt/homebrew/Cellar/perl/5.34.0/bin/perl -e "require q[/Users/abeltje/ztreet/perl5coresmoke/perl-current/cpan/Test-Harness/lib/Test/Harness.pm];print Test::Harness->VERSION" 2>&1]
[2022-07-26 13:40:03+0200] Found: Test::Harness version 3.44.
[2022-07-26 13:40:03+0200] Reading build configurations from /Users/abeltje/ztreet/perl5coresmoke/etc/blead.buildcfg
[2022-07-26 13:40:03+0200] Reading 'Policy.sh' from default content (v=1)
[2022-07-26 13:40:03+0200] make distclean ...
[2022-07-26 13:40:03+0200] Smoking patch c8f18a28144cc5de90a4ff6ab2de23a05b749eb8 v5.37.2-16-gc8f18a2814
[2022-07-26 13:40:03+0200] Smoking branch blead
[2022-07-26 13:40:03+0200] Locally applied patches from '/Users/abeltje/ztreet/perl5coresmoke/perl-current/patchlevel.h'
[2022-07-26 13:40:03+0200] Patches: 'uncommitted-changes'
[2022-07-26 13:40:03+0200] Adding 'SMOKEc8f18a28144cc5de90a4ff6ab2de23a05b749eb8' to the registered patches.
[2022-07-26 13:40:03+0200] 
[2022-07-26 13:40:03+0200] Configuration: -Dusedevel
[2022-07-26 13:40:03+0200] ------------------------------------------------------------------------------
[2022-07-26 13:40:03+0200] make distclean ...
[2022-07-26 13:40:03+0200] 
[2022-07-26 13:40:03+0200] Copy Policy.sh ...
[2022-07-26 13:40:03+0200] 
[2022-07-26 13:40:03+0200] Configure ...
[2022-07-26 13:40:59+0200] 
[2022-07-26 13:40:59+0200] make ...
[2022-07-26 13:42:36+0200] 
[2022-07-26 13:42:36+0200]  Tests start here:
[2022-07-26 13:42:36+0200] TSTENV = stdio	
[2022-07-26 13:42:36+0200] ./runtests choose
No such file or directory
No such file or directory
Warning: -L./mylib changed to -L/Users/abeltje/ztreet/perl5coresmoke/perl-current/cpan/ExtUtils-MakeMaker/t/gK8q3a8jX0/./mylib
# not ok 1 - ext/B/B.pm version 1.85
[2022-07-26 13:53:25+0200] t/porting/cmp_version ............................................ FAILED at test 1
Failed 1 test out of 2489, 99.96% okay.
### Since not all tests were successful, you may want to run some of
### them individually and examine any diagnostic messages they produce.
### See the INSTALL document's section on "make test".
### You have a good chance to get more information by running
###   ./perl harness
### in the 't' directory since most (>=80%) of the tests succeeded.
### You may have to set your dynamic library search path,
### DYLD_LIBRARY_PATH, to point to the build directory:
###   setenv DYLD_LIBRARY_PATH `pwd`; cd t; ./perl harness
###   DYLD_LIBRARY_PATH=`pwd`; export DYLD_LIBRARY_PATH; cd t; ./perl harness
###   export DYLD_LIBRARY_PATH=`pwd`; cd t; ./perl harness
### for csh-style shells, like tcsh; or for traditional/modern
### Bourne-style shells, like bash, ksh, and zsh, respectively.
[2022-07-26 13:53:45+0200] Elapsed: 669 sec
[2022-07-26 13:53:45+0200] u=3.78  s=2.42  cu=300.19  cs=35.12  scripts=2489  tests=1174931
make: *** [_test] Error 1
[2022-07-26 13:53:45+0200] 
[2022-07-26 13:53:45+0200] Error while reading test-results: 2
[2022-07-26 13:53:45+0200] 
[2022-07-26 13:53:45+0200] Extending failures with harness:
[2022-07-26 13:53:45+0200] 	../t/porting/cmp_version.t
[2022-07-26 13:53:46+0200] ../t/porting/cmp_version.t .. 

[2022-07-26 13:53:46+0200] Failed 1/4 subtests 



[2022-07-26 13:53:46+0200] Test Summary Report

[2022-07-26 13:53:46+0200] -------------------

[2022-07-26 13:53:46+0200] ../t/porting/cmp_version.t (Wstat: 0 Tests: 4 Failed: 1)

[2022-07-26 13:53:46+0200]   Failed test:  1

[2022-07-26 13:53:46+0200] Files=1, Tests=4,  1 wallclock secs ( 0.00 usr  0.00 sys +  0.10 cusr  0.16 csys =  0.26 CPU)

[2022-07-26 13:53:46+0200] Result: FAIL

[2022-07-26 13:53:46+0200] 
[2022-07-26 13:53:46+0200]     ../t/porting/cmp_version.t..................................FAILED
[2022-07-26 13:53:46+0200]         1

[2022-07-26 13:53:46+0200] TSTENV = perlio	
[2022-07-26 13:53:46+0200] ./runtests choose
Warning: -L./mylib changed to -L/Users/abeltje/ztreet/perl5coresmoke/perl-current/cpan/ExtUtils-MakeMaker/t/SIEC4Lf5oM/./mylib
# not ok 1 - ext/B/B.pm version 1.85
[2022-07-26 14:03:40+0200] t/porting/cmp_version ............................................ FAILED at test 1
Failed 1 test out of 2491, 99.96% okay.
### Since not all tests were successful, you may want to run some of
### them individually and examine any diagnostic messages they produce.
### See the INSTALL document's section on "make test".
### You have a good chance to get more information by running
###   ./perl harness
### in the 't' directory since most (>=80%) of the tests succeeded.
### You may have to set your dynamic library search path,
### DYLD_LIBRARY_PATH, to point to the build directory:
###   setenv DYLD_LIBRARY_PATH `pwd`; cd t; ./perl harness
###   DYLD_LIBRARY_PATH=`pwd`; export DYLD_LIBRARY_PATH; cd t; ./perl harness
###   export DYLD_LIBRARY_PATH=`pwd`; cd t; ./perl harness
### for csh-style shells, like tcsh; or for traditional/modern
### Bourne-style shells, like bash, ksh, and zsh, respectively.
[2022-07-26 14:03:58+0200] Elapsed: 612 sec
[2022-07-26 14:03:58+0200] u=2.15  s=2.44  cu=251.93  cs=29.88  scripts=2491  tests=1175068
make: *** [_test] Error 1
[2022-07-26 14:03:58+0200] 
[2022-07-26 14:03:58+0200] Error while reading test-results: 2
[2022-07-26 14:03:58+0200] 
[2022-07-26 14:03:58+0200] Extending failures with harness:
[2022-07-26 14:03:58+0200] 	../t/porting/cmp_version.t
[2022-07-26 14:03:58+0200] ../t/porting/cmp_version.t .. 

[2022-07-26 14:03:58+0200] Failed 1/4 subtests 



[2022-07-26 14:03:58+0200] Test Summary Report

[2022-07-26 14:03:58+0200] -------------------

[2022-07-26 14:03:58+0200] ../t/porting/cmp_version.t (Wstat: 0 Tests: 4 Failed: 1)

[2022-07-26 14:03:58+0200]   Failed test:  1

[2022-07-26 14:03:58+0200] Files=1, Tests=4,  0 wallclock secs ( 0.01 usr  0.00 sys +  0.09 cusr  0.16 csys =  0.26 CPU)

[2022-07-26 14:03:58+0200] Result: FAIL

[2022-07-26 14:03:58+0200] 
[2022-07-26 14:03:58+0200]     ../t/porting/cmp_version.t..................................FAILED
[2022-07-26 14:03:58+0200]         1

[2022-07-26 14:03:58+0200] TSTENV = locale:nl_NL.UTF8	
[2022-07-26 14:03:58+0200] ./runtests choose
Warning: -L./mylib changed to -L/Users/abeltje/ztreet/perl5coresmoke/perl-current/cpan/ExtUtils-MakeMaker/t/OZArWiv_dq/./mylib
# not ok 1 - ext/B/B.pm version 1.85
[2022-07-26 14:13:49+0200] t/porting/cmp_version ............................................ FAILED at test 1
Failed 1 test out of 2491, 99.96% okay.
### Since not all tests were successful, you may want to run some of
### them individually and examine any diagnostic messages they produce.
### See the INSTALL document's section on "make test".
### You have a good chance to get more information by running
###   ./perl harness
### in the 't' directory since most (>=80%) of the tests succeeded.
### You may have to set your dynamic library search path,
### DYLD_LIBRARY_PATH, to point to the build directory:
###   setenv DYLD_LIBRARY_PATH `pwd`; cd t; ./perl harness
###   DYLD_LIBRARY_PATH=`pwd`; export DYLD_LIBRARY_PATH; cd t; ./perl harness
###   export DYLD_LIBRARY_PATH=`pwd`; cd t; ./perl harness
### for csh-style shells, like tcsh; or for traditional/modern
### Bourne-style shells, like bash, ksh, and zsh, respectively.
[2022-07-26 14:14:07+0200] Elapsed: 609 sec
[2022-07-26 14:14:07+0200] u=2.18  s=2.53  cu=252.29  cs=29.95  scripts=2491  tests=1175112
make: *** [_test] Error 1
[2022-07-26 14:14:07+0200] 
[2022-07-26 14:14:07+0200] Error while reading test-results: 2
[2022-07-26 14:14:07+0200] 
[2022-07-26 14:14:07+0200] Extending failures with harness:
[2022-07-26 14:14:07+0200] 	../t/porting/cmp_version.t
[2022-07-26 14:14:07+0200] ../t/porting/cmp_version.t .. 

[2022-07-26 14:14:07+0200] Failed 1/4 subtests 



[2022-07-26 14:14:07+0200] Test Summary Report

[2022-07-26 14:14:07+0200] -------------------

[2022-07-26 14:14:07+0200] ../t/porting/cmp_version.t (Wstat: 0 Tests: 4 Failed: 1)

[2022-07-26 14:14:07+0200]   Failed test:  1

[2022-07-26 14:14:07+0200] Files=1, Tests=4,  0 wallclock secs ( 0.01 usr  0.00 sys +  0.08 cusr  0.15 csys =  0.24 CPU)

[2022-07-26 14:14:07+0200] Result: FAIL

[2022-07-26 14:14:07+0200] 
[2022-07-26 14:14:07+0200]     ../t/porting/cmp_version.t..................................FAILED
[2022-07-26 14:14:07+0200]         1

[2022-07-26 14:14:07+0200] 
[2022-07-26 14:14:07+0200] Configuration: -Dusedevel -DDEBUGGING
[2022-07-26 14:14:07+0200] ------------------------------------------------------------------------------
[2022-07-26 14:14:07+0200] make distclean ...
[2022-07-26 14:14:14+0200] 
[2022-07-26 14:14:14+0200] Copy Policy.sh ...
[2022-07-26 14:14:14+0200] 
[2022-07-26 14:14:14+0200] Configure ...
[2022-07-26 14:15:16+0200] 
[2022-07-26 14:15:16+0200] make ...
[2022-07-26 14:17:23+0200] 
[2022-07-26 14:17:23+0200]  Tests start here:
[2022-07-26 14:17:23+0200] TSTENV = stdio	
[2022-07-26 14:17:23+0200] ./runtests choose
No such file or directory
No such file or directory
Warning: -L./mylib changed to -L/Users/abeltje/ztreet/perl5coresmoke/perl-current/cpan/ExtUtils-MakeMaker/t/iumx02aN5z/./mylib
# not ok 1 - ext/B/B.pm version 1.85
[2022-07-26 14:28:30+0200] t/porting/cmp_version ............................................ FAILED at test 1
Failed 1 test out of 2490, 99.96% okay.
### Since not all tests were successful, you may want to run some of
### them individually and examine any diagnostic messages they produce.
### See the INSTALL document's section on "make test".
### You have a good chance to get more information by running
###   ./perl harness
### in the 't' directory since most (>=80%) of the tests succeeded.
### You may have to set your dynamic library search path,
### DYLD_LIBRARY_PATH, to point to the build directory:
###   setenv DYLD_LIBRARY_PATH `pwd`; cd t; ./perl harness
###   DYLD_LIBRARY_PATH=`pwd`; export DYLD_LIBRARY_PATH; cd t; ./perl harness
###   export DYLD_LIBRARY_PATH=`pwd`; cd t; ./perl harness
### for csh-style shells, like tcsh; or for traditional/modern
### Bourne-style shells, like bash, ksh, and zsh, respectively.
[2022-07-26 14:28:53+0200] Elapsed: 690 sec
[2022-07-26 14:28:53+0200] u=4.33  s=2.60  cu=313.51  cs=37.14  scripts=2490  tests=1174959
make: *** [_test] Error 1
[2022-07-26 14:28:53+0200] 
[2022-07-26 14:28:53+0200] Error while reading test-results: 2
[2022-07-26 14:28:53+0200] 
[2022-07-26 14:28:53+0200] Extending failures with harness:
[2022-07-26 14:28:53+0200] 	../t/porting/cmp_version.t
[2022-07-26 14:28:53+0200] ../t/porting/cmp_version.t .. 

[2022-07-26 14:28:53+0200] Failed 1/4 subtests 



[2022-07-26 14:28:53+0200] Test Summary Report

[2022-07-26 14:28:53+0200] -------------------

[2022-07-26 14:28:53+0200] ../t/porting/cmp_version.t (Wstat: 0 Tests: 4 Failed: 1)

[2022-07-26 14:28:53+0200]   Failed test:  1

[2022-07-26 14:28:53+0200] Files=1, Tests=4,  0 wallclock secs ( 0.00 usr  0.00 sys +  0.11 cusr  0.15 csys =  0.26 CPU)

[2022-07-26 14:28:53+0200] Result: FAIL

[2022-07-26 14:28:53+0200] 
[2022-07-26 14:28:53+0200]     ../t/porting/cmp_version.t..................................FAILED
[2022-07-26 14:28:53+0200]         1

[2022-07-26 14:28:53+0200] TSTENV = perlio	
[2022-07-26 14:28:53+0200] ./runtests choose
Warning: -L./mylib changed to -L/Users/abeltje/ztreet/perl5coresmoke/perl-current/cpan/ExtUtils-MakeMaker/t/SjJUm5XPkZ/./mylib
# not ok 1 - ext/B/B.pm version 1.85
[2022-07-26 14:39:11+0200] t/porting/cmp_version ............................................ FAILED at test 1
Failed 1 test out of 2492, 99.96% okay.
### Since not all tests were successful, you may want to run some of
### them individually and examine any diagnostic messages they produce.
### See the INSTALL document's section on "make test".
### You have a good chance to get more information by running
###   ./perl harness
### in the 't' directory since most (>=80%) of the tests succeeded.
### You may have to set your dynamic library search path,
### DYLD_LIBRARY_PATH, to point to the build directory:
###   setenv DYLD_LIBRARY_PATH `pwd`; cd t; ./perl harness
###   DYLD_LIBRARY_PATH=`pwd`; export DYLD_LIBRARY_PATH; cd t; ./perl harness
###   export DYLD_LIBRARY_PATH=`pwd`; cd t; ./perl harness
### for csh-style shells, like tcsh; or for traditional/modern
### Bourne-style shells, like bash, ksh, and zsh, respectively.
[2022-07-26 14:39:32+0200] Elapsed: 639 sec
[2022-07-26 14:39:32+0200] u=2.79  s=2.85  cu=278.46  cs=33.02  scripts=2492  tests=1175080
make: *** [_test] Error 1
[2022-07-26 14:39:32+0200] 
[2022-07-26 14:39:32+0200] Error while reading test-results: 2
[2022-07-26 14:39:32+0200] 
[2022-07-26 14:39:32+0200] Extending failures with harness:
[2022-07-26 14:39:32+0200] 	../t/porting/cmp_version.t
[2022-07-26 14:39:32+0200] ../t/porting/cmp_version.t .. 

[2022-07-26 14:39:32+0200] Failed 1/4 subtests 



[2022-07-26 14:39:32+0200] Test Summary Report

[2022-07-26 14:39:32+0200] -------------------

[2022-07-26 14:39:32+0200] ../t/porting/cmp_version.t (Wstat: 0 Tests: 4 Failed: 1)

[2022-07-26 14:39:32+0200]   Failed test:  1

[2022-07-26 14:39:32+0200] Files=1, Tests=4,  0 wallclock secs ( 0.00 usr  0.00 sys +  0.09 cusr  0.16 csys =  0.25 CPU)

[2022-07-26 14:39:32+0200] Result: FAIL

[2022-07-26 14:39:32+0200] 
[2022-07-26 14:39:32+0200]     ../t/porting/cmp_version.t..................................FAILED
[2022-07-26 14:39:32+0200]         1

[2022-07-26 14:39:32+0200] TSTENV = locale:nl_NL.UTF8	
[2022-07-26 14:39:32+0200] ./runtests choose
Warning: -L./mylib changed to -L/Users/abeltje/ztreet/perl5coresmoke/perl-current/cpan/ExtUtils-MakeMaker/t/boT2ygulEF/./mylib
# not ok 1 - ext/B/B.pm version 1.85
[2022-07-26 14:49:57+0200] t/porting/cmp_version ............................................ FAILED at test 1
Failed 1 test out of 2492, 99.96% okay.
### Since not all tests were successful, you may want to run some of
### them individually and examine any diagnostic messages they produce.
### See the INSTALL document's section on "make test".
### You have a good chance to get more information by running
###   ./perl harness
### in the 't' directory since most (>=80%) of the tests succeeded.
### You may have to set your dynamic library search path,
### DYLD_LIBRARY_PATH, to point to the build directory:
###   setenv DYLD_LIBRARY_PATH `pwd`; cd t; ./perl harness
###   DYLD_LIBRARY_PATH=`pwd`; export DYLD_LIBRARY_PATH; cd t; ./perl harness
###   export DYLD_LIBRARY_PATH=`pwd`; cd t; ./perl harness
### for csh-style shells, like tcsh; or for traditional/modern
### Bourne-style shells, like bash, ksh, and zsh, respectively.
[2022-07-26 14:50:17+0200] Elapsed: 645 sec
[2022-07-26 14:50:17+0200] u=2.88  s=2.92  cu=279.55  cs=34.98  scripts=2492  tests=1174981
make: *** [_test] Error 1
[2022-07-26 14:50:17+0200] 
[2022-07-26 14:50:17+0200] Error while reading test-results: 2
[2022-07-26 14:50:17+0200] 
[2022-07-26 14:50:17+0200] Extending failures with harness:
[2022-07-26 14:50:17+0200] 	../t/porting/cmp_version.t
[2022-07-26 14:50:17+0200] ../t/porting/cmp_version.t .. 

[2022-07-26 14:50:17+0200] Failed 1/4 subtests 



[2022-07-26 14:50:17+0200] Test Summary Report

[2022-07-26 14:50:17+0200] -------------------

[2022-07-26 14:50:17+0200] ../t/porting/cmp_version.t (Wstat: 0 Tests: 4 Failed: 1)

[2022-07-26 14:50:17+0200]   Failed test:  1

[2022-07-26 14:50:17+0200] Files=1, Tests=4,  0 wallclock secs ( 0.00 usr  0.00 sys +  0.09 cusr  0.14 csys =  0.23 CPU)

[2022-07-26 14:50:17+0200] Result: FAIL

[2022-07-26 14:50:17+0200] 
[2022-07-26 14:50:17+0200]     ../t/porting/cmp_version.t..................................FAILED
[2022-07-26 14:50:17+0200]         1

[2022-07-26 14:50:17+0200] Finished smoking c8f18a28144cc5de90a4ff6ab2de23a05b749eb8 v5.37.2-16-gc8f18a2814 blead
[2022-07-26 14:50:18+0200] Reading smokeresult from /Users/abeltje/ztreet/perl5coresmoke/perl-current/mktest.out
[2022-07-26 14:50:18+0200] Processing []
[2022-07-26 14:50:18+0200] Processing [-DDEBUGGING]
[2022-07-26 14:50:18+0200] ==> Starting reporter
[2022-07-26 14:50:18+0200] Writing report to '/Users/abeltje/ztreet/perl5coresmoke/perl-current/mktest.rpt'
[2022-07-26 14:50:18+0200] Locally applied patches from '/Users/abeltje/ztreet/perl5coresmoke/perl-current/patchlevel.h'
[2022-07-26 14:50:18+0200] Patches: 'uncommitted-changes'
[2022-07-26 14:50:18+0200] Looking for cc messages: 'gcc'
-- 
Report generated by Test::Smoke::Gateway v0.10