Show report
[2022-06-22 18:47:35-0400] ==> Starting synctree
[2022-06-22 18:47:35-0400] qx[/usr/pkg/bin/git clone file:///home/core/smoke/git /home/core/smoke/git-perl 2>&1]
[2022-06-22 18:50:17-0400] qx[/usr/pkg/bin/git remote update --prune 2>&1]
[2022-06-22 18:50:17-0400] qx[/usr/pkg/bin/git checkout blead
[2022-06-22 18:50:17-0400]  2>&1]
Already on 'blead'
[2022-06-22 18:50:17-0400] qx[/usr/pkg/bin/git reset --hard origin/blead
[2022-06-22 18:50:17-0400]  2>&1]
[2022-06-22 18:50:17-0400] qx[/usr/pkg/bin/git clone /home/core/smoke/git-perl /home/core/smoke/perl-current 2>&1]
[2022-06-22 18:50:21-0400] qx[/usr/pkg/bin/git clean -dfx 2>&1]
[2022-06-22 18:50:22-0400] qx[/usr/pkg/bin/git fetch origin 2>&1]
[2022-06-22 18:50:22-0400] qx[/usr/pkg/bin/git checkout blead
[2022-06-22 18:50:22-0400]  2>&1]
Already on 'blead'
[2022-06-22 18:50:22-0400] qx[/usr/pkg/bin/git reset --hard origin/blead
[2022-06-22 18:50:22-0400]  2>&1]
[2022-06-22 18:50:22-0400] qx[/home/core/bin/perl-5.26.1/bin/perl5.26.1 Porting/make_dot_patch.pl > .patch]
[2022-06-22 18:50:22-0400] /home/core/smoke/perl-current is now up to patchlevel dd4d3f69a5f082c6c3cdd2a49512ea7e630b62cb
[2022-06-22 18:50:22-0400] ==> Starting runsmoke
[2022-06-22 18:50:22-0400] [./tssmokeperl.pl] chdir(/home/core/smoke/perl-current)
[2022-06-22 18:50:22-0400] qx[/home/core/bin/perl-5.26.1/bin/perl5.26.1 -e "require q[/home/core/smoke/perl-current/cpan/Test-Harness/lib/Test/Harness.pm];print Test::Harness->VERSION" 2>&1]
[2022-06-22 18:50:22-0400] Found: Test::Harness version 3.44.
[2022-06-22 18:50:22-0400] Reading build configurations from /home/core/smoke/TestSmoke/perlcurrent.cfg
[2022-06-22 18:50:22-0400] Reading 'Policy.sh' from default content (v=1)
[2022-06-22 18:50:22-0400] Running smoke tests without $ENV{PERLIO}
[2022-06-22 18:50:22-0400] Running test suite only with 'harness'
[2022-06-22 18:50:22-0400] make distclean ...
[2022-06-22 18:50:22-0400] Smoking patch dd4d3f69a5f082c6c3cdd2a49512ea7e630b62cb v5.37.1-18-gdd4d3f69a5
[2022-06-22 18:50:22-0400] Smoking branch blead
[2022-06-22 18:50:23-0400] Locally applied patches from '/home/core/smoke/perl-current/patchlevel.h'
[2022-06-22 18:50:23-0400] Patches: 'uncommitted-changes'
[2022-06-22 18:50:23-0400] Adding 'SMOKEdd4d3f69a5f082c6c3cdd2a49512ea7e630b62cb' to the registered patches.
[2022-06-22 18:50:23-0400] 
[2022-06-22 18:50:23-0400] Configuration: -Dusedevel -Dcc=gcc
[2022-06-22 18:50:23-0400] ------------------------------------------------------------------------------
[2022-06-22 18:50:23-0400] make distclean ...
[2022-06-22 18:50:23-0400] 
[2022-06-22 18:50:23-0400] Copy Policy.sh ...
[2022-06-22 18:50:23-0400] 
[2022-06-22 18:50:23-0400] Configure ...
size != strlen(buffer) + 1 (0 != 1)
[2022-06-22 18:51:15-0400] 
[2022-06-22 18:51:15-0400] make ...
locale.c:1113:1: warning: 'S_calculate_LC_ALL' defined but not used [-Wunused-function]
 S_calculate_LC_ALL(pTHX_ const char ** individ_locales)
 ^
/usr/include/sys/cdefs_elf.h:67:20: error: missing binary operator before token "("
 #if __GNUC_PREREQ__(4, 0)
                    ^
/usr/include/sys/cdefs_elf.h:73:20: error: missing binary operator before token "("
 #if __GNUC_PREREQ__(4, 0)
                    ^
/usr/include/sys/cdefs_elf.h:79:20: error: missing binary operator before token "("
 #if __GNUC_PREREQ__(4, 2)
                    ^
Warning (mostly harmless): No library found for -lndbm
Warning (mostly harmless): No library found for -ldbm
Warning (mostly harmless): No library found for -lucb
Warning (mostly harmless): No library found for -lcposix
Socket.c: In function 'XS_Socket_pack_ip_mreq_source':
Socket.c:1703:7: warning: variable 'interface' set but not used [-Wunused-but-set-variable]
  SV * interface;
       ^
In file included from HiRes.xs:860:0:
const-c.inc: In function 'constant_19':
const-c.inc:351:42: warning: unused parameter 'iv_return' [-Wunused-parameter]
 constant_19 (pTHX_ const char *name, IV *iv_return) {
                                          ^
re_exec.c: In function 'S_regtry':
re_exec.c:7099:44: warning: 'fold_array' may be used uninitialized in this function [-Wmaybe-uninitialized]
                 && UCHARAT(s) != fold_array[nextbyte])
                                            ^
re_exec.c:7003:24: note: 'fold_array' was declared here
             const U8 * fold_array;
                        ^
re_exec.c:7105:29: warning: 'folder' may be used uninitialized in this function [-Wmaybe-uninitialized]
             if (ln > 1 && ! folder(aTHX_ locinput, s, ln))
                             ^
re_exec.c:7002:23: note: 'folder' was declared here
             re_fold_t folder;
                       ^
[2022-06-22 18:56:20-0400] Skip tests from '/home/core/smoke/TestSmoke/smokecurrent.skiptests'
[2022-06-22 18:56:20-0400] 
[2022-06-22 18:56:20-0400]  Tests start here:
[2022-06-22 18:56:20-0400] TSTENV = stdio	
# 
# 
# Compress::Raw::Zlib::VERSION        2.105
# 
# ZLIB_VERSION (from zlib.h)          1.2.12
# zlib_version (from zlib library)    1.2.12
# 
# ZLIB_VERNUM                         0x12C0
# BUILD_ZLIB                          1
# GZIP_OS_CODE                        3
# 
# zlibCompileFlags                    169
#   Type Sizes
#     size of uInt                    32 bit
#     size of uLong                   64 bit
#     size of pointer                 64 bit
#     size of z_off_t                 64 bit
#   Compiler Options                  None
#   One-time table building           None
#   Library content                   None
#   Operation variations              None
# 
[2022-06-22 19:25:34-0400] 
[2022-06-22 19:25:34-0400] All tests successful.
[2022-06-22 19:25:34-0400] Archived results...
[2022-06-22 19:25:34-0400] Unskip tests from '/home/core/smoke/TestSmoke/smokecurrent.skiptests'
[2022-06-22 19:25:34-0400] 
[2022-06-22 19:25:34-0400] Configuration: -Dusedevel -Dcc=gcc -DDEBUGGING
[2022-06-22 19:25:34-0400] ------------------------------------------------------------------------------
[2022-06-22 19:25:34-0400] make distclean ...
[2022-06-22 19:26:00-0400] 
[2022-06-22 19:26:00-0400] Copy Policy.sh ...
[2022-06-22 19:26:00-0400] 
[2022-06-22 19:26:00-0400] Configure ...
size != strlen(buffer) + 1 (0 != 1)
[2022-06-22 19:26:55-0400] 
[2022-06-22 19:26:55-0400] make ...
In file included from perl.h:4101:0,
                 from util.c:26:
util.c: In function 'Perl_xs_handshake':
util.c:5788:36: warning: comparison is always true due to limited range of data type [-Wtype-limits]
         assert(HS_GETXSVERLEN(key) <= UCHAR_MAX && HS_GETXSVERLEN(key) <= HS_APIVERLEN_MAX);
                                    ^
regexec.c: In function 'S_regtry':
regexec.c:7099:44: warning: 'fold_array' may be used uninitialized in this function [-Wmaybe-uninitialized]
                 && UCHARAT(s) != fold_array[nextbyte])
                                            ^
regexec.c:7003:24: note: 'fold_array' was declared here
             const U8 * fold_array;
                        ^
regexec.c:7105:29: warning: 'folder' may be used uninitialized in this function [-Wmaybe-uninitialized]
             if (ln > 1 && ! folder(aTHX_ locinput, s, ln))
                             ^
regexec.c:7002:23: note: 'folder' was declared here
             re_fold_t folder;
                       ^
locale.c:1113:1: warning: 'S_calculate_LC_ALL' defined but not used [-Wunused-function]
 S_calculate_LC_ALL(pTHX_ const char ** individ_locales)
 ^
/usr/include/sys/cdefs_elf.h:67:20: error: missing binary operator before token "("
 #if __GNUC_PREREQ__(4, 0)
                    ^
/usr/include/sys/cdefs_elf.h:73:20: error: missing binary operator before token "("
 #if __GNUC_PREREQ__(4, 0)
                    ^
/usr/include/sys/cdefs_elf.h:79:20: error: missing binary operator before token "("
 #if __GNUC_PREREQ__(4, 2)
                    ^
Warning (mostly harmless): No library found for -lndbm
Warning (mostly harmless): No library found for -ldbm
Warning (mostly harmless): No library found for -lucb
Warning (mostly harmless): No library found for -lcposix
Socket.c: In function 'XS_Socket_pack_ip_mreq_source':
Socket.c:1703:7: warning: variable 'interface' set but not used [-Wunused-but-set-variable]
  SV * interface;
       ^
In file included from HiRes.xs:860:0:
const-c.inc: In function 'constant_19':
const-c.inc:351:42: warning: unused parameter 'iv_return' [-Wunused-parameter]
 constant_19 (pTHX_ const char *name, IV *iv_return) {
                                          ^
re_exec.c: In function 'S_regtry':
re_exec.c:7099:44: warning: 'fold_array' may be used uninitialized in this function [-Wmaybe-uninitialized]
                 && UCHARAT(s) != fold_array[nextbyte])
                                            ^
re_exec.c:7003:24: note: 'fold_array' was declared here
             const U8 * fold_array;
                        ^
re_exec.c:7105:29: warning: 'folder' may be used uninitialized in this function [-Wmaybe-uninitialized]
             if (ln > 1 && ! folder(aTHX_ locinput, s, ln))
                             ^
re_exec.c:7002:23: note: 'folder' was declared here
             re_fold_t folder;
                       ^
[2022-06-22 19:34:31-0400] Skip tests from '/home/core/smoke/TestSmoke/smokecurrent.skiptests'
[2022-06-22 19:34:31-0400] 
[2022-06-22 19:34:31-0400]  Tests start here:
[2022-06-22 19:34:31-0400] TSTENV = stdio	
# 
# 
# Compress::Raw::Zlib::VERSION        2.105
# 
# ZLIB_VERSION (from zlib.h)          1.2.12
# zlib_version (from zlib library)    1.2.12
# 
# ZLIB_VERNUM                         0x12C0
# BUILD_ZLIB                          1
# GZIP_OS_CODE                        3
# 
# zlibCompileFlags                    169
#   Type Sizes
#     size of uInt                    32 bit
#     size of uLong                   64 bit
#     size of pointer                 64 bit
#     size of z_off_t                 64 bit
#   Compiler Options                  None
#   One-time table building           None
#   Library content                   None
#   Operation variations              None
# 
[2022-06-22 20:12:05-0400] 
[2022-06-22 20:12:05-0400] All tests successful.
[2022-06-22 20:12:05-0400] Archived results...
[2022-06-22 20:12:05-0400] Unskip tests from '/home/core/smoke/TestSmoke/smokecurrent.skiptests'
[2022-06-22 20:12:05-0400] 
[2022-06-22 20:12:05-0400] Configuration: -Dusedevel -Dcc=gcc -Duse64bitall
[2022-06-22 20:12:05-0400] ------------------------------------------------------------------------------
[2022-06-22 20:12:05-0400] make distclean ...
[2022-06-22 20:12:35-0400] 
[2022-06-22 20:12:35-0400] Copy Policy.sh ...
[2022-06-22 20:12:35-0400] 
[2022-06-22 20:12:35-0400] Configure ...
size != strlen(buffer) + 1 (0 != 1)
[2022-06-22 20:13:24-0400] 
[2022-06-22 20:13:24-0400] make ...
locale.c:1113:1: warning: 'S_calculate_LC_ALL' defined but not used [-Wunused-function]
 S_calculate_LC_ALL(pTHX_ const char ** individ_locales)
 ^
/usr/include/sys/cdefs_elf.h:67:20: error: missing binary operator before token "("
 #if __GNUC_PREREQ__(4, 0)
                    ^
/usr/include/sys/cdefs_elf.h:73:20: error: missing binary operator before token "("
 #if __GNUC_PREREQ__(4, 0)
                    ^
/usr/include/sys/cdefs_elf.h:79:20: error: missing binary operator before token "("
 #if __GNUC_PREREQ__(4, 2)
                    ^
Warning (mostly harmless): No library found for -lndbm
Warning (mostly harmless): No library found for -ldbm
Warning (mostly harmless): No library found for -lucb
Warning (mostly harmless): No library found for -lcposix
Socket.c: In function 'XS_Socket_pack_ip_mreq_source':
Socket.c:1703:7: warning: variable 'interface' set but not used [-Wunused-but-set-variable]
  SV * interface;
       ^
In file included from HiRes.xs:860:0:
const-c.inc: In function 'constant_19':
const-c.inc:351:42: warning: unused parameter 'iv_return' [-Wunused-parameter]
 constant_19 (pTHX_ const char *name, IV *iv_return) {
                                          ^
re_exec.c: In function 'S_regtry':
re_exec.c:7099:44: warning: 'fold_array' may be used uninitialized in this function [-Wmaybe-uninitialized]
                 && UCHARAT(s) != fold_array[nextbyte])
                                            ^
re_exec.c:7003:24: note: 'fold_array' was declared here
             const U8 * fold_array;
                        ^
re_exec.c:7105:29: warning: 'folder' may be used uninitialized in this function [-Wmaybe-uninitialized]
             if (ln > 1 && ! folder(aTHX_ locinput, s, ln))
                             ^
re_exec.c:7002:23: note: 'folder' was declared here
             re_fold_t folder;
                       ^
[2022-06-22 20:18:31-0400] Skip tests from '/home/core/smoke/TestSmoke/smokecurrent.skiptests'
[2022-06-22 20:18:31-0400] 
[2022-06-22 20:18:31-0400]  Tests start here:
[2022-06-22 20:18:31-0400] TSTENV = stdio	
# 
# 
# Compress::Raw::Zlib::VERSION        2.105
# 
# ZLIB_VERSION (from zlib.h)          1.2.12
# zlib_version (from zlib library)    1.2.12
# 
# ZLIB_VERNUM                         0x12C0
# BUILD_ZLIB                          1
# GZIP_OS_CODE                        3
# 
# zlibCompileFlags                    169
#   Type Sizes
#     size of uInt                    32 bit
#     size of uLong                   64 bit
#     size of pointer                 64 bit
#     size of z_off_t                 64 bit
#   Compiler Options                  None
#   One-time table building           None
#   Library content                   None
#   Operation variations              None
# 
[2022-06-22 20:47:41-0400] 
[2022-06-22 20:47:41-0400] All tests successful.
[2022-06-22 20:47:41-0400] Archived results...
[2022-06-22 20:47:41-0400] Unskip tests from '/home/core/smoke/TestSmoke/smokecurrent.skiptests'
[2022-06-22 20:47:41-0400] 
[2022-06-22 20:47:41-0400] Configuration: -Dusedevel -Dcc=gcc -Duse64bitall -DDEBUGGING
[2022-06-22 20:47:41-0400] ------------------------------------------------------------------------------
[2022-06-22 20:47:41-0400] make distclean ...
[2022-06-22 20:48:05-0400] 
[2022-06-22 20:48:05-0400] Copy Policy.sh ...
[2022-06-22 20:48:05-0400] 
[2022-06-22 20:48:05-0400] Configure ...
size != strlen(buffer) + 1 (0 != 1)
[2022-06-22 20:48:58-0400] 
[2022-06-22 20:48:58-0400] make ...
In file included from perl.h:4101:0,
                 from util.c:26:
util.c: In function 'Perl_xs_handshake':
util.c:5788:36: warning: comparison is always true due to limited range of data type [-Wtype-limits]
         assert(HS_GETXSVERLEN(key) <= UCHAR_MAX && HS_GETXSVERLEN(key) <= HS_APIVERLEN_MAX);
                                    ^
regexec.c: In function 'S_regtry':
regexec.c:7099:44: warning: 'fold_array' may be used uninitialized in this function [-Wmaybe-uninitialized]
                 && UCHARAT(s) != fold_array[nextbyte])
                                            ^
regexec.c:7003:24: note: 'fold_array' was declared here
             const U8 * fold_array;
                        ^
regexec.c:7105:29: warning: 'folder' may be used uninitialized in this function [-Wmaybe-uninitialized]
             if (ln > 1 && ! folder(aTHX_ locinput, s, ln))
                             ^
regexec.c:7002:23: note: 'folder' was declared here
             re_fold_t folder;
                       ^
locale.c:1113:1: warning: 'S_calculate_LC_ALL' defined but not used [-Wunused-function]
 S_calculate_LC_ALL(pTHX_ const char ** individ_locales)
 ^
/usr/include/sys/cdefs_elf.h:67:20: error: missing binary operator before token "("
 #if __GNUC_PREREQ__(4, 0)
                    ^
/usr/include/sys/cdefs_elf.h:73:20: error: missing binary operator before token "("
 #if __GNUC_PREREQ__(4, 0)
                    ^
/usr/include/sys/cdefs_elf.h:79:20: error: missing binary operator before token "("
 #if __GNUC_PREREQ__(4, 2)
                    ^
Warning (mostly harmless): No library found for -lndbm
Warning (mostly harmless): No library found for -ldbm
Warning (mostly harmless): No library found for -lucb
Warning (mostly harmless): No library found for -lcposix
Socket.c: In function 'XS_Socket_pack_ip_mreq_source':
Socket.c:1703:7: warning: variable 'interface' set but not used [-Wunused-but-set-variable]
  SV * interface;
       ^
In file included from HiRes.xs:860:0:
const-c.inc: In function 'constant_19':
const-c.inc:351:42: warning: unused parameter 'iv_return' [-Wunused-parameter]
 constant_19 (pTHX_ const char *name, IV *iv_return) {
                                          ^
re_exec.c: In function 'S_regtry':
re_exec.c:7099:44: warning: 'fold_array' may be used uninitialized in this function [-Wmaybe-uninitialized]
                 && UCHARAT(s) != fold_array[nextbyte])
                                            ^
re_exec.c:7003:24: note: 'fold_array' was declared here
             const U8 * fold_array;
                        ^
re_exec.c:7105:29: warning: 'folder' may be used uninitialized in this function [-Wmaybe-uninitialized]
             if (ln > 1 && ! folder(aTHX_ locinput, s, ln))
                             ^
re_exec.c:7002:23: note: 'folder' was declared here
             re_fold_t folder;
                       ^
[2022-06-22 20:56:26-0400] Skip tests from '/home/core/smoke/TestSmoke/smokecurrent.skiptests'
[2022-06-22 20:56:26-0400] 
[2022-06-22 20:56:26-0400]  Tests start here:
[2022-06-22 20:56:26-0400] TSTENV = stdio	
# 
# 
# Compress::Raw::Zlib::VERSION        2.105
# 
# ZLIB_VERSION (from zlib.h)          1.2.12
# zlib_version (from zlib library)    1.2.12
# 
# ZLIB_VERNUM                         0x12C0
# BUILD_ZLIB                          1
# GZIP_OS_CODE                        3
# 
# zlibCompileFlags                    169
#   Type Sizes
#     size of uInt                    32 bit
#     size of uLong                   64 bit
#     size of pointer                 64 bit
#     size of z_off_t                 64 bit
#   Compiler Options                  None
#   One-time table building           None
#   Library content                   None
#   Operation variations              None
# 
[2022-06-22 21:33:46-0400] 
[2022-06-22 21:33:46-0400] All tests successful.
[2022-06-22 21:33:46-0400] Archived results...
[2022-06-22 21:33:46-0400] Unskip tests from '/home/core/smoke/TestSmoke/smokecurrent.skiptests'
[2022-06-22 21:33:46-0400] 
[2022-06-22 21:33:46-0400] Configuration: -Dusedevel -Dcc=gcc -Duseithreads
[2022-06-22 21:33:46-0400] ------------------------------------------------------------------------------
[2022-06-22 21:33:46-0400] make distclean ...
[2022-06-22 21:34:15-0400] 
[2022-06-22 21:34:15-0400] Copy Policy.sh ...
[2022-06-22 21:34:15-0400] 
[2022-06-22 21:34:15-0400] Configure ...
size != strlen(buffer) + 1 (0 != 1)
[2022-06-22 21:35:08-0400] 
[2022-06-22 21:35:08-0400] make ...
locale.c:1113:1: warning: 'S_calculate_LC_ALL' defined but not used [-Wunused-function]
 S_calculate_LC_ALL(pTHX_ const char ** individ_locales)
 ^
/usr/include/sys/cdefs_elf.h:67:20: error: missing binary operator before token "("
 #if __GNUC_PREREQ__(4, 0)
                    ^
/usr/include/sys/cdefs_elf.h:73:20: error: missing binary operator before token "("
 #if __GNUC_PREREQ__(4, 0)
                    ^
/usr/include/sys/cdefs_elf.h:79:20: error: missing binary operator before token "("
 #if __GNUC_PREREQ__(4, 2)
                    ^
Warning (mostly harmless): No library found for -lndbm
Warning (mostly harmless): No library found for -ldbm
Warning (mostly harmless): No library found for -lucb
Warning (mostly harmless): No library found for -lcposix
Socket.c: In function 'XS_Socket_pack_ip_mreq_source':
Socket.c:1703:7: warning: variable 'interface' set but not used [-Wunused-but-set-variable]
  SV * interface;
       ^
In file included from HiRes.xs:860:0:
const-c.inc: In function 'constant_19':
const-c.inc:351:42: warning: unused parameter 'iv_return' [-Wunused-parameter]
 constant_19 (pTHX_ const char *name, IV *iv_return) {
                                          ^
re_exec.c: In function 'S_regtry':
re_exec.c:7099:44: warning: 'fold_array' may be used uninitialized in this function [-Wmaybe-uninitialized]
                 && UCHARAT(s) != fold_array[nextbyte])
                                            ^
re_exec.c:7003:24: note: 'fold_array' was declared here
             const U8 * fold_array;
                        ^
re_exec.c:7105:29: warning: 'folder' may be used uninitialized in this function [-Wmaybe-uninitialized]
             if (ln > 1 && ! folder(aTHX_ locinput, s, ln))
                             ^
re_exec.c:7002:23: note: 'folder' was declared here
             re_fold_t folder;
                       ^
[2022-06-22 21:40:33-0400] Skip tests from '/home/core/smoke/TestSmoke/smokecurrent.skiptests'
[2022-06-22 21:40:33-0400] 
[2022-06-22 21:40:33-0400]  Tests start here:
[2022-06-22 21:40:33-0400] TSTENV = stdio	
# 
# 
# Compress::Raw::Zlib::VERSION        2.105
# 
# ZLIB_VERSION (from zlib.h)          1.2.12
# zlib_version (from zlib library)    1.2.12
# 
# ZLIB_VERNUM                         0x12C0
# BUILD_ZLIB                          1
# GZIP_OS_CODE                        3
# 
# zlibCompileFlags                    169
#   Type Sizes
#     size of uInt                    32 bit
#     size of uLong                   64 bit
#     size of pointer                 64 bit
#     size of z_off_t                 64 bit
#   Compiler Options                  None
#   One-time table building           None
#   Library content                   None
#   Operation variations              None
# 
[2022-06-22 22:14:03-0400] 
[2022-06-22 22:14:03-0400] All tests successful.
[2022-06-22 22:14:03-0400] Archived results...
[2022-06-22 22:14:03-0400] Unskip tests from '/home/core/smoke/TestSmoke/smokecurrent.skiptests'
[2022-06-22 22:14:03-0400] 
[2022-06-22 22:14:03-0400] Configuration: -Dusedevel -Dcc=gcc -Duseithreads -DDEBUGGING
[2022-06-22 22:14:03-0400] ------------------------------------------------------------------------------
[2022-06-22 22:14:03-0400] make distclean ...
[2022-06-22 22:14:28-0400] 
[2022-06-22 22:14:28-0400] Copy Policy.sh ...
[2022-06-22 22:14:28-0400] 
[2022-06-22 22:14:28-0400] Configure ...
size != strlen(buffer) + 1 (0 != 1)
[2022-06-22 22:15:23-0400] 
[2022-06-22 22:15:23-0400] make ...
In file included from perl.h:4101:0,
                 from util.c:26:
util.c: In function 'Perl_xs_handshake':
util.c:5788:36: warning: comparison is always true due to limited range of data type [-Wtype-limits]
         assert(HS_GETXSVERLEN(key) <= UCHAR_MAX && HS_GETXSVERLEN(key) <= HS_APIVERLEN_MAX);
                                    ^
regexec.c: In function 'S_regtry':
regexec.c:7099:44: warning: 'fold_array' may be used uninitialized in this function [-Wmaybe-uninitialized]
                 && UCHARAT(s) != fold_array[nextbyte])
                                            ^
regexec.c:7003:24: note: 'fold_array' was declared here
             const U8 * fold_array;
                        ^
regexec.c:7105:29: warning: 'folder' may be used uninitialized in this function [-Wmaybe-uninitialized]
             if (ln > 1 && ! folder(aTHX_ locinput, s, ln))
                             ^
regexec.c:7002:23: note: 'folder' was declared here
             re_fold_t folder;
                       ^
locale.c:1113:1: warning: 'S_calculate_LC_ALL' defined but not used [-Wunused-function]
 S_calculate_LC_ALL(pTHX_ const char ** individ_locales)
 ^
/usr/include/sys/cdefs_elf.h:67:20: error: missing binary operator before token "("
 #if __GNUC_PREREQ__(4, 0)
                    ^
/usr/include/sys/cdefs_elf.h:73:20: error: missing binary operator before token "("
 #if __GNUC_PREREQ__(4, 0)
                    ^
/usr/include/sys/cdefs_elf.h:79:20: error: missing binary operator before token "("
 #if __GNUC_PREREQ__(4, 2)
                    ^
Warning (mostly harmless): No library found for -lndbm
Warning (mostly harmless): No library found for -ldbm
Warning (mostly harmless): No library found for -lucb
Warning (mostly harmless): No library found for -lcposix
Socket.c: In function 'XS_Socket_pack_ip_mreq_source':
Socket.c:1703:7: warning: variable 'interface' set but not used [-Wunused-but-set-variable]
  SV * interface;
       ^
In file included from HiRes.xs:860:0:
const-c.inc: In function 'constant_19':
const-c.inc:351:42: warning: unused parameter 'iv_return' [-Wunused-parameter]
 constant_19 (pTHX_ const char *name, IV *iv_return) {
                                          ^
re_exec.c: In function 'S_regtry':
re_exec.c:7099:44: warning: 'fold_array' may be used uninitialized in this function [-Wmaybe-uninitialized]
                 && UCHARAT(s) != fold_array[nextbyte])
                                            ^
re_exec.c:7003:24: note: 'fold_array' was declared here
             const U8 * fold_array;
                        ^
re_exec.c:7105:29: warning: 'folder' may be used uninitialized in this function [-Wmaybe-uninitialized]
             if (ln > 1 && ! folder(aTHX_ locinput, s, ln))
                             ^
re_exec.c:7002:23: note: 'folder' was declared here
             re_fold_t folder;
                       ^
[2022-06-22 22:23:08-0400] Skip tests from '/home/core/smoke/TestSmoke/smokecurrent.skiptests'
[2022-06-22 22:23:08-0400] 
[2022-06-22 22:23:08-0400]  Tests start here:
[2022-06-22 22:23:08-0400] TSTENV = stdio	
# 
# 
# Compress::Raw::Zlib::VERSION        2.105
# 
# ZLIB_VERSION (from zlib.h)          1.2.12
# zlib_version (from zlib library)    1.2.12
# 
# ZLIB_VERNUM                         0x12C0
# BUILD_ZLIB                          1
# GZIP_OS_CODE                        3
# 
# zlibCompileFlags                    169
#   Type Sizes
#     size of uInt                    32 bit
#     size of uLong                   64 bit
#     size of pointer                 64 bit
#     size of z_off_t                 64 bit
#   Compiler Options                  None
#   One-time table building           None
#   Library content                   None
#   Operation variations              None
# 

#   Failed test 'timestr ($diff, "all", "E") [sprintf format of "E"]'
#   at ../lib/Benchmark.t line 141.
#                   ' 7 wallclock secs (7.160000E+00 usr -1.000000E-02 sys + 0.000000E+00 cusr 0.000000E+00 csys = 7.150000E+00 CPU)'
#     doesn't match '(?^:(\d+) +wallclock secs? +\( *\d\.\d+E[-+]?\d\d\d? +usr +\d\.\d+E[-+]?\d\d\d? +sys +\+ +\d\.\d+E[-+]?\d\d\d? +cusr +\d\.\d+E[-+]?\d\d\d? +csys += +\d\.\d+E[-+]?\d\d\d? +CPU\))'
# Looks like you failed 1 test of 215.

error while running harness target 'test_harness': 1 at /home/core/smoke/TestSmoke/Test/Smoke/App/RunSmoke.pm line 118.
[2022-06-22 23:06:16-0400] 
[2022-06-22 23:06:16-0400] ../lib/Benchmark.t..........................................FAILED
[2022-06-22 23:06:16-0400]     28
[2022-06-22 23:06:16-0400] ../lib/Benchmark.t..........................................FAILED
[2022-06-22 23:06:16-0400]     Non-zero exit status: 1
[2022-06-22 23:06:16-0400] Archived results...
[2022-06-22 23:06:16-0400] Unskip tests from '/home/core/smoke/TestSmoke/smokecurrent.skiptests'
[2022-06-22 23:06:16-0400] 
[2022-06-22 23:06:16-0400] Configuration: -Dusedevel -Dcc=gcc -Duseithreads -Duse64bitall
[2022-06-22 23:06:16-0400] ------------------------------------------------------------------------------
[2022-06-22 23:06:16-0400] make distclean ...
[2022-06-22 23:06:49-0400] 
[2022-06-22 23:06:49-0400] Copy Policy.sh ...
[2022-06-22 23:06:49-0400] 
[2022-06-22 23:06:49-0400] Configure ...
size != strlen(buffer) + 1 (0 != 1)
[2022-06-22 23:07:40-0400] 
[2022-06-22 23:07:40-0400] make ...
locale.c:1113:1: warning: 'S_calculate_LC_ALL' defined but not used [-Wunused-function]
 S_calculate_LC_ALL(pTHX_ const char ** individ_locales)
 ^
/usr/include/sys/cdefs_elf.h:67:20: error: missing binary operator before token "("
 #if __GNUC_PREREQ__(4, 0)
                    ^
/usr/include/sys/cdefs_elf.h:73:20: error: missing binary operator before token "("
 #if __GNUC_PREREQ__(4, 0)
                    ^
/usr/include/sys/cdefs_elf.h:79:20: error: missing binary operator before token "("
 #if __GNUC_PREREQ__(4, 2)
                    ^
Warning (mostly harmless): No library found for -lndbm
Warning (mostly harmless): No library found for -ldbm
Warning (mostly harmless): No library found for -lucb
Warning (mostly harmless): No library found for -lcposix
Socket.c: In function 'XS_Socket_pack_ip_mreq_source':
Socket.c:1703:7: warning: variable 'interface' set but not used [-Wunused-but-set-variable]
  SV * interface;
       ^
In file included from HiRes.xs:860:0:
const-c.inc: In function 'constant_19':
const-c.inc:351:42: warning: unused parameter 'iv_return' [-Wunused-parameter]
 constant_19 (pTHX_ const char *name, IV *iv_return) {
                                          ^
re_exec.c: In function 'S_regtry':
re_exec.c:7099:44: warning: 'fold_array' may be used uninitialized in this function [-Wmaybe-uninitialized]
                 && UCHARAT(s) != fold_array[nextbyte])
                                            ^
re_exec.c:7003:24: note: 'fold_array' was declared here
             const U8 * fold_array;
                        ^
re_exec.c:7105:29: warning: 'folder' may be used uninitialized in this function [-Wmaybe-uninitialized]
             if (ln > 1 && ! folder(aTHX_ locinput, s, ln))
                             ^
re_exec.c:7002:23: note: 'folder' was declared here
             re_fold_t folder;
                       ^
[2022-06-22 23:12:56-0400] Skip tests from '/home/core/smoke/TestSmoke/smokecurrent.skiptests'
[2022-06-22 23:12:56-0400] 
[2022-06-22 23:12:56-0400]  Tests start here:
[2022-06-22 23:12:56-0400] TSTENV = stdio	
# 
# 
# Compress::Raw::Zlib::VERSION        2.105
# 
# ZLIB_VERSION (from zlib.h)          1.2.12
# zlib_version (from zlib library)    1.2.12
# 
# ZLIB_VERNUM                         0x12C0
# BUILD_ZLIB                          1
# GZIP_OS_CODE                        3
# 
# zlibCompileFlags                    169
#   Type Sizes
#     size of uInt                    32 bit
#     size of uLong                   64 bit
#     size of pointer                 64 bit
#     size of z_off_t                 64 bit
#   Compiler Options                  None
#   One-time table building           None
#   Library content                   None
#   Operation variations              None
# 
[2022-06-22 23:46:30-0400] 
[2022-06-22 23:46:30-0400] All tests successful.
[2022-06-22 23:46:30-0400] Archived results...
[2022-06-22 23:46:30-0400] Unskip tests from '/home/core/smoke/TestSmoke/smokecurrent.skiptests'
[2022-06-22 23:46:30-0400] 
[2022-06-22 23:46:30-0400] Configuration: -Dusedevel -Dcc=gcc -Duseithreads -Duse64bitall -DDEBUGGING
[2022-06-22 23:46:30-0400] ------------------------------------------------------------------------------
[2022-06-22 23:46:30-0400] make distclean ...
[2022-06-22 23:46:56-0400] 
[2022-06-22 23:46:56-0400] Copy Policy.sh ...
[2022-06-22 23:46:56-0400] 
[2022-06-22 23:46:56-0400] Configure ...
size != strlen(buffer) + 1 (0 != 1)
[2022-06-22 23:47:50-0400] 
[2022-06-22 23:47:50-0400] make ...
In file included from perl.h:4101:0,
                 from util.c:26:
util.c: In function 'Perl_xs_handshake':
util.c:5788:36: warning: comparison is always true due to limited range of data type [-Wtype-limits]
         assert(HS_GETXSVERLEN(key) <= UCHAR_MAX && HS_GETXSVERLEN(key) <= HS_APIVERLEN_MAX);
                                    ^
regexec.c: In function 'S_regtry':
regexec.c:7099:44: warning: 'fold_array' may be used uninitialized in this function [-Wmaybe-uninitialized]
                 && UCHARAT(s) != fold_array[nextbyte])
                                            ^
regexec.c:7003:24: note: 'fold_array' was declared here
             const U8 * fold_array;
                        ^
regexec.c:7105:29: warning: 'folder' may be used uninitialized in this function [-Wmaybe-uninitialized]
             if (ln > 1 && ! folder(aTHX_ locinput, s, ln))
                             ^
regexec.c:7002:23: note: 'folder' was declared here
             re_fold_t folder;
                       ^
locale.c:1113:1: warning: 'S_calculate_LC_ALL' defined but not used [-Wunused-function]
 S_calculate_LC_ALL(pTHX_ const char ** individ_locales)
 ^
/usr/include/sys/cdefs_elf.h:67:20: error: missing binary operator before token "("
 #if __GNUC_PREREQ__(4, 0)
                    ^
/usr/include/sys/cdefs_elf.h:73:20: error: missing binary operator before token "("
 #if __GNUC_PREREQ__(4, 0)
                    ^
/usr/include/sys/cdefs_elf.h:79:20: error: missing binary operator before token "("
 #if __GNUC_PREREQ__(4, 2)
                    ^
Warning (mostly harmless): No library found for -lndbm
Warning (mostly harmless): No library found for -ldbm
Warning (mostly harmless): No library found for -lucb
Warning (mostly harmless): No library found for -lcposix
Socket.c: In function 'XS_Socket_pack_ip_mreq_source':
Socket.c:1703:7: warning: variable 'interface' set but not used [-Wunused-but-set-variable]
  SV * interface;
       ^
In file included from HiRes.xs:860:0:
const-c.inc: In function 'constant_19':
const-c.inc:351:42: warning: unused parameter 'iv_return' [-Wunused-parameter]
 constant_19 (pTHX_ const char *name, IV *iv_return) {
                                          ^
re_exec.c: In function 'S_regtry':
re_exec.c:7099:44: warning: 'fold_array' may be used uninitialized in this function [-Wmaybe-uninitialized]
                 && UCHARAT(s) != fold_array[nextbyte])
                                            ^
re_exec.c:7003:24: note: 'fold_array' was declared here
             const U8 * fold_array;
                        ^
re_exec.c:7105:29: warning: 'folder' may be used uninitialized in this function [-Wmaybe-uninitialized]
             if (ln > 1 && ! folder(aTHX_ locinput, s, ln))
                             ^
re_exec.c:7002:23: note: 'folder' was declared here
             re_fold_t folder;
                       ^
[2022-06-22 23:55:51-0400] Skip tests from '/home/core/smoke/TestSmoke/smokecurrent.skiptests'
[2022-06-22 23:55:51-0400] 
[2022-06-22 23:55:51-0400]  Tests start here:
[2022-06-22 23:55:51-0400] TSTENV = stdio	
# 
# 
# Compress::Raw::Zlib::VERSION        2.105
# 
# ZLIB_VERSION (from zlib.h)          1.2.12
# zlib_version (from zlib library)    1.2.12
# 
# ZLIB_VERNUM                         0x12C0
# BUILD_ZLIB                          1
# GZIP_OS_CODE                        3
# 
# zlibCompileFlags                    169
#   Type Sizes
#     size of uInt                    32 bit
#     size of uLong                   64 bit
#     size of pointer                 64 bit
#     size of z_off_t                 64 bit
#   Compiler Options                  None
#   One-time table building           None
#   Library content                   None
#   Operation variations              None
# 
[2022-06-23 00:39:31-0400] 
[2022-06-23 00:39:31-0400] All tests successful.
[2022-06-23 00:39:31-0400] Archived results...
[2022-06-23 00:39:31-0400] Unskip tests from '/home/core/smoke/TestSmoke/smokecurrent.skiptests'
[2022-06-23 00:39:31-0400] Finished smoking dd4d3f69a5f082c6c3cdd2a49512ea7e630b62cb v5.37.1-18-gdd4d3f69a5 blead
[2022-06-23 00:39:31-0400] Reading smokeresult from /home/core/smoke/perl-current/mktest.out
[2022-06-23 00:39:31-0400] Processing [-Dcc=gcc]
[2022-06-23 00:39:31-0400] Processing [-DDEBUGGING -Dcc=gcc]
[2022-06-23 00:39:31-0400] Processing [-Dcc=gcc -Duse64bitall]
[2022-06-23 00:39:31-0400] Processing [-DDEBUGGING -Dcc=gcc -Duse64bitall]
[2022-06-23 00:39:31-0400] Processing [-Dcc=gcc -Duseithreads]
[2022-06-23 00:39:31-0400] Processing [-DDEBUGGING -Dcc=gcc -Duseithreads]
[2022-06-23 00:39:31-0400] Processing [-Dcc=gcc -Duseithreads -Duse64bitall]
[2022-06-23 00:39:31-0400] Processing [-DDEBUGGING -Dcc=gcc -Duseithreads -Duse64bitall]
[2022-06-23 00:39:31-0400] ==> Starting reporter
[2022-06-23 00:39:31-0400] Writing report to '/home/core/smoke/perl-current/mktest.rpt'
-- 
Report generated by Test::Smoke::Gateway v0.09