Show report
[2022-05-20 22:45:11+0200] ==> Skipping synctree
[2022-05-20 22:45:11+0200] ==> Starting runsmoke
[2022-05-20 22:45:11+0200] [tssmokeperl.pl] chdir(/pro/3gl/CPAN/perl-current)
[2022-05-20 22:45:11+0200] Setup alarm: Sat May 21 22:15:11 2022
[2022-05-20 22:45:11+0200] qx[/pro/bin/perl -e "require q[/pro/3gl/CPAN/perl-current/cpan/Test-Harness/lib/Test/Harness.pm];print Test::Harness->VERSION" 2>&1]
[2022-05-20 22:45:11+0200] Found: Test::Harness version 3.44.
[2022-05-20 22:45:11+0200] Reading build configurations from /pro/3gl/CPAN/smoke/p59.cfg
[2022-05-20 22:45:11+0200] Reading 'Policy.sh' from ../Policy.sh (v=1)
[2022-05-20 22:45:11+0200] Running test suite only with 'harness'
[2022-05-20 22:45:11+0200] make distclean ...
[2022-05-20 22:45:11+0200] Smoking patch e815fc9e521a3f7203f08588dfcd102261bdacd7 v5.35.11-262-ge815fc9
[2022-05-20 22:45:11+0200] Smoking branch blead
[2022-05-20 22:45:11+0200] Locally applied patches from '/pro/3gl/CPAN/perl-current/patchlevel.h'
[2022-05-20 22:45:11+0200] Patches: 'uncommitted-changes'
[2022-05-20 22:45:11+0200] Adding 'SMOKEe815fc9e521a3f7203f08588dfcd102261bdacd7' to the registered patches.
[2022-05-20 22:45:11+0200] 
[2022-05-20 22:45:11+0200] Configuration: -Dusedevel
[2022-05-20 22:45:11+0200] ------------------------------------------------------------------------------
[2022-05-20 22:45:11+0200] make distclean ...
[2022-05-20 22:45:11+0200] 
[2022-05-20 22:45:11+0200] Copy Policy.sh ...
[2022-05-20 22:45:11+0200] 
[2022-05-20 22:45:11+0200] Configure ...
[2022-05-20 22:46:46+0200] 
[2022-05-20 22:46:46+0200] make ...
[2022-05-20 23:04:24+0200] Skip tests from '/pro/3gl/CPAN/smoke/p59.skip'
[2022-05-20 23:04:24+0200] 	cpan/Sys-Syslog/t/syslog.t
[2022-05-20 23:04:24+0200] 
[2022-05-20 23:04:24+0200]  Tests start here:
[2022-05-20 23:04:24+0200] TSTENV = stdio	
No saved state, selection will be empty
# 
# 
# Compress::Raw::Zlib::VERSION        2.105
# 
# ZLIB_VERSION (from zlib.h)          1.2.12
# zlib_version (from zlib library)    1.2.12
# 
# ZLIB_VERNUM                         0x12C0
# BUILD_ZLIB                          1
# GZIP_OS_CODE                        3
# 
# zlibCompileFlags                    85
#   Type Sizes
#     size of uInt                    32 bit
#     size of uLong                   32 bit
#     size of pointer                 32 bit
#     size of z_off_t                 32 bit
#   Compiler Options                  None
#   One-time table building           None
#   Library content                   None
#   Operation variations              None
# 
Cannot figure out an encoding to use at t/use-Encode-Alias.t line 5.
"../../../../sv_inline.h", line 487: warning #4232-D: conversion from "XPVIO *" to a more strictly aligned type "XPVMG *" may cause misaligned access
              SvSTASH_set(io, MUTABLE_HV(SvREFCNT_inc(GvHV(iogv))));
              ^

"../../../../sv_inline.h", line 468: warning #4276-D: relational operator ">" always evaluates to 'false'
              Zero(new_body, type_details->body_size, char);
              ^

"../../../../sv_inline.h", line 487: warning #4232-D: conversion from "XPVIO *" to a more strictly aligned type "XPVMG *" may cause misaligned access
              SvSTASH_set(io, MUTABLE_HV(SvREFCNT_inc(GvHV(iogv))));
              ^

"../../../../sv_inline.h", line 468: warning #4276-D: relational operator ">" always evaluates to 'false'
              Zero(new_body, type_details->body_size, char);
              ^

"../../../../sv_inline.h", line 487: warning #4232-D: conversion from "XPVIO *" to a more strictly aligned type "XPVMG *" may cause misaligned access
              SvSTASH_set(io, MUTABLE_HV(SvREFCNT_inc(GvHV(iogv))));
              ^

"../../../../sv_inline.h", line 468: warning #4276-D: relational operator ">" always evaluates to 'false'
              Zero(new_body, type_details->body_size, char);
              ^

"../../../../sv_inline.h", line 487: warning #4232-D: conversion from "XPVIO *" to a more strictly aligned type "XPVMG *" may cause misaligned access
              SvSTASH_set(io, MUTABLE_HV(SvREFCNT_inc(GvHV(iogv))));
              ^

"../../../../sv_inline.h", line 468: warning #4276-D: relational operator ">" always evaluates to 'false'
              Zero(new_body, type_details->body_size, char);
              ^

"../../../../sv_inline.h", line 487: warning #4232-D: conversion from "XPVIO *" to a more strictly aligned type "XPVMG *" may cause misaligned access
              SvSTASH_set(io, MUTABLE_HV(SvREFCNT_inc(GvHV(iogv))));
              ^

"../../../../sv_inline.h", line 468: warning #4276-D: relational operator ">" always evaluates to 'false'
              Zero(new_body, type_details->body_size, char);
              ^

"../../../../sv_inline.h", line 487: warning #4232-D: conversion from "XPVIO *" to a more strictly aligned type "XPVMG *" may cause misaligned access
              SvSTASH_set(io, MUTABLE_HV(SvREFCNT_inc(GvHV(iogv))));
              ^

"../../../../sv_inline.h", line 468: warning #4276-D: relational operator ">" always evaluates to 'false'
              Zero(new_body, type_details->body_size, char);
              ^

"../../../../sv_inline.h", line 487: warning #4232-D: conversion from "XPVIO *" to a more strictly aligned type "XPVMG *" may cause misaligned access
              SvSTASH_set(io, MUTABLE_HV(SvREFCNT_inc(GvHV(iogv))));
              ^

"../../../../sv_inline.h", line 468: warning #4276-D: relational operator ">" always evaluates to 'false'
              Zero(new_body, type_details->body_size, char);
              ^

# Connected to 127.0.0.1
# Connected to 127.0.0.1
Integer overflow in hexadecimal number at t/broken_univ_can.t line 13.
Redefining sub xChild::foo at xChild--22491 line 2.
Redefining sub Data::ok at -e line 1.
"/pro/3gl/CPAN/perl-current/sv_inline.h", line 487: warning #4232-D: conversion from "XPVIO *" to a more strictly aligned type "XPVMG *" may cause misaligned access
              SvSTASH_set(io, MUTABLE_HV(SvREFCNT_inc(GvHV(iogv))));
              ^

"XSTest.c", line 249: warning #2111-D: statement is unreachable
  	PUTBACK;
  	^

"/pro/3gl/CPAN/perl-current/sv_inline.h", line 468: warning #4276-D: relational operator ">" always evaluates to 'false'
              Zero(new_body, type_details->body_size, char);
              ^

c++: error: +Z: No such file or directory
c++: error: +O2: No such file or directory
c++: error: +Onolimit: No such file or directory
"/pro/3gl/CPAN/perl-current/sv_inline.h", line 487: warning #4232-D: conversion from "XPVIO *" to a more strictly aligned type "XPVMG *" may cause misaligned access
              SvSTASH_set(io, MUTABLE_HV(SvREFCNT_inc(GvHV(iogv))));
              ^

"/pro/3gl/CPAN/perl-current/sv_inline.h", line 468: warning #4276-D: relational operator ">" always evaluates to 'false'
              Zero(new_body, type_details->body_size, char);
              ^

"XSMore.xs", line 48: warning #4276-D: relational operator ">" always evaluates to 'false'
     Newx(*c, lenc+1, char);
     ^

"XSMore.xs", line 63: warning #4276-D: relational operator ">" always evaluates to 'false'
     Newx(*c, lenc+1, char);
     ^

"/pro/3gl/CPAN/perl-current/sv_inline.h", line 487: warning #4232-D: conversion from "XPVIO *" to a more strictly aligned type "XPVMG *" may cause misaligned access
              SvSTASH_set(io, MUTABLE_HV(SvREFCNT_inc(GvHV(iogv))));
              ^

"/pro/3gl/CPAN/perl-current/sv_inline.h", line 468: warning #4276-D: relational operator ">" always evaluates to 'false'
              Zero(new_body, type_details->body_size, char);
              ^

Subroutine Time::HiRes::constant redefined at (eval 37) line 1.
Subroutine Time::HiRes::usleep redefined at (eval 37) line 1.
Subroutine Time::HiRes::nanosleep redefined at (eval 37) line 1.
Subroutine Time::HiRes::sleep redefined at (eval 37) line 1.
Subroutine Time::HiRes::ualarm redefined at (eval 37) line 1.
Subroutine Time::HiRes::alarm redefined at (eval 37) line 1.
Subroutine Time::HiRes::gettimeofday redefined at (eval 37) line 1.
Subroutine Time::HiRes::time redefined at (eval 37) line 1.
Subroutine Time::HiRes::setitimer redefined at (eval 37) line 1.
Subroutine Time::HiRes::getitimer redefined at (eval 37) line 1.
Subroutine Time::HiRes::utime redefined at (eval 37) line 1.
Subroutine Time::HiRes::clock_gettime redefined at (eval 37) line 1.
Subroutine Time::HiRes::clock_getres redefined at (eval 37) line 1.
Subroutine Time::HiRes::clock_nanosleep redefined at (eval 37) line 1.
Subroutine Time::HiRes::clock redefined at (eval 37) line 1.
Subroutine Time::HiRes::lstat redefined at (eval 37) line 1.
Subroutine Time::HiRes::stat redefined at (eval 37) line 1.
"../sv_inline.h", line 487: warning #4232-D: conversion from "XPVIO *" to a more strictly aligned type "XPVMG *" may cause misaligned access
              SvSTASH_set(io, MUTABLE_HV(SvREFCNT_inc(GvHV(iogv))));
              ^

"../sv_inline.h", line 468: warning #4276-D: relational operator ">" always evaluates to 'false'
              Zero(new_body, type_details->body_size, char);
              ^

cc: warning 983: The -lc library specified on the command line is also added automatically by the compiler driver.  
# Failed test 1701 - sprintf( "%.54g", 0.3 ) renders correctly at op/sprintf2.t line 1197
#      got "0.299999999999999988897769753748434596"
# expected eq "0.299999999999999988897769753748434595763683319091796875"
make: *** [test_harness] Error 2

error while running harness target 'test_harness': 2 at /pro/3gl/CPAN/smoke/lib/Test/Smoke/App/RunSmoke.pm line 118.
[2022-05-20 23:20:51+0200] 
[2022-05-20 23:20:51+0200] ../dist/Net-Ping/t/450_service.t............................PASSED
[2022-05-20 23:20:51+0200]     9, 18
[2022-05-20 23:20:51+0200] ../lib/locale.t.............................................FAILED
[2022-05-20 23:20:51+0200]     448
[2022-05-20 23:20:51+0200] ../t/op/sprintf2.t..........................................FAILED
[2022-05-20 23:20:51+0200]     1701
[2022-05-20 23:20:51+0200] Archived results...
[2022-05-20 23:20:51+0200] TSTENV = perlio	
"../../../../sv_inline.h", line 487: warning #4232-D: conversion from "XPVIO *" to a more strictly aligned type "XPVMG *" may cause misaligned access
              SvSTASH_set(io, MUTABLE_HV(SvREFCNT_inc(GvHV(iogv))));
              ^

"../../../../sv_inline.h", line 468: warning #4276-D: relational operator ">" always evaluates to 'false'
              Zero(new_body, type_details->body_size, char);
              ^

"../../../../sv_inline.h", line 487: warning #4232-D: conversion from "XPVIO *" to a more strictly aligned type "XPVMG *" may cause misaligned access
              SvSTASH_set(io, MUTABLE_HV(SvREFCNT_inc(GvHV(iogv))));
              ^

"../../../../sv_inline.h", line 468: warning #4276-D: relational operator ">" always evaluates to 'false'
              Zero(new_body, type_details->body_size, char);
              ^

"../../../../sv_inline.h", line 487: warning #4232-D: conversion from "XPVIO *" to a more strictly aligned type "XPVMG *" may cause misaligned access
              SvSTASH_set(io, MUTABLE_HV(SvREFCNT_inc(GvHV(iogv))));
              ^

"../../../../sv_inline.h", line 468: warning #4276-D: relational operator ">" always evaluates to 'false'
              Zero(new_body, type_details->body_size, char);
              ^

"../../../../sv_inline.h", line 487: warning #4232-D: conversion from "XPVIO *" to a more strictly aligned type "XPVMG *" may cause misaligned access
              SvSTASH_set(io, MUTABLE_HV(SvREFCNT_inc(GvHV(iogv))));
              ^

"../../../../sv_inline.h", line 468: warning #4276-D: relational operator ">" always evaluates to 'false'
              Zero(new_body, type_details->body_size, char);
              ^

"../../../../sv_inline.h", line 487: warning #4232-D: conversion from "XPVIO *" to a more strictly aligned type "XPVMG *" may cause misaligned access
              SvSTASH_set(io, MUTABLE_HV(SvREFCNT_inc(GvHV(iogv))));
              ^

"../../../../sv_inline.h", line 468: warning #4276-D: relational operator ">" always evaluates to 'false'
              Zero(new_body, type_details->body_size, char);
              ^

"../../../../sv_inline.h", line 487: warning #4232-D: conversion from "XPVIO *" to a more strictly aligned type "XPVMG *" may cause misaligned access
              SvSTASH_set(io, MUTABLE_HV(SvREFCNT_inc(GvHV(iogv))));
              ^

"../../../../sv_inline.h", line 468: warning #4276-D: relational operator ">" always evaluates to 'false'
              Zero(new_body, type_details->body_size, char);
              ^

"../../../../sv_inline.h", line 487: warning #4232-D: conversion from "XPVIO *" to a more strictly aligned type "XPVMG *" may cause misaligned access
              SvSTASH_set(io, MUTABLE_HV(SvREFCNT_inc(GvHV(iogv))));
              ^

"../../../../sv_inline.h", line 468: warning #4276-D: relational operator ">" always evaluates to 'false'
              Zero(new_body, type_details->body_size, char);
              ^

"/pro/3gl/CPAN/perl-current/sv_inline.h", line 487: warning #4232-D: conversion from "XPVIO *" to a more strictly aligned type "XPVMG *" may cause misaligned access
              SvSTASH_set(io, MUTABLE_HV(SvREFCNT_inc(GvHV(iogv))));
              ^

"XSTest.c", line 249: warning #2111-D: statement is unreachable
  	PUTBACK;
  	^

"/pro/3gl/CPAN/perl-current/sv_inline.h", line 468: warning #4276-D: relational operator ">" always evaluates to 'false'
              Zero(new_body, type_details->body_size, char);
              ^

"/pro/3gl/CPAN/perl-current/sv_inline.h", line 487: warning #4232-D: conversion from "XPVIO *" to a more strictly aligned type "XPVMG *" may cause misaligned access
              SvSTASH_set(io, MUTABLE_HV(SvREFCNT_inc(GvHV(iogv))));
              ^

"/pro/3gl/CPAN/perl-current/sv_inline.h", line 468: warning #4276-D: relational operator ">" always evaluates to 'false'
              Zero(new_body, type_details->body_size, char);
              ^

"XSMore.xs", line 48: warning #4276-D: relational operator ">" always evaluates to 'false'
     Newx(*c, lenc+1, char);
     ^

"XSMore.xs", line 63: warning #4276-D: relational operator ">" always evaluates to 'false'
     Newx(*c, lenc+1, char);
     ^

"/pro/3gl/CPAN/perl-current/sv_inline.h", line 487: warning #4232-D: conversion from "XPVIO *" to a more strictly aligned type "XPVMG *" may cause misaligned access
              SvSTASH_set(io, MUTABLE_HV(SvREFCNT_inc(GvHV(iogv))));
              ^

"/pro/3gl/CPAN/perl-current/sv_inline.h", line 468: warning #4276-D: relational operator ">" always evaluates to 'false'
              Zero(new_body, type_details->body_size, char);
              ^

c++: error: +Z: No such file or directory
c++: error: +O2: No such file or directory
c++: error: +Onolimit: No such file or directory
# 
# 
# Compress::Raw::Zlib::VERSION        2.105
# 
# ZLIB_VERSION (from zlib.h)          1.2.12
# zlib_version (from zlib library)    1.2.12
# 
# ZLIB_VERNUM                         0x12C0
# BUILD_ZLIB                          1
# GZIP_OS_CODE                        3
# 
# zlibCompileFlags                    85
#   Type Sizes
#     size of uInt                    32 bit
#     size of uLong                   32 bit
#     size of pointer                 32 bit
#     size of z_off_t                 32 bit
#   Compiler Options                  None
#   One-time table building           None
#   Library content                   None
#   Operation variations              None
# 
"../sv_inline.h", line 487: warning #4232-D: conversion from "XPVIO *" to a more strictly aligned type "XPVMG *" may cause misaligned access
              SvSTASH_set(io, MUTABLE_HV(SvREFCNT_inc(GvHV(iogv))));
              ^

"../sv_inline.h", line 468: warning #4276-D: relational operator ">" always evaluates to 'false'
              Zero(new_body, type_details->body_size, char);
              ^

cc: warning 983: The -lc library specified on the command line is also added automatically by the compiler driver.  
# Failed test 1701 - sprintf( "%.54g", 0.3 ) renders correctly at op/sprintf2.t line 1197
#      got "0.299999999999999988897769753748434596"
# expected eq "0.299999999999999988897769753748434595763683319091796875"
# Connected to 127.0.0.1
# Connected to 127.0.0.1
Subroutine Time::HiRes::constant redefined at (eval 37) line 1.
Subroutine Time::HiRes::usleep redefined at (eval 37) line 1.
Subroutine Time::HiRes::nanosleep redefined at (eval 37) line 1.
Subroutine Time::HiRes::sleep redefined at (eval 37) line 1.
Subroutine Time::HiRes::ualarm redefined at (eval 37) line 1.
Subroutine Time::HiRes::alarm redefined at (eval 37) line 1.
Subroutine Time::HiRes::gettimeofday redefined at (eval 37) line 1.
Subroutine Time::HiRes::time redefined at (eval 37) line 1.
Subroutine Time::HiRes::setitimer redefined at (eval 37) line 1.
Subroutine Time::HiRes::getitimer redefined at (eval 37) line 1.
Subroutine Time::HiRes::utime redefined at (eval 37) line 1.
Subroutine Time::HiRes::clock_gettime redefined at (eval 37) line 1.
Subroutine Time::HiRes::clock_getres redefined at (eval 37) line 1.
Subroutine Time::HiRes::clock_nanosleep redefined at (eval 37) line 1.
Subroutine Time::HiRes::clock redefined at (eval 37) line 1.
Subroutine Time::HiRes::lstat redefined at (eval 37) line 1.
Subroutine Time::HiRes::stat redefined at (eval 37) line 1.
Cannot figure out an encoding to use at t/use-Encode-Alias.t line 5.
Integer overflow in hexadecimal number at t/broken_univ_can.t line 13.
make: *** [test_harness] Error 1

error while running harness target 'test_harness': 2 at /pro/3gl/CPAN/smoke/lib/Test/Smoke/App/RunSmoke.pm line 118.
[2022-05-20 23:35:00+0200] 
[2022-05-20 23:35:00+0200] ../dist/Net-Ping/t/450_service.t............................PASSED
[2022-05-20 23:35:00+0200]     9, 18
[2022-05-20 23:35:00+0200] ../t/op/sprintf2.t..........................................FAILED
[2022-05-20 23:35:00+0200]     1701
[2022-05-20 23:35:00+0200] Archived results...
[2022-05-20 23:35:00+0200] TSTENV = locale:en_US.utf8	
"../../../../sv_inline.h", line 487: warning #4232-D: conversion from "XPVIO *" to a more strictly aligned type "XPVMG *" may cause misaligned access
              SvSTASH_set(io, MUTABLE_HV(SvREFCNT_inc(GvHV(iogv))));
              ^

"../../../../sv_inline.h", line 468: warning #4276-D: relational operator ">" always evaluates to 'false'
              Zero(new_body, type_details->body_size, char);
              ^

"../../../../sv_inline.h", line 487: warning #4232-D: conversion from "XPVIO *" to a more strictly aligned type "XPVMG *" may cause misaligned access
              SvSTASH_set(io, MUTABLE_HV(SvREFCNT_inc(GvHV(iogv))));
              ^

"../../../../sv_inline.h", line 468: warning #4276-D: relational operator ">" always evaluates to 'false'
              Zero(new_body, type_details->body_size, char);
              ^

"../../../../sv_inline.h", line 487: warning #4232-D: conversion from "XPVIO *" to a more strictly aligned type "XPVMG *" may cause misaligned access
              SvSTASH_set(io, MUTABLE_HV(SvREFCNT_inc(GvHV(iogv))));
              ^

"../../../../sv_inline.h", line 468: warning #4276-D: relational operator ">" always evaluates to 'false'
              Zero(new_body, type_details->body_size, char);
              ^

"../../../../sv_inline.h", line 487: warning #4232-D: conversion from "XPVIO *" to a more strictly aligned type "XPVMG *" may cause misaligned access
              SvSTASH_set(io, MUTABLE_HV(SvREFCNT_inc(GvHV(iogv))));
              ^

"../../../../sv_inline.h", line 468: warning #4276-D: relational operator ">" always evaluates to 'false'
              Zero(new_body, type_details->body_size, char);
              ^

"../../../../sv_inline.h", line 487: warning #4232-D: conversion from "XPVIO *" to a more strictly aligned type "XPVMG *" may cause misaligned access
              SvSTASH_set(io, MUTABLE_HV(SvREFCNT_inc(GvHV(iogv))));
              ^

"../../../../sv_inline.h", line 468: warning #4276-D: relational operator ">" always evaluates to 'false'
              Zero(new_body, type_details->body_size, char);
              ^

"../../../../sv_inline.h", line 487: warning #4232-D: conversion from "XPVIO *" to a more strictly aligned type "XPVMG *" may cause misaligned access
              SvSTASH_set(io, MUTABLE_HV(SvREFCNT_inc(GvHV(iogv))));
              ^

"../../../../sv_inline.h", line 468: warning #4276-D: relational operator ">" always evaluates to 'false'
              Zero(new_body, type_details->body_size, char);
              ^

"../../../../sv_inline.h", line 487: warning #4232-D: conversion from "XPVIO *" to a more strictly aligned type "XPVMG *" may cause misaligned access
              SvSTASH_set(io, MUTABLE_HV(SvREFCNT_inc(GvHV(iogv))));
              ^

"../../../../sv_inline.h", line 468: warning #4276-D: relational operator ">" always evaluates to 'false'
              Zero(new_body, type_details->body_size, char);
              ^

"/pro/3gl/CPAN/perl-current/sv_inline.h", line 487: warning #4232-D: conversion from "XPVIO *" to a more strictly aligned type "XPVMG *" may cause misaligned access
              SvSTASH_set(io, MUTABLE_HV(SvREFCNT_inc(GvHV(iogv))));
              ^

"XSTest.c", line 249: warning #2111-D: statement is unreachable
  	PUTBACK;
  	^

"/pro/3gl/CPAN/perl-current/sv_inline.h", line 468: warning #4276-D: relational operator ">" always evaluates to 'false'
              Zero(new_body, type_details->body_size, char);
              ^

"/pro/3gl/CPAN/perl-current/sv_inline.h", line 487: warning #4232-D: conversion from "XPVIO *" to a more strictly aligned type "XPVMG *" may cause misaligned access
              SvSTASH_set(io, MUTABLE_HV(SvREFCNT_inc(GvHV(iogv))));
              ^

"/pro/3gl/CPAN/perl-current/sv_inline.h", line 468: warning #4276-D: relational operator ">" always evaluates to 'false'
              Zero(new_body, type_details->body_size, char);
              ^

"XSMore.xs", line 48: warning #4276-D: relational operator ">" always evaluates to 'false'
     Newx(*c, lenc+1, char);
     ^

"XSMore.xs", line 63: warning #4276-D: relational operator ">" always evaluates to 'false'
     Newx(*c, lenc+1, char);
     ^

"/pro/3gl/CPAN/perl-current/sv_inline.h", line 487: warning #4232-D: conversion from "XPVIO *" to a more strictly aligned type "XPVMG *" may cause misaligned access
              SvSTASH_set(io, MUTABLE_HV(SvREFCNT_inc(GvHV(iogv))));
              ^

"/pro/3gl/CPAN/perl-current/sv_inline.h", line 468: warning #4276-D: relational operator ">" always evaluates to 'false'
              Zero(new_body, type_details->body_size, char);
              ^

c++: error: +Z: No such file or directory
c++: error: +O2: No such file or directory
c++: error: +Onolimit: No such file or directory
# 
# 
# Compress::Raw::Zlib::VERSION        2.105
# 
# ZLIB_VERSION (from zlib.h)          1.2.12
# zlib_version (from zlib library)    1.2.12
# 
# ZLIB_VERNUM                         0x12C0
# BUILD_ZLIB                          1
# GZIP_OS_CODE                        3
# 
# zlibCompileFlags                    85
#   Type Sizes
#     size of uInt                    32 bit
#     size of uLong                   32 bit
#     size of pointer                 32 bit
#     size of z_off_t                 32 bit
#   Compiler Options                  None
#   One-time table building           None
#   Library content                   None
#   Operation variations              None
# 
"../sv_inline.h", line 487: warning #4232-D: conversion from "XPVIO *" to a more strictly aligned type "XPVMG *" may cause misaligned access
              SvSTASH_set(io, MUTABLE_HV(SvREFCNT_inc(GvHV(iogv))));
              ^

"../sv_inline.h", line 468: warning #4276-D: relational operator ">" always evaluates to 'false'
              Zero(new_body, type_details->body_size, char);
              ^

cc: warning 983: The -lc library specified on the command line is also added automatically by the compiler driver.  
# Failed test 1701 - sprintf( "%.54g", 0.3 ) renders correctly at op/sprintf2.t line 1197
#      got "0.299999999999999988897769753748434596"
# expected eq "0.299999999999999988897769753748434595763683319091796875"
Subroutine Time::HiRes::constant redefined at (eval 37) line 1.
Subroutine Time::HiRes::usleep redefined at (eval 37) line 1.
Subroutine Time::HiRes::nanosleep redefined at (eval 37) line 1.
Subroutine Time::HiRes::sleep redefined at (eval 37) line 1.
Subroutine Time::HiRes::ualarm redefined at (eval 37) line 1.
Subroutine Time::HiRes::alarm redefined at (eval 37) line 1.
Subroutine Time::HiRes::gettimeofday redefined at (eval 37) line 1.
Subroutine Time::HiRes::time redefined at (eval 37) line 1.
Subroutine Time::HiRes::setitimer redefined at (eval 37) line 1.
Subroutine Time::HiRes::getitimer redefined at (eval 37) line 1.
Subroutine Time::HiRes::utime redefined at (eval 37) line 1.
Subroutine Time::HiRes::clock_gettime redefined at (eval 37) line 1.
Subroutine Time::HiRes::clock_getres redefined at (eval 37) line 1.
Subroutine Time::HiRes::clock_nanosleep redefined at (eval 37) line 1.
Subroutine Time::HiRes::clock redefined at (eval 37) line 1.
Subroutine Time::HiRes::lstat redefined at (eval 37) line 1.
Subroutine Time::HiRes::stat redefined at (eval 37) line 1.
# Connected to 127.0.0.1
# Connected to 127.0.0.1
Integer overflow in hexadecimal number at t/broken_univ_can.t line 13.
make: *** [test_harness] Error 1

error while running harness target 'test_harness': 2 at /pro/3gl/CPAN/smoke/lib/Test/Smoke/App/RunSmoke.pm line 118.
[2022-05-20 23:49:06+0200] 
[2022-05-20 23:49:06+0200] ../dist/Net-Ping/t/450_service.t............................PASSED
[2022-05-20 23:49:06+0200]     9, 18
[2022-05-20 23:49:06+0200] ../t/op/sprintf2.t..........................................FAILED
[2022-05-20 23:49:06+0200]     1701
[2022-05-20 23:49:06+0200] Archived results...
[2022-05-20 23:49:06+0200] Unskip tests from '/pro/3gl/CPAN/smoke/p59.skip'
[2022-05-20 23:49:06+0200] 
[2022-05-20 23:49:06+0200] Configuration: -Dusedevel -DDEBUGGING
[2022-05-20 23:49:06+0200] ------------------------------------------------------------------------------
[2022-05-20 23:49:06+0200] make distclean ...
[2022-05-20 23:49:46+0200] 
[2022-05-20 23:49:46+0200] Copy Policy.sh ...
[2022-05-20 23:49:46+0200] 
[2022-05-20 23:49:46+0200] Configure ...
[2022-05-20 23:51:20+0200] 
[2022-05-20 23:51:20+0200] make ...
[2022-05-21 00:13:17+0200] Skip tests from '/pro/3gl/CPAN/smoke/p59.skip'
[2022-05-21 00:13:17+0200] 	cpan/Sys-Syslog/t/syslog.t
[2022-05-21 00:13:17+0200] 
[2022-05-21 00:13:17+0200]  Tests start here:
[2022-05-21 00:13:17+0200] TSTENV = stdio	
No saved state, selection will be empty
# 
# 
# Compress::Raw::Zlib::VERSION        2.105
# 
# ZLIB_VERSION (from zlib.h)          1.2.12
# zlib_version (from zlib library)    1.2.12
# 
# ZLIB_VERNUM                         0x12C0
# BUILD_ZLIB                          1
# GZIP_OS_CODE                        3
# 
# zlibCompileFlags                    85
#   Type Sizes
#     size of uInt                    32 bit
#     size of uLong                   32 bit
#     size of pointer                 32 bit
#     size of z_off_t                 32 bit
#   Compiler Options                  None
#   One-time table building           None
#   Library content                   None
#   Operation variations              None
# 
Cannot figure out an encoding to use at t/use-Encode-Alias.t line 5.
"../../../../sv_inline.h", line 487: warning #4232-D: conversion from "XPVIO *" to a more strictly aligned type "XPVMG *" may cause misaligned access
              SvSTASH_set(io, MUTABLE_HV(SvREFCNT_inc(GvHV(iogv))));
              ^

"../../../../sv_inline.h", line 468: warning #4276-D: relational operator ">" always evaluates to 'false'
              Zero(new_body, type_details->body_size, char);
              ^

"../../../../sv_inline.h", line 487: warning #4232-D: conversion from "XPVIO *" to a more strictly aligned type "XPVMG *" may cause misaligned access
              SvSTASH_set(io, MUTABLE_HV(SvREFCNT_inc(GvHV(iogv))));
              ^

"../../../../sv_inline.h", line 468: warning #4276-D: relational operator ">" always evaluates to 'false'
              Zero(new_body, type_details->body_size, char);
              ^

"../../../../sv_inline.h", line 487: warning #4232-D: conversion from "XPVIO *" to a more strictly aligned type "XPVMG *" may cause misaligned access
              SvSTASH_set(io, MUTABLE_HV(SvREFCNT_inc(GvHV(iogv))));
              ^

"../../../../sv_inline.h", line 468: warning #4276-D: relational operator ">" always evaluates to 'false'
              Zero(new_body, type_details->body_size, char);
              ^

"../../../../sv_inline.h", line 487: warning #4232-D: conversion from "XPVIO *" to a more strictly aligned type "XPVMG *" may cause misaligned access
              SvSTASH_set(io, MUTABLE_HV(SvREFCNT_inc(GvHV(iogv))));
              ^

"../../../../sv_inline.h", line 468: warning #4276-D: relational operator ">" always evaluates to 'false'
              Zero(new_body, type_details->body_size, char);
              ^

"../../../../sv_inline.h", line 487: warning #4232-D: conversion from "XPVIO *" to a more strictly aligned type "XPVMG *" may cause misaligned access
              SvSTASH_set(io, MUTABLE_HV(SvREFCNT_inc(GvHV(iogv))));
              ^

"../../../../sv_inline.h", line 468: warning #4276-D: relational operator ">" always evaluates to 'false'
              Zero(new_body, type_details->body_size, char);
              ^

"../../../../sv_inline.h", line 487: warning #4232-D: conversion from "XPVIO *" to a more strictly aligned type "XPVMG *" may cause misaligned access
              SvSTASH_set(io, MUTABLE_HV(SvREFCNT_inc(GvHV(iogv))));
              ^

"../../../../sv_inline.h", line 468: warning #4276-D: relational operator ">" always evaluates to 'false'
              Zero(new_body, type_details->body_size, char);
              ^

"../../../../sv_inline.h", line 487: warning #4232-D: conversion from "XPVIO *" to a more strictly aligned type "XPVMG *" may cause misaligned access
              SvSTASH_set(io, MUTABLE_HV(SvREFCNT_inc(GvHV(iogv))));
              ^

"../../../../sv_inline.h", line 468: warning #4276-D: relational operator ">" always evaluates to 'false'
              Zero(new_body, type_details->body_size, char);
              ^

# Connected to 127.0.0.1
# Connected to 127.0.0.1
Integer overflow in hexadecimal number at t/broken_univ_can.t line 13.
Redefining sub xChild::foo at xChild--1443 line 2.
Redefining sub Data::ok at -e line 1.
"/pro/3gl/CPAN/perl-current/sv_inline.h", line 487: warning #4232-D: conversion from "XPVIO *" to a more strictly aligned type "XPVMG *" may cause misaligned access
              SvSTASH_set(io, MUTABLE_HV(SvREFCNT_inc(GvHV(iogv))));
              ^

"XSTest.c", line 249: warning #2111-D: statement is unreachable
  	PUTBACK;
  	^

"/pro/3gl/CPAN/perl-current/sv_inline.h", line 468: warning #4276-D: relational operator ">" always evaluates to 'false'
              Zero(new_body, type_details->body_size, char);
              ^

c++: error: +Z: No such file or directory
c++: error: +O2: No such file or directory
c++: error: +Onolimit: No such file or directory
"/pro/3gl/CPAN/perl-current/sv_inline.h", line 487: warning #4232-D: conversion from "XPVIO *" to a more strictly aligned type "XPVMG *" may cause misaligned access
              SvSTASH_set(io, MUTABLE_HV(SvREFCNT_inc(GvHV(iogv))));
              ^

"/pro/3gl/CPAN/perl-current/sv_inline.h", line 468: warning #4276-D: relational operator ">" always evaluates to 'false'
              Zero(new_body, type_details->body_size, char);
              ^

"XSMore.xs", line 48: warning #4276-D: relational operator ">" always evaluates to 'false'
     Newx(*c, lenc+1, char);
     ^

"XSMore.xs", line 63: warning #4276-D: relational operator ">" always evaluates to 'false'
     Newx(*c, lenc+1, char);
     ^

"/pro/3gl/CPAN/perl-current/sv_inline.h", line 487: warning #4232-D: conversion from "XPVIO *" to a more strictly aligned type "XPVMG *" may cause misaligned access
              SvSTASH_set(io, MUTABLE_HV(SvREFCNT_inc(GvHV(iogv))));
              ^

"/pro/3gl/CPAN/perl-current/sv_inline.h", line 468: warning #4276-D: relational operator ">" always evaluates to 'false'
              Zero(new_body, type_details->body_size, char);
              ^

Subroutine Time::HiRes::constant redefined at (eval 37) line 1.
Subroutine Time::HiRes::usleep redefined at (eval 37) line 1.
Subroutine Time::HiRes::nanosleep redefined at (eval 37) line 1.
Subroutine Time::HiRes::sleep redefined at (eval 37) line 1.
Subroutine Time::HiRes::ualarm redefined at (eval 37) line 1.
Subroutine Time::HiRes::alarm redefined at (eval 37) line 1.
Subroutine Time::HiRes::gettimeofday redefined at (eval 37) line 1.
Subroutine Time::HiRes::time redefined at (eval 37) line 1.
Subroutine Time::HiRes::setitimer redefined at (eval 37) line 1.
Subroutine Time::HiRes::getitimer redefined at (eval 37) line 1.
Subroutine Time::HiRes::utime redefined at (eval 37) line 1.
Subroutine Time::HiRes::clock_gettime redefined at (eval 37) line 1.
Subroutine Time::HiRes::clock_getres redefined at (eval 37) line 1.
Subroutine Time::HiRes::clock_nanosleep redefined at (eval 37) line 1.
Subroutine Time::HiRes::clock redefined at (eval 37) line 1.
Subroutine Time::HiRes::lstat redefined at (eval 37) line 1.
Subroutine Time::HiRes::stat redefined at (eval 37) line 1.
"../sv_inline.h", line 487: warning #4232-D: conversion from "XPVIO *" to a more strictly aligned type "XPVMG *" may cause misaligned access
              SvSTASH_set(io, MUTABLE_HV(SvREFCNT_inc(GvHV(iogv))));
              ^

"../sv_inline.h", line 468: warning #4276-D: relational operator ">" always evaluates to 'false'
              Zero(new_body, type_details->body_size, char);
              ^

cc: warning 983: The -lc library specified on the command line is also added automatically by the compiler driver.  
# Failed test 1701 - sprintf( "%.54g", 0.3 ) renders correctly at op/sprintf2.t line 1197
#      got "0.299999999999999988897769753748434596"
# expected eq "0.299999999999999988897769753748434595763683319091796875"
make: *** [test_harness] Error 1

error while running harness target 'test_harness': 2 at /pro/3gl/CPAN/smoke/lib/Test/Smoke/App/RunSmoke.pm line 118.
[2022-05-21 00:31:46+0200] 
[2022-05-21 00:31:46+0200] ../dist/Net-Ping/t/450_service.t............................PASSED
[2022-05-21 00:31:46+0200]     9, 18
[2022-05-21 00:31:46+0200] ../t/op/sprintf2.t..........................................FAILED
[2022-05-21 00:31:46+0200]     1701
[2022-05-21 00:31:46+0200] Archived results...
[2022-05-21 00:31:46+0200] TSTENV = perlio	
"../../../../sv_inline.h", line 487: warning #4232-D: conversion from "XPVIO *" to a more strictly aligned type "XPVMG *" may cause misaligned access
              SvSTASH_set(io, MUTABLE_HV(SvREFCNT_inc(GvHV(iogv))));
              ^

"../../../../sv_inline.h", line 468: warning #4276-D: relational operator ">" always evaluates to 'false'
              Zero(new_body, type_details->body_size, char);
              ^

"../../../../sv_inline.h", line 487: warning #4232-D: conversion from "XPVIO *" to a more strictly aligned type "XPVMG *" may cause misaligned access
              SvSTASH_set(io, MUTABLE_HV(SvREFCNT_inc(GvHV(iogv))));
              ^

"../../../../sv_inline.h", line 468: warning #4276-D: relational operator ">" always evaluates to 'false'
              Zero(new_body, type_details->body_size, char);
              ^

"../../../../sv_inline.h", line 487: warning #4232-D: conversion from "XPVIO *" to a more strictly aligned type "XPVMG *" may cause misaligned access
              SvSTASH_set(io, MUTABLE_HV(SvREFCNT_inc(GvHV(iogv))));
              ^

"../../../../sv_inline.h", line 468: warning #4276-D: relational operator ">" always evaluates to 'false'
              Zero(new_body, type_details->body_size, char);
              ^

"../../../../sv_inline.h", line 487: warning #4232-D: conversion from "XPVIO *" to a more strictly aligned type "XPVMG *" may cause misaligned access
              SvSTASH_set(io, MUTABLE_HV(SvREFCNT_inc(GvHV(iogv))));
              ^

"../../../../sv_inline.h", line 468: warning #4276-D: relational operator ">" always evaluates to 'false'
              Zero(new_body, type_details->body_size, char);
              ^

"../../../../sv_inline.h", line 487: warning #4232-D: conversion from "XPVIO *" to a more strictly aligned type "XPVMG *" may cause misaligned access
              SvSTASH_set(io, MUTABLE_HV(SvREFCNT_inc(GvHV(iogv))));
              ^

"../../../../sv_inline.h", line 468: warning #4276-D: relational operator ">" always evaluates to 'false'
              Zero(new_body, type_details->body_size, char);
              ^

"../../../../sv_inline.h", line 487: warning #4232-D: conversion from "XPVIO *" to a more strictly aligned type "XPVMG *" may cause misaligned access
              SvSTASH_set(io, MUTABLE_HV(SvREFCNT_inc(GvHV(iogv))));
              ^

"../../../../sv_inline.h", line 468: warning #4276-D: relational operator ">" always evaluates to 'false'
              Zero(new_body, type_details->body_size, char);
              ^

"../../../../sv_inline.h", line 487: warning #4232-D: conversion from "XPVIO *" to a more strictly aligned type "XPVMG *" may cause misaligned access
              SvSTASH_set(io, MUTABLE_HV(SvREFCNT_inc(GvHV(iogv))));
              ^

"../../../../sv_inline.h", line 468: warning #4276-D: relational operator ">" always evaluates to 'false'
              Zero(new_body, type_details->body_size, char);
              ^

"/pro/3gl/CPAN/perl-current/sv_inline.h", line 487: warning #4232-D: conversion from "XPVIO *" to a more strictly aligned type "XPVMG *" may cause misaligned access
              SvSTASH_set(io, MUTABLE_HV(SvREFCNT_inc(GvHV(iogv))));
              ^

"XSTest.c", line 249: warning #2111-D: statement is unreachable
  	PUTBACK;
  	^

"/pro/3gl/CPAN/perl-current/sv_inline.h", line 468: warning #4276-D: relational operator ">" always evaluates to 'false'
              Zero(new_body, type_details->body_size, char);
              ^

"/pro/3gl/CPAN/perl-current/sv_inline.h", line 487: warning #4232-D: conversion from "XPVIO *" to a more strictly aligned type "XPVMG *" may cause misaligned access
              SvSTASH_set(io, MUTABLE_HV(SvREFCNT_inc(GvHV(iogv))));
              ^

"/pro/3gl/CPAN/perl-current/sv_inline.h", line 468: warning #4276-D: relational operator ">" always evaluates to 'false'
              Zero(new_body, type_details->body_size, char);
              ^

"XSMore.xs", line 48: warning #4276-D: relational operator ">" always evaluates to 'false'
     Newx(*c, lenc+1, char);
     ^

"XSMore.xs", line 63: warning #4276-D: relational operator ">" always evaluates to 'false'
     Newx(*c, lenc+1, char);
     ^

"/pro/3gl/CPAN/perl-current/sv_inline.h", line 487: warning #4232-D: conversion from "XPVIO *" to a more strictly aligned type "XPVMG *" may cause misaligned access
              SvSTASH_set(io, MUTABLE_HV(SvREFCNT_inc(GvHV(iogv))));
              ^

"/pro/3gl/CPAN/perl-current/sv_inline.h", line 468: warning #4276-D: relational operator ">" always evaluates to 'false'
              Zero(new_body, type_details->body_size, char);
              ^

c++: error: +Z: No such file or directory
c++: error: +O2: No such file or directory
c++: error: +Onolimit: No such file or directory
# 
# 
# Compress::Raw::Zlib::VERSION        2.105
# 
# ZLIB_VERSION (from zlib.h)          1.2.12
# zlib_version (from zlib library)    1.2.12
# 
# ZLIB_VERNUM                         0x12C0
# BUILD_ZLIB                          1
# GZIP_OS_CODE                        3
# 
# zlibCompileFlags                    85
#   Type Sizes
#     size of uInt                    32 bit
#     size of uLong                   32 bit
#     size of pointer                 32 bit
#     size of z_off_t                 32 bit
#   Compiler Options                  None
#   One-time table building           None
#   Library content                   None
#   Operation variations              None
# 
"../sv_inline.h", line 487: warning #4232-D: conversion from "XPVIO *" to a more strictly aligned type "XPVMG *" may cause misaligned access
              SvSTASH_set(io, MUTABLE_HV(SvREFCNT_inc(GvHV(iogv))));
              ^

"../sv_inline.h", line 468: warning #4276-D: relational operator ">" always evaluates to 'false'
              Zero(new_body, type_details->body_size, char);
              ^

cc: warning 983: The -lc library specified on the command line is also added automatically by the compiler driver.  
# Failed test 1701 - sprintf( "%.54g", 0.3 ) renders correctly at op/sprintf2.t line 1197
#      got "0.299999999999999988897769753748434596"
# expected eq "0.299999999999999988897769753748434595763683319091796875"
# Connected to 127.0.0.1
# Connected to 127.0.0.1
Subroutine Time::HiRes::constant redefined at (eval 37) line 1.
Subroutine Time::HiRes::usleep redefined at (eval 37) line 1.
Subroutine Time::HiRes::nanosleep redefined at (eval 37) line 1.
Subroutine Time::HiRes::sleep redefined at (eval 37) line 1.
Subroutine Time::HiRes::ualarm redefined at (eval 37) line 1.
Subroutine Time::HiRes::alarm redefined at (eval 37) line 1.
Subroutine Time::HiRes::gettimeofday redefined at (eval 37) line 1.
Subroutine Time::HiRes::time redefined at (eval 37) line 1.
Subroutine Time::HiRes::setitimer redefined at (eval 37) line 1.
Subroutine Time::HiRes::getitimer redefined at (eval 37) line 1.
Subroutine Time::HiRes::utime redefined at (eval 37) line 1.
Subroutine Time::HiRes::clock_gettime redefined at (eval 37) line 1.
Subroutine Time::HiRes::clock_getres redefined at (eval 37) line 1.
Subroutine Time::HiRes::clock_nanosleep redefined at (eval 37) line 1.
Subroutine Time::HiRes::clock redefined at (eval 37) line 1.
Subroutine Time::HiRes::lstat redefined at (eval 37) line 1.
Subroutine Time::HiRes::stat redefined at (eval 37) line 1.
Cannot figure out an encoding to use at t/use-Encode-Alias.t line 5.
Integer overflow in hexadecimal number at t/broken_univ_can.t line 13.
make: *** [test_harness] Error 1

error while running harness target 'test_harness': 2 at /pro/3gl/CPAN/smoke/lib/Test/Smoke/App/RunSmoke.pm line 118.
[2022-05-21 00:47:47+0200] 
[2022-05-21 00:47:47+0200] ../dist/Net-Ping/t/450_service.t............................PASSED
[2022-05-21 00:47:47+0200]     9, 18
[2022-05-21 00:47:47+0200] ../t/op/sprintf2.t..........................................FAILED
[2022-05-21 00:47:47+0200]     1701
[2022-05-21 00:47:47+0200] Archived results...
[2022-05-21 00:47:47+0200] TSTENV = locale:en_US.utf8	
"../../../../sv_inline.h", line 487: warning #4232-D: conversion from "XPVIO *" to a more strictly aligned type "XPVMG *" may cause misaligned access
              SvSTASH_set(io, MUTABLE_HV(SvREFCNT_inc(GvHV(iogv))));
              ^

"../../../../sv_inline.h", line 468: warning #4276-D: relational operator ">" always evaluates to 'false'
              Zero(new_body, type_details->body_size, char);
              ^

"../../../../sv_inline.h", line 487: warning #4232-D: conversion from "XPVIO *" to a more strictly aligned type "XPVMG *" may cause misaligned access
              SvSTASH_set(io, MUTABLE_HV(SvREFCNT_inc(GvHV(iogv))));
              ^

"../../../../sv_inline.h", line 468: warning #4276-D: relational operator ">" always evaluates to 'false'
              Zero(new_body, type_details->body_size, char);
              ^

"../../../../sv_inline.h", line 487: warning #4232-D: conversion from "XPVIO *" to a more strictly aligned type "XPVMG *" may cause misaligned access
              SvSTASH_set(io, MUTABLE_HV(SvREFCNT_inc(GvHV(iogv))));
              ^

"../../../../sv_inline.h", line 468: warning #4276-D: relational operator ">" always evaluates to 'false'
              Zero(new_body, type_details->body_size, char);
              ^

"../../../../sv_inline.h", line 487: warning #4232-D: conversion from "XPVIO *" to a more strictly aligned type "XPVMG *" may cause misaligned access
              SvSTASH_set(io, MUTABLE_HV(SvREFCNT_inc(GvHV(iogv))));
              ^

"../../../../sv_inline.h", line 468: warning #4276-D: relational operator ">" always evaluates to 'false'
              Zero(new_body, type_details->body_size, char);
              ^

"../../../../sv_inline.h", line 487: warning #4232-D: conversion from "XPVIO *" to a more strictly aligned type "XPVMG *" may cause misaligned access
              SvSTASH_set(io, MUTABLE_HV(SvREFCNT_inc(GvHV(iogv))));
              ^

"../../../../sv_inline.h", line 468: warning #4276-D: relational operator ">" always evaluates to 'false'
              Zero(new_body, type_details->body_size, char);
              ^

"../../../../sv_inline.h", line 487: warning #4232-D: conversion from "XPVIO *" to a more strictly aligned type "XPVMG *" may cause misaligned access
              SvSTASH_set(io, MUTABLE_HV(SvREFCNT_inc(GvHV(iogv))));
              ^

"../../../../sv_inline.h", line 468: warning #4276-D: relational operator ">" always evaluates to 'false'
              Zero(new_body, type_details->body_size, char);
              ^

"../../../../sv_inline.h", line 487: warning #4232-D: conversion from "XPVIO *" to a more strictly aligned type "XPVMG *" may cause misaligned access
              SvSTASH_set(io, MUTABLE_HV(SvREFCNT_inc(GvHV(iogv))));
              ^

"../../../../sv_inline.h", line 468: warning #4276-D: relational operator ">" always evaluates to 'false'
              Zero(new_body, type_details->body_size, char);
              ^

"/pro/3gl/CPAN/perl-current/sv_inline.h", line 487: warning #4232-D: conversion from "XPVIO *" to a more strictly aligned type "XPVMG *" may cause misaligned access
              SvSTASH_set(io, MUTABLE_HV(SvREFCNT_inc(GvHV(iogv))));
              ^

"XSTest.c", line 249: warning #2111-D: statement is unreachable
  	PUTBACK;
  	^

"/pro/3gl/CPAN/perl-current/sv_inline.h", line 468: warning #4276-D: relational operator ">" always evaluates to 'false'
              Zero(new_body, type_details->body_size, char);
              ^

"/pro/3gl/CPAN/perl-current/sv_inline.h", line 487: warning #4232-D: conversion from "XPVIO *" to a more strictly aligned type "XPVMG *" may cause misaligned access
              SvSTASH_set(io, MUTABLE_HV(SvREFCNT_inc(GvHV(iogv))));
              ^

"/pro/3gl/CPAN/perl-current/sv_inline.h", line 468: warning #4276-D: relational operator ">" always evaluates to 'false'
              Zero(new_body, type_details->body_size, char);
              ^

"XSMore.xs", line 48: warning #4276-D: relational operator ">" always evaluates to 'false'
     Newx(*c, lenc+1, char);
     ^

"XSMore.xs", line 63: warning #4276-D: relational operator ">" always evaluates to 'false'
     Newx(*c, lenc+1, char);
     ^

"/pro/3gl/CPAN/perl-current/sv_inline.h", line 487: warning #4232-D: conversion from "XPVIO *" to a more strictly aligned type "XPVMG *" may cause misaligned access
              SvSTASH_set(io, MUTABLE_HV(SvREFCNT_inc(GvHV(iogv))));
              ^

"/pro/3gl/CPAN/perl-current/sv_inline.h", line 468: warning #4276-D: relational operator ">" always evaluates to 'false'
              Zero(new_body, type_details->body_size, char);
              ^

c++: error: +Z: No such file or directory
c++: error: +O2: No such file or directory
c++: error: +Onolimit: No such file or directory
# 
# 
# Compress::Raw::Zlib::VERSION        2.105
# 
# ZLIB_VERSION (from zlib.h)          1.2.12
# zlib_version (from zlib library)    1.2.12
# 
# ZLIB_VERNUM                         0x12C0
# BUILD_ZLIB                          1
# GZIP_OS_CODE                        3
# 
# zlibCompileFlags                    85
#   Type Sizes
#     size of uInt                    32 bit
#     size of uLong                   32 bit
#     size of pointer                 32 bit
#     size of z_off_t                 32 bit
#   Compiler Options                  None
#   One-time table building           None
#   Library content                   None
#   Operation variations              None
# 
"../sv_inline.h", line 487: warning #4232-D: conversion from "XPVIO *" to a more strictly aligned type "XPVMG *" may cause misaligned access
              SvSTASH_set(io, MUTABLE_HV(SvREFCNT_inc(GvHV(iogv))));
              ^

"../sv_inline.h", line 468: warning #4276-D: relational operator ">" always evaluates to 'false'
              Zero(new_body, type_details->body_size, char);
              ^

cc: warning 983: The -lc library specified on the command line is also added automatically by the compiler driver.  
# Failed test 1701 - sprintf( "%.54g", 0.3 ) renders correctly at op/sprintf2.t line 1197
#      got "0.299999999999999988897769753748434596"
# expected eq "0.299999999999999988897769753748434595763683319091796875"
Subroutine Time::HiRes::constant redefined at (eval 37) line 1.
Subroutine Time::HiRes::usleep redefined at (eval 37) line 1.
Subroutine Time::HiRes::nanosleep redefined at (eval 37) line 1.
Subroutine Time::HiRes::sleep redefined at (eval 37) line 1.
Subroutine Time::HiRes::ualarm redefined at (eval 37) line 1.
Subroutine Time::HiRes::alarm redefined at (eval 37) line 1.
Subroutine Time::HiRes::gettimeofday redefined at (eval 37) line 1.
Subroutine Time::HiRes::time redefined at (eval 37) line 1.
Subroutine Time::HiRes::setitimer redefined at (eval 37) line 1.
Subroutine Time::HiRes::getitimer redefined at (eval 37) line 1.
Subroutine Time::HiRes::utime redefined at (eval 37) line 1.
Subroutine Time::HiRes::clock_gettime redefined at (eval 37) line 1.
Subroutine Time::HiRes::clock_getres redefined at (eval 37) line 1.
Subroutine Time::HiRes::clock_nanosleep redefined at (eval 37) line 1.
Subroutine Time::HiRes::clock redefined at (eval 37) line 1.
Subroutine Time::HiRes::lstat redefined at (eval 37) line 1.
Subroutine Time::HiRes::stat redefined at (eval 37) line 1.
# Connected to 127.0.0.1
# Connected to 127.0.0.1
Integer overflow in hexadecimal number at t/broken_univ_can.t line 13.
make: *** [test_harness] Error 1

error while running harness target 'test_harness': 2 at /pro/3gl/CPAN/smoke/lib/Test/Smoke/App/RunSmoke.pm line 118.
[2022-05-21 01:03:58+0200] 
[2022-05-21 01:03:58+0200] ../dist/Net-Ping/t/450_service.t............................PASSED
[2022-05-21 01:03:58+0200]     9, 18
[2022-05-21 01:03:58+0200] ../t/op/sprintf2.t..........................................FAILED
[2022-05-21 01:03:58+0200]     1701
[2022-05-21 01:03:58+0200] Archived results...
[2022-05-21 01:03:58+0200] Unskip tests from '/pro/3gl/CPAN/smoke/p59.skip'
[2022-05-21 01:03:58+0200] 
[2022-05-21 01:03:58+0200] Configuration: -Dusedevel -Duse64bitall
[2022-05-21 01:03:58+0200] ------------------------------------------------------------------------------
[2022-05-21 01:03:58+0200] make distclean ...
[2022-05-21 01:04:42+0200] 
[2022-05-21 01:04:42+0200] Copy Policy.sh ...
[2022-05-21 01:04:42+0200] 
[2022-05-21 01:04:42+0200] Configure ...
[2022-05-21 01:06:15+0200] 
[2022-05-21 01:06:15+0200] make ...
[2022-05-21 01:23:52+0200] Skip tests from '/pro/3gl/CPAN/smoke/p59.skip'
[2022-05-21 01:23:52+0200] 	cpan/Sys-Syslog/t/syslog.t
[2022-05-21 01:23:52+0200] 
[2022-05-21 01:23:52+0200]  Tests start here:
[2022-05-21 01:23:52+0200] TSTENV = stdio	
No saved state, selection will be empty
# 
# 
# Compress::Raw::Zlib::VERSION        2.105
# 
# ZLIB_VERSION (from zlib.h)          1.2.12
# zlib_version (from zlib library)    1.2.12
# 
# ZLIB_VERNUM                         0x12C0
# BUILD_ZLIB                          1
# GZIP_OS_CODE                        3
# 
# zlibCompileFlags                    169
#   Type Sizes
#     size of uInt                    32 bit
#     size of uLong                   64 bit
#     size of pointer                 64 bit
#     size of z_off_t                 64 bit
#   Compiler Options                  None
#   One-time table building           None
#   Library content                   None
#   Operation variations              None
# 
Cannot figure out an encoding to use at t/use-Encode-Alias.t line 5.
"../../../../sv_inline.h", line 468: warning #4276-D: relational operator ">" always evaluates to 'false'
              Zero(new_body, type_details->body_size, char);
              ^

"../../../../sv_inline.h", line 468: warning #4276-D: relational operator ">" always evaluates to 'false'
              Zero(new_body, type_details->body_size, char);
              ^

"../../../../sv_inline.h", line 468: warning #4276-D: relational operator ">" always evaluates to 'false'
              Zero(new_body, type_details->body_size, char);
              ^

"../../../../sv_inline.h", line 468: warning #4276-D: relational operator ">" always evaluates to 'false'
              Zero(new_body, type_details->body_size, char);
              ^

"../../../../sv_inline.h", line 468: warning #4276-D: relational operator ">" always evaluates to 'false'
              Zero(new_body, type_details->body_size, char);
              ^

"../../../../sv_inline.h", line 468: warning #4276-D: relational operator ">" always evaluates to 'false'
              Zero(new_body, type_details->body_size, char);
              ^

"../../../../sv_inline.h", line 468: warning #4276-D: relational operator ">" always evaluates to 'false'
              Zero(new_body, type_details->body_size, char);
              ^

# Connected to 127.0.0.1
# Connected to 127.0.0.1
Redefining sub xChild::foo at xChild--9920 line 2.
Redefining sub Data::ok at -e line 1.
"XSTest.c", line 249: warning #2111-D: statement is unreachable
  	PUTBACK;
  	^

"/pro/3gl/CPAN/perl-current/sv_inline.h", line 468: warning #4276-D: relational operator ">" always evaluates to 'false'
              Zero(new_body, type_details->body_size, char);
              ^

c++: error: +Z: No such file or directory
c++: error: +O2: No such file or directory
c++: error: +Onolimit: No such file or directory
"/pro/3gl/CPAN/perl-current/sv_inline.h", line 468: warning #4276-D: relational operator ">" always evaluates to 'false'
              Zero(new_body, type_details->body_size, char);
              ^

"XSMore.xs", line 48: warning #4276-D: relational operator ">" always evaluates to 'false'
     Newx(*c, lenc+1, char);
     ^

"XSMore.xs", line 63: warning #4276-D: relational operator ">" always evaluates to 'false'
     Newx(*c, lenc+1, char);
     ^

"/pro/3gl/CPAN/perl-current/sv_inline.h", line 468: warning #4276-D: relational operator ">" always evaluates to 'false'
              Zero(new_body, type_details->body_size, char);
              ^

Subroutine Time::HiRes::constant redefined at (eval 37) line 1.
Subroutine Time::HiRes::usleep redefined at (eval 37) line 1.
Subroutine Time::HiRes::nanosleep redefined at (eval 37) line 1.
Subroutine Time::HiRes::sleep redefined at (eval 37) line 1.
Subroutine Time::HiRes::ualarm redefined at (eval 37) line 1.
Subroutine Time::HiRes::alarm redefined at (eval 37) line 1.
Subroutine Time::HiRes::gettimeofday redefined at (eval 37) line 1.
Subroutine Time::HiRes::time redefined at (eval 37) line 1.
Subroutine Time::HiRes::setitimer redefined at (eval 37) line 1.
Subroutine Time::HiRes::getitimer redefined at (eval 37) line 1.
Subroutine Time::HiRes::utime redefined at (eval 37) line 1.
Subroutine Time::HiRes::clock_gettime redefined at (eval 37) line 1.
Subroutine Time::HiRes::clock_getres redefined at (eval 37) line 1.
Subroutine Time::HiRes::clock_nanosleep redefined at (eval 37) line 1.
Subroutine Time::HiRes::clock redefined at (eval 37) line 1.
Subroutine Time::HiRes::lstat redefined at (eval 37) line 1.
Subroutine Time::HiRes::stat redefined at (eval 37) line 1.
"../sv_inline.h", line 468: warning #4276-D: relational operator ">" always evaluates to 'false'
              Zero(new_body, type_details->body_size, char);
              ^

cc: warning 983: The -lc library specified on the command line is also added automatically by the compiler driver.  
# Failed test 1704 - sprintf( "%.54g", 0.3 ) renders correctly at op/sprintf2.t line 1197
#      got "0.299999999999999988897769753748434596"
# expected eq "0.299999999999999988897769753748434595763683319091796875"
make: *** [test_harness] Error 1

error while running harness target 'test_harness': 2 at /pro/3gl/CPAN/smoke/lib/Test/Smoke/App/RunSmoke.pm line 118.
[2022-05-21 01:40:51+0200] 
[2022-05-21 01:40:51+0200] ../dist/Net-Ping/t/450_service.t............................PASSED
[2022-05-21 01:40:51+0200]     9, 18
[2022-05-21 01:40:51+0200] ../t/op/sprintf2.t..........................................FAILED
[2022-05-21 01:40:51+0200]     1704
[2022-05-21 01:40:51+0200] ../t/re/reg_mesg.t..........................................FAILED
[2022-05-21 01:40:51+0200]     No plan found in TAP output
[2022-05-21 01:40:51+0200] ../t/re/regex_sets.t........................................FAILED
[2022-05-21 01:40:51+0200]     No plan found in TAP output
[2022-05-21 01:40:51+0200] Archived results...
[2022-05-21 01:40:51+0200] TSTENV = perlio	
"../../../../sv_inline.h", line 468: warning #4276-D: relational operator ">" always evaluates to 'false'
              Zero(new_body, type_details->body_size, char);
              ^

"../../../../sv_inline.h", line 468: warning #4276-D: relational operator ">" always evaluates to 'false'
              Zero(new_body, type_details->body_size, char);
              ^

"../../../../sv_inline.h", line 468: warning #4276-D: relational operator ">" always evaluates to 'false'
              Zero(new_body, type_details->body_size, char);
              ^

"../../../../sv_inline.h", line 468: warning #4276-D: relational operator ">" always evaluates to 'false'
              Zero(new_body, type_details->body_size, char);
              ^

"../../../../sv_inline.h", line 468: warning #4276-D: relational operator ">" always evaluates to 'false'
              Zero(new_body, type_details->body_size, char);
              ^

"../../../../sv_inline.h", line 468: warning #4276-D: relational operator ">" always evaluates to 'false'
              Zero(new_body, type_details->body_size, char);
              ^

"../../../../sv_inline.h", line 468: warning #4276-D: relational operator ">" always evaluates to 'false'
              Zero(new_body, type_details->body_size, char);
              ^

"XSTest.c", line 249: warning #2111-D: statement is unreachable
  	PUTBACK;
  	^

"/pro/3gl/CPAN/perl-current/sv_inline.h", line 468: warning #4276-D: relational operator ">" always evaluates to 'false'
              Zero(new_body, type_details->body_size, char);
              ^

"/pro/3gl/CPAN/perl-current/sv_inline.h", line 468: warning #4276-D: relational operator ">" always evaluates to 'false'
              Zero(new_body, type_details->body_size, char);
              ^

"XSMore.xs", line 48: warning #4276-D: relational operator ">" always evaluates to 'false'
     Newx(*c, lenc+1, char);
     ^

"XSMore.xs", line 63: warning #4276-D: relational operator ">" always evaluates to 'false'
     Newx(*c, lenc+1, char);
     ^

"/pro/3gl/CPAN/perl-current/sv_inline.h", line 468: warning #4276-D: relational operator ">" always evaluates to 'false'
              Zero(new_body, type_details->body_size, char);
              ^

c++: error: +Z: No such file or directory
c++: error: +O2: No such file or directory
c++: error: +Onolimit: No such file or directory
# 
# 
# Compress::Raw::Zlib::VERSION        2.105
# 
# ZLIB_VERSION (from zlib.h)          1.2.12
# zlib_version (from zlib library)    1.2.12
# 
# ZLIB_VERNUM                         0x12C0
# BUILD_ZLIB                          1
# GZIP_OS_CODE                        3
# 
# zlibCompileFlags                    169
#   Type Sizes
#     size of uInt                    32 bit
#     size of uLong                   64 bit
#     size of pointer                 64 bit
#     size of z_off_t                 64 bit
#   Compiler Options                  None
#   One-time table building           None
#   Library content                   None
#   Operation variations              None
# 
"../sv_inline.h", line 468: warning #4276-D: relational operator ">" always evaluates to 'false'
              Zero(new_body, type_details->body_size, char);
              ^

cc: warning 983: The -lc library specified on the command line is also added automatically by the compiler driver.  
# Failed test 1704 - sprintf( "%.54g", 0.3 ) renders correctly at op/sprintf2.t line 1197
#      got "0.299999999999999988897769753748434596"
# expected eq "0.299999999999999988897769753748434595763683319091796875"
# Connected to 127.0.0.1
# Connected to 127.0.0.1
Subroutine Time::HiRes::constant redefined at (eval 37) line 1.
Subroutine Time::HiRes::usleep redefined at (eval 37) line 1.
Subroutine Time::HiRes::nanosleep redefined at (eval 37) line 1.
Subroutine Time::HiRes::sleep redefined at (eval 37) line 1.
Subroutine Time::HiRes::ualarm redefined at (eval 37) line 1.
Subroutine Time::HiRes::alarm redefined at (eval 37) line 1.
Subroutine Time::HiRes::gettimeofday redefined at (eval 37) line 1.
Subroutine Time::HiRes::time redefined at (eval 37) line 1.
Subroutine Time::HiRes::setitimer redefined at (eval 37) line 1.
Subroutine Time::HiRes::getitimer redefined at (eval 37) line 1.
Subroutine Time::HiRes::utime redefined at (eval 37) line 1.
Subroutine Time::HiRes::clock_gettime redefined at (eval 37) line 1.
Subroutine Time::HiRes::clock_getres redefined at (eval 37) line 1.
Subroutine Time::HiRes::clock_nanosleep redefined at (eval 37) line 1.
Subroutine Time::HiRes::clock redefined at (eval 37) line 1.
Subroutine Time::HiRes::lstat redefined at (eval 37) line 1.
Subroutine Time::HiRes::stat redefined at (eval 37) line 1.
Cannot figure out an encoding to use at t/use-Encode-Alias.t line 5.
make: *** [test_harness] Error 1

error while running harness target 'test_harness': 2 at /pro/3gl/CPAN/smoke/lib/Test/Smoke/App/RunSmoke.pm line 118.
[2022-05-21 01:55:50+0200] 
[2022-05-21 01:55:50+0200] ../dist/Net-Ping/t/450_service.t............................PASSED
[2022-05-21 01:55:50+0200]     9, 18
[2022-05-21 01:55:50+0200] ../t/op/sprintf2.t..........................................FAILED
[2022-05-21 01:55:50+0200]     1704
[2022-05-21 01:55:50+0200] ../t/re/regex_sets.t........................................FAILED
[2022-05-21 01:55:50+0200]     No plan found in TAP output
[2022-05-21 01:55:50+0200] ../t/re/reg_mesg.t..........................................FAILED
[2022-05-21 01:55:50+0200]     No plan found in TAP output
[2022-05-21 01:55:50+0200] Archived results...
[2022-05-21 01:55:50+0200] TSTENV = locale:en_US.utf8	
"../../../../sv_inline.h", line 468: warning #4276-D: relational operator ">" always evaluates to 'false'
              Zero(new_body, type_details->body_size, char);
              ^

"../../../../sv_inline.h", line 468: warning #4276-D: relational operator ">" always evaluates to 'false'
              Zero(new_body, type_details->body_size, char);
              ^

"../../../../sv_inline.h", line 468: warning #4276-D: relational operator ">" always evaluates to 'false'
              Zero(new_body, type_details->body_size, char);
              ^

"../../../../sv_inline.h", line 468: warning #4276-D: relational operator ">" always evaluates to 'false'
              Zero(new_body, type_details->body_size, char);
              ^

"../../../../sv_inline.h", line 468: warning #4276-D: relational operator ">" always evaluates to 'false'
              Zero(new_body, type_details->body_size, char);
              ^

"../../../../sv_inline.h", line 468: warning #4276-D: relational operator ">" always evaluates to 'false'
              Zero(new_body, type_details->body_size, char);
              ^

"../../../../sv_inline.h", line 468: warning #4276-D: relational operator ">" always evaluates to 'false'
              Zero(new_body, type_details->body_size, char);
              ^

"XSTest.c", line 249: warning #2111-D: statement is unreachable
  	PUTBACK;
  	^

"/pro/3gl/CPAN/perl-current/sv_inline.h", line 468: warning #4276-D: relational operator ">" always evaluates to 'false'
              Zero(new_body, type_details->body_size, char);
              ^

"/pro/3gl/CPAN/perl-current/sv_inline.h", line 468: warning #4276-D: relational operator ">" always evaluates to 'false'
              Zero(new_body, type_details->body_size, char);
              ^

"XSMore.xs", line 48: warning #4276-D: relational operator ">" always evaluates to 'false'
     Newx(*c, lenc+1, char);
     ^

"XSMore.xs", line 63: warning #4276-D: relational operator ">" always evaluates to 'false'
     Newx(*c, lenc+1, char);
     ^

"/pro/3gl/CPAN/perl-current/sv_inline.h", line 468: warning #4276-D: relational operator ">" always evaluates to 'false'
              Zero(new_body, type_details->body_size, char);
              ^

c++: error: +Z: No such file or directory
c++: error: +O2: No such file or directory
c++: error: +Onolimit: No such file or directory
# 
# 
# Compress::Raw::Zlib::VERSION        2.105
# 
# ZLIB_VERSION (from zlib.h)          1.2.12
# zlib_version (from zlib library)    1.2.12
# 
# ZLIB_VERNUM                         0x12C0
# BUILD_ZLIB                          1
# GZIP_OS_CODE                        3
# 
# zlibCompileFlags                    169
#   Type Sizes
#     size of uInt                    32 bit
#     size of uLong                   64 bit
#     size of pointer                 64 bit
#     size of z_off_t                 64 bit
#   Compiler Options                  None
#   One-time table building           None
#   Library content                   None
#   Operation variations              None
# 
"../sv_inline.h", line 468: warning #4276-D: relational operator ">" always evaluates to 'false'
              Zero(new_body, type_details->body_size, char);
              ^

cc: warning 983: The -lc library specified on the command line is also added automatically by the compiler driver.  
# Failed test 1704 - sprintf( "%.54g", 0.3 ) renders correctly at op/sprintf2.t line 1197
#      got "0.299999999999999988897769753748434596"
# expected eq "0.299999999999999988897769753748434595763683319091796875"
# Connected to 127.0.0.1
# Connected to 127.0.0.1
Subroutine Time::HiRes::constant redefined at (eval 37) line 1.
Subroutine Time::HiRes::usleep redefined at (eval 37) line 1.
Subroutine Time::HiRes::nanosleep redefined at (eval 37) line 1.
Subroutine Time::HiRes::sleep redefined at (eval 37) line 1.
Subroutine Time::HiRes::ualarm redefined at (eval 37) line 1.
Subroutine Time::HiRes::alarm redefined at (eval 37) line 1.
Subroutine Time::HiRes::gettimeofday redefined at (eval 37) line 1.
Subroutine Time::HiRes::time redefined at (eval 37) line 1.
Subroutine Time::HiRes::setitimer redefined at (eval 37) line 1.
Subroutine Time::HiRes::getitimer redefined at (eval 37) line 1.
Subroutine Time::HiRes::utime redefined at (eval 37) line 1.
Subroutine Time::HiRes::clock_gettime redefined at (eval 37) line 1.
Subroutine Time::HiRes::clock_getres redefined at (eval 37) line 1.
Subroutine Time::HiRes::clock_nanosleep redefined at (eval 37) line 1.
Subroutine Time::HiRes::clock redefined at (eval 37) line 1.
Subroutine Time::HiRes::lstat redefined at (eval 37) line 1.
Subroutine Time::HiRes::stat redefined at (eval 37) line 1.
make: *** [test_harness] Error 1

error while running harness target 'test_harness': 2 at /pro/3gl/CPAN/smoke/lib/Test/Smoke/App/RunSmoke.pm line 118.
[2022-05-21 02:10:42+0200] 
[2022-05-21 02:10:42+0200] ../dist/Net-Ping/t/450_service.t............................PASSED
[2022-05-21 02:10:42+0200]     9, 18
[2022-05-21 02:10:42+0200] ../t/op/sprintf2.t..........................................FAILED
[2022-05-21 02:10:42+0200]     1704
[2022-05-21 02:10:42+0200] ../t/re/regex_sets.t........................................FAILED
[2022-05-21 02:10:42+0200]     No plan found in TAP output
[2022-05-21 02:10:42+0200] ../t/re/reg_mesg.t..........................................FAILED
[2022-05-21 02:10:42+0200]     No plan found in TAP output
[2022-05-21 02:10:42+0200] Archived results...
[2022-05-21 02:10:42+0200] Unskip tests from '/pro/3gl/CPAN/smoke/p59.skip'
[2022-05-21 02:10:42+0200] 
[2022-05-21 02:10:42+0200] Configuration: -Dusedevel -Duse64bitall -DDEBUGGING
[2022-05-21 02:10:42+0200] ------------------------------------------------------------------------------
[2022-05-21 02:10:42+0200] make distclean ...
[2022-05-21 02:11:22+0200] 
[2022-05-21 02:11:22+0200] Copy Policy.sh ...
[2022-05-21 02:11:22+0200] 
[2022-05-21 02:11:22+0200] Configure ...
[2022-05-21 02:12:56+0200] 
[2022-05-21 02:12:56+0200] make ...
[2022-05-21 02:35:01+0200] Skip tests from '/pro/3gl/CPAN/smoke/p59.skip'
[2022-05-21 02:35:01+0200] 	cpan/Sys-Syslog/t/syslog.t
[2022-05-21 02:35:01+0200] 
[2022-05-21 02:35:01+0200]  Tests start here:
[2022-05-21 02:35:01+0200] TSTENV = stdio	
No saved state, selection will be empty
# 
# 
# Compress::Raw::Zlib::VERSION        2.105
# 
# ZLIB_VERSION (from zlib.h)          1.2.12
# zlib_version (from zlib library)    1.2.12
# 
# ZLIB_VERNUM                         0x12C0
# BUILD_ZLIB                          1
# GZIP_OS_CODE                        3
# 
# zlibCompileFlags                    169
#   Type Sizes
#     size of uInt                    32 bit
#     size of uLong                   64 bit
#     size of pointer                 64 bit
#     size of z_off_t                 64 bit
#   Compiler Options                  None
#   One-time table building           None
#   Library content                   None
#   Operation variations              None
# 
Cannot figure out an encoding to use at t/use-Encode-Alias.t line 5.
"../../../../sv_inline.h", line 468: warning #4276-D: relational operator ">" always evaluates to 'false'
              Zero(new_body, type_details->body_size, char);
              ^

"../../../../sv_inline.h", line 468: warning #4276-D: relational operator ">" always evaluates to 'false'
              Zero(new_body, type_details->body_size, char);
              ^

"../../../../sv_inline.h", line 468: warning #4276-D: relational operator ">" always evaluates to 'false'
              Zero(new_body, type_details->body_size, char);
              ^

"../../../../sv_inline.h", line 468: warning #4276-D: relational operator ">" always evaluates to 'false'
              Zero(new_body, type_details->body_size, char);
              ^

"../../../../sv_inline.h", line 468: warning #4276-D: relational operator ">" always evaluates to 'false'
              Zero(new_body, type_details->body_size, char);
              ^

"../../../../sv_inline.h", line 468: warning #4276-D: relational operator ">" always evaluates to 'false'
              Zero(new_body, type_details->body_size, char);
              ^

"../../../../sv_inline.h", line 468: warning #4276-D: relational operator ">" always evaluates to 'false'
              Zero(new_body, type_details->body_size, char);
              ^

# Connected to 127.0.0.1
# Connected to 127.0.0.1
Redefining sub xChild::foo at xChild--18120 line 2.
Redefining sub Data::ok at -e line 1.
"XSTest.c", line 249: warning #2111-D: statement is unreachable
  	PUTBACK;
  	^

"/pro/3gl/CPAN/perl-current/sv_inline.h", line 468: warning #4276-D: relational operator ">" always evaluates to 'false'
              Zero(new_body, type_details->body_size, char);
              ^

c++: error: +Z: No such file or directory
c++: error: +O2: No such file or directory
c++: error: +Onolimit: No such file or directory
"/pro/3gl/CPAN/perl-current/sv_inline.h", line 468: warning #4276-D: relational operator ">" always evaluates to 'false'
              Zero(new_body, type_details->body_size, char);
              ^

"XSMore.xs", line 48: warning #4276-D: relational operator ">" always evaluates to 'false'
     Newx(*c, lenc+1, char);
     ^

"XSMore.xs", line 63: warning #4276-D: relational operator ">" always evaluates to 'false'
     Newx(*c, lenc+1, char);
     ^

"/pro/3gl/CPAN/perl-current/sv_inline.h", line 468: warning #4276-D: relational operator ">" always evaluates to 'false'
              Zero(new_body, type_details->body_size, char);
              ^

Subroutine Time::HiRes::constant redefined at (eval 37) line 1.
Subroutine Time::HiRes::usleep redefined at (eval 37) line 1.
Subroutine Time::HiRes::nanosleep redefined at (eval 37) line 1.
Subroutine Time::HiRes::sleep redefined at (eval 37) line 1.
Subroutine Time::HiRes::ualarm redefined at (eval 37) line 1.
Subroutine Time::HiRes::alarm redefined at (eval 37) line 1.
Subroutine Time::HiRes::gettimeofday redefined at (eval 37) line 1.
Subroutine Time::HiRes::time redefined at (eval 37) line 1.
Subroutine Time::HiRes::setitimer redefined at (eval 37) line 1.
Subroutine Time::HiRes::getitimer redefined at (eval 37) line 1.
Subroutine Time::HiRes::utime redefined at (eval 37) line 1.
Subroutine Time::HiRes::clock_gettime redefined at (eval 37) line 1.
Subroutine Time::HiRes::clock_getres redefined at (eval 37) line 1.
Subroutine Time::HiRes::clock_nanosleep redefined at (eval 37) line 1.
Subroutine Time::HiRes::clock redefined at (eval 37) line 1.
Subroutine Time::HiRes::lstat redefined at (eval 37) line 1.
Subroutine Time::HiRes::stat redefined at (eval 37) line 1.
"../sv_inline.h", line 468: warning #4276-D: relational operator ">" always evaluates to 'false'
              Zero(new_body, type_details->body_size, char);
              ^

cc: warning 983: The -lc library specified on the command line is also added automatically by the compiler driver.  
# Failed test 1704 - sprintf( "%.54g", 0.3 ) renders correctly at op/sprintf2.t line 1197
#      got "0.299999999999999988897769753748434596"
# expected eq "0.299999999999999988897769753748434595763683319091796875"
make: *** [test_harness] Error 1

error while running harness target 'test_harness': 2 at /pro/3gl/CPAN/smoke/lib/Test/Smoke/App/RunSmoke.pm line 118.
[2022-05-21 02:54:12+0200] 
[2022-05-21 02:54:12+0200] ../dist/Net-Ping/t/450_service.t............................PASSED
[2022-05-21 02:54:12+0200]     9, 18
[2022-05-21 02:54:12+0200] ../t/op/sprintf2.t..........................................FAILED
[2022-05-21 02:54:12+0200]     1704
[2022-05-21 02:54:12+0200] ../t/re/reg_mesg.t..........................................FAILED
[2022-05-21 02:54:12+0200]     No plan found in TAP output
[2022-05-21 02:54:12+0200] ../t/re/regex_sets.t........................................FAILED
[2022-05-21 02:54:12+0200]     No plan found in TAP output
[2022-05-21 02:54:12+0200] Archived results...
[2022-05-21 02:54:12+0200] TSTENV = perlio	
"../../../../sv_inline.h", line 468: warning #4276-D: relational operator ">" always evaluates to 'false'
              Zero(new_body, type_details->body_size, char);
              ^

"../../../../sv_inline.h", line 468: warning #4276-D: relational operator ">" always evaluates to 'false'
              Zero(new_body, type_details->body_size, char);
              ^

"../../../../sv_inline.h", line 468: warning #4276-D: relational operator ">" always evaluates to 'false'
              Zero(new_body, type_details->body_size, char);
              ^

"../../../../sv_inline.h", line 468: warning #4276-D: relational operator ">" always evaluates to 'false'
              Zero(new_body, type_details->body_size, char);
              ^

"../../../../sv_inline.h", line 468: warning #4276-D: relational operator ">" always evaluates to 'false'
              Zero(new_body, type_details->body_size, char);
              ^

"../../../../sv_inline.h", line 468: warning #4276-D: relational operator ">" always evaluates to 'false'
              Zero(new_body, type_details->body_size, char);
              ^

"../../../../sv_inline.h", line 468: warning #4276-D: relational operator ">" always evaluates to 'false'
              Zero(new_body, type_details->body_size, char);
              ^

"XSTest.c", line 249: warning #2111-D: statement is unreachable
  	PUTBACK;
  	^

"/pro/3gl/CPAN/perl-current/sv_inline.h", line 468: warning #4276-D: relational operator ">" always evaluates to 'false'
              Zero(new_body, type_details->body_size, char);
              ^

"/pro/3gl/CPAN/perl-current/sv_inline.h", line 468: warning #4276-D: relational operator ">" always evaluates to 'false'
              Zero(new_body, type_details->body_size, char);
              ^

"XSMore.xs", line 48: warning #4276-D: relational operator ">" always evaluates to 'false'
     Newx(*c, lenc+1, char);
     ^

"XSMore.xs", line 63: warning #4276-D: relational operator ">" always evaluates to 'false'
     Newx(*c, lenc+1, char);
     ^

"/pro/3gl/CPAN/perl-current/sv_inline.h", line 468: warning #4276-D: relational operator ">" always evaluates to 'false'
              Zero(new_body, type_details->body_size, char);
              ^

c++: error: +Z: No such file or directory
c++: error: +O2: No such file or directory
c++: error: +Onolimit: No such file or directory
# 
# 
# Compress::Raw::Zlib::VERSION        2.105
# 
# ZLIB_VERSION (from zlib.h)          1.2.12
# zlib_version (from zlib library)    1.2.12
# 
# ZLIB_VERNUM                         0x12C0
# BUILD_ZLIB                          1
# GZIP_OS_CODE                        3
# 
# zlibCompileFlags                    169
#   Type Sizes
#     size of uInt                    32 bit
#     size of uLong                   64 bit
#     size of pointer                 64 bit
#     size of z_off_t                 64 bit
#   Compiler Options                  None
#   One-time table building           None
#   Library content                   None
#   Operation variations              None
# 
"../sv_inline.h", line 468: warning #4276-D: relational operator ">" always evaluates to 'false'
              Zero(new_body, type_details->body_size, char);
              ^

cc: warning 983: The -lc library specified on the command line is also added automatically by the compiler driver.  
# Failed test 1704 - sprintf( "%.54g", 0.3 ) renders correctly at op/sprintf2.t line 1197
#      got "0.299999999999999988897769753748434596"
# expected eq "0.299999999999999988897769753748434595763683319091796875"
# Connected to 127.0.0.1
# Connected to 127.0.0.1
Subroutine Time::HiRes::constant redefined at (eval 37) line 1.
Subroutine Time::HiRes::usleep redefined at (eval 37) line 1.
Subroutine Time::HiRes::nanosleep redefined at (eval 37) line 1.
Subroutine Time::HiRes::sleep redefined at (eval 37) line 1.
Subroutine Time::HiRes::ualarm redefined at (eval 37) line 1.
Subroutine Time::HiRes::alarm redefined at (eval 37) line 1.
Subroutine Time::HiRes::gettimeofday redefined at (eval 37) line 1.
Subroutine Time::HiRes::time redefined at (eval 37) line 1.
Subroutine Time::HiRes::setitimer redefined at (eval 37) line 1.
Subroutine Time::HiRes::getitimer redefined at (eval 37) line 1.
Subroutine Time::HiRes::utime redefined at (eval 37) line 1.
Subroutine Time::HiRes::clock_gettime redefined at (eval 37) line 1.
Subroutine Time::HiRes::clock_getres redefined at (eval 37) line 1.
Subroutine Time::HiRes::clock_nanosleep redefined at (eval 37) line 1.
Subroutine Time::HiRes::clock redefined at (eval 37) line 1.
Subroutine Time::HiRes::lstat redefined at (eval 37) line 1.
Subroutine Time::HiRes::stat redefined at (eval 37) line 1.
Cannot figure out an encoding to use at t/use-Encode-Alias.t line 5.
make: *** [test_harness] Error 1

error while running harness target 'test_harness': 2 at /pro/3gl/CPAN/smoke/lib/Test/Smoke/App/RunSmoke.pm line 118.
[2022-05-21 03:10:51+0200] 
[2022-05-21 03:10:51+0200] ../dist/Net-Ping/t/450_service.t............................PASSED
[2022-05-21 03:10:51+0200]     9, 18
[2022-05-21 03:10:51+0200] ../t/op/sprintf2.t..........................................FAILED
[2022-05-21 03:10:51+0200]     1704
[2022-05-21 03:10:51+0200] ../t/re/regex_sets.t........................................FAILED
[2022-05-21 03:10:51+0200]     No plan found in TAP output
[2022-05-21 03:10:51+0200] ../t/re/reg_mesg.t..........................................FAILED
[2022-05-21 03:10:51+0200]     No plan found in TAP output
[2022-05-21 03:10:51+0200] Archived results...
[2022-05-21 03:10:51+0200] TSTENV = locale:en_US.utf8	
"../../../../sv_inline.h", line 468: warning #4276-D: relational operator ">" always evaluates to 'false'
              Zero(new_body, type_details->body_size, char);
              ^

"../../../../sv_inline.h", line 468: warning #4276-D: relational operator ">" always evaluates to 'false'
              Zero(new_body, type_details->body_size, char);
              ^

"../../../../sv_inline.h", line 468: warning #4276-D: relational operator ">" always evaluates to 'false'
              Zero(new_body, type_details->body_size, char);
              ^

"../../../../sv_inline.h", line 468: warning #4276-D: relational operator ">" always evaluates to 'false'
              Zero(new_body, type_details->body_size, char);
              ^

"../../../../sv_inline.h", line 468: warning #4276-D: relational operator ">" always evaluates to 'false'
              Zero(new_body, type_details->body_size, char);
              ^

"../../../../sv_inline.h", line 468: warning #4276-D: relational operator ">" always evaluates to 'false'
              Zero(new_body, type_details->body_size, char);
              ^

"../../../../sv_inline.h", line 468: warning #4276-D: relational operator ">" always evaluates to 'false'
              Zero(new_body, type_details->body_size, char);
              ^

"XSTest.c", line 249: warning #2111-D: statement is unreachable
  	PUTBACK;
  	^

"/pro/3gl/CPAN/perl-current/sv_inline.h", line 468: warning #4276-D: relational operator ">" always evaluates to 'false'
              Zero(new_body, type_details->body_size, char);
              ^

"/pro/3gl/CPAN/perl-current/sv_inline.h", line 468: warning #4276-D: relational operator ">" always evaluates to 'false'
              Zero(new_body, type_details->body_size, char);
              ^

"XSMore.xs", line 48: warning #4276-D: relational operator ">" always evaluates to 'false'
     Newx(*c, lenc+1, char);
     ^

"XSMore.xs", line 63: warning #4276-D: relational operator ">" always evaluates to 'false'
     Newx(*c, lenc+1, char);
     ^

"/pro/3gl/CPAN/perl-current/sv_inline.h", line 468: warning #4276-D: relational operator ">" always evaluates to 'false'
              Zero(new_body, type_details->body_size, char);
              ^

c++: error: +Z: No such file or directory
c++: error: +O2: No such file or directory
c++: error: +Onolimit: No such file or directory
# 
# 
# Compress::Raw::Zlib::VERSION        2.105
# 
# ZLIB_VERSION (from zlib.h)          1.2.12
# zlib_version (from zlib library)    1.2.12
# 
# ZLIB_VERNUM                         0x12C0
# BUILD_ZLIB                          1
# GZIP_OS_CODE                        3
# 
# zlibCompileFlags                    169
#   Type Sizes
#     size of uInt                    32 bit
#     size of uLong                   64 bit
#     size of pointer                 64 bit
#     size of z_off_t                 64 bit
#   Compiler Options                  None
#   One-time table building           None
#   Library content                   None
#   Operation variations              None
# 
"../sv_inline.h", line 468: warning #4276-D: relational operator ">" always evaluates to 'false'
              Zero(new_body, type_details->body_size, char);
              ^

cc: warning 983: The -lc library specified on the command line is also added automatically by the compiler driver.  
# Failed test 1704 - sprintf( "%.54g", 0.3 ) renders correctly at op/sprintf2.t line 1197
#      got "0.299999999999999988897769753748434596"
# expected eq "0.299999999999999988897769753748434595763683319091796875"
Subroutine Time::HiRes::constant redefined at (eval 37) line 1.
Subroutine Time::HiRes::usleep redefined at (eval 37) line 1.
Subroutine Time::HiRes::nanosleep redefined at (eval 37) line 1.
Subroutine Time::HiRes::sleep redefined at (eval 37) line 1.
Subroutine Time::HiRes::ualarm redefined at (eval 37) line 1.
Subroutine Time::HiRes::alarm redefined at (eval 37) line 1.
Subroutine Time::HiRes::gettimeofday redefined at (eval 37) line 1.
Subroutine Time::HiRes::time redefined at (eval 37) line 1.
Subroutine Time::HiRes::setitimer redefined at (eval 37) line 1.
Subroutine Time::HiRes::getitimer redefined at (eval 37) line 1.
Subroutine Time::HiRes::utime redefined at (eval 37) line 1.
Subroutine Time::HiRes::clock_gettime redefined at (eval 37) line 1.
Subroutine Time::HiRes::clock_getres redefined at (eval 37) line 1.
Subroutine Time::HiRes::clock_nanosleep redefined at (eval 37) line 1.
Subroutine Time::HiRes::clock redefined at (eval 37) line 1.
Subroutine Time::HiRes::lstat redefined at (eval 37) line 1.
Subroutine Time::HiRes::stat redefined at (eval 37) line 1.
# Connected to 127.0.0.1
# Connected to 127.0.0.1
make: *** [test_harness] Error 1

error while running harness target 'test_harness': 2 at /pro/3gl/CPAN/smoke/lib/Test/Smoke/App/RunSmoke.pm line 118.
[2022-05-21 03:27:41+0200] 
[2022-05-21 03:27:41+0200] ../dist/Net-Ping/t/450_service.t............................PASSED
[2022-05-21 03:27:41+0200]     9, 18
[2022-05-21 03:27:41+0200] ../t/op/sprintf2.t..........................................FAILED
[2022-05-21 03:27:41+0200]     1704
[2022-05-21 03:27:41+0200] ../t/re/reg_mesg.t..........................................FAILED
[2022-05-21 03:27:41+0200]     No plan found in TAP output
[2022-05-21 03:27:41+0200] ../t/re/regex_sets.t........................................FAILED
[2022-05-21 03:27:41+0200]     No plan found in TAP output
[2022-05-21 03:27:41+0200] Archived results...
[2022-05-21 03:27:41+0200] Unskip tests from '/pro/3gl/CPAN/smoke/p59.skip'
[2022-05-21 03:27:41+0200] 
[2022-05-21 03:27:41+0200] Configuration: -Dusedevel -Duseithreads
[2022-05-21 03:27:41+0200] ------------------------------------------------------------------------------
[2022-05-21 03:27:41+0200] make distclean ...
[2022-05-21 03:28:25+0200] 
[2022-05-21 03:28:25+0200] Copy Policy.sh ...
[2022-05-21 03:28:25+0200] 
[2022-05-21 03:28:25+0200] Configure ...
[2022-05-21 03:30:04+0200] 
[2022-05-21 03:30:04+0200] make ...
[2022-05-21 03:48:10+0200] Skip tests from '/pro/3gl/CPAN/smoke/p59.skip'
[2022-05-21 03:48:10+0200] 	cpan/Sys-Syslog/t/syslog.t
[2022-05-21 03:48:10+0200] 
[2022-05-21 03:48:10+0200]  Tests start here:
[2022-05-21 03:48:10+0200] TSTENV = stdio	
No saved state, selection will be empty
# 
# 
# Compress::Raw::Zlib::VERSION        2.105
# 
# ZLIB_VERSION (from zlib.h)          1.2.12
# zlib_version (from zlib library)    1.2.12
# 
# ZLIB_VERNUM                         0x12C0
# BUILD_ZLIB                          1
# GZIP_OS_CODE                        3
# 
# zlibCompileFlags                    85
#   Type Sizes
#     size of uInt                    32 bit
#     size of uLong                   32 bit
#     size of pointer                 32 bit
#     size of z_off_t                 32 bit
#   Compiler Options                  None
#   One-time table building           None
#   Library content                   None
#   Operation variations              None
# 
Cannot figure out an encoding to use at t/use-Encode-Alias.t line 5.
"../../../../sv_inline.h", line 487: warning #4232-D: conversion from "XPVIO *" to a more strictly aligned type "XPVMG *" may cause misaligned access
              SvSTASH_set(io, MUTABLE_HV(SvREFCNT_inc(GvHV(iogv))));
              ^

"../../../../sv_inline.h", line 468: warning #4276-D: relational operator ">" always evaluates to 'false'
              Zero(new_body, type_details->body_size, char);
              ^

"../../../../sv_inline.h", line 487: warning #4232-D: conversion from "XPVIO *" to a more strictly aligned type "XPVMG *" may cause misaligned access
              SvSTASH_set(io, MUTABLE_HV(SvREFCNT_inc(GvHV(iogv))));
              ^

"../../../../sv_inline.h", line 468: warning #4276-D: relational operator ">" always evaluates to 'false'
              Zero(new_body, type_details->body_size, char);
              ^

"../../../../sv_inline.h", line 487: warning #4232-D: conversion from "XPVIO *" to a more strictly aligned type "XPVMG *" may cause misaligned access
              SvSTASH_set(io, MUTABLE_HV(SvREFCNT_inc(GvHV(iogv))));
              ^

"../../../../sv_inline.h", line 468: warning #4276-D: relational operator ">" always evaluates to 'false'
              Zero(new_body, type_details->body_size, char);
              ^

"../../../../sv_inline.h", line 487: warning #4232-D: conversion from "XPVIO *" to a more strictly aligned type "XPVMG *" may cause misaligned access
              SvSTASH_set(io, MUTABLE_HV(SvREFCNT_inc(GvHV(iogv))));
              ^

"../../../../sv_inline.h", line 468: warning #4276-D: relational operator ">" always evaluates to 'false'
              Zero(new_body, type_details->body_size, char);
              ^

"../../../../sv_inline.h", line 487: warning #4232-D: conversion from "XPVIO *" to a more strictly aligned type "XPVMG *" may cause misaligned access
              SvSTASH_set(io, MUTABLE_HV(SvREFCNT_inc(GvHV(iogv))));
              ^

"../../../../sv_inline.h", line 468: warning #4276-D: relational operator ">" always evaluates to 'false'
              Zero(new_body, type_details->body_size, char);
              ^

"../../../../sv_inline.h", line 487: warning #4232-D: conversion from "XPVIO *" to a more strictly aligned type "XPVMG *" may cause misaligned access
              SvSTASH_set(io, MUTABLE_HV(SvREFCNT_inc(GvHV(iogv))));
              ^

"../../../../sv_inline.h", line 468: warning #4276-D: relational operator ">" always evaluates to 'false'
              Zero(new_body, type_details->body_size, char);
              ^

"../../../../sv_inline.h", line 487: warning #4232-D: conversion from "XPVIO *" to a more strictly aligned type "XPVMG *" may cause misaligned access
              SvSTASH_set(io, MUTABLE_HV(SvREFCNT_inc(GvHV(iogv))));
              ^

"../../../../sv_inline.h", line 468: warning #4276-D: relational operator ">" always evaluates to 'false'
              Zero(new_body, type_details->body_size, char);
              ^

# Connected to 127.0.0.1
# Connected to 127.0.0.1
Integer overflow in hexadecimal number at t/broken_univ_can.t line 13.
Redefining sub xChild::foo at xChild--26521 line 2.
Redefining sub Data::ok at -e line 1.
"/pro/3gl/CPAN/perl-current/sv_inline.h", line 487: warning #4232-D: conversion from "XPVIO *" to a more strictly aligned type "XPVMG *" may cause misaligned access
              SvSTASH_set(io, MUTABLE_HV(SvREFCNT_inc(GvHV(iogv))));
              ^

"XSTest.c", line 249: warning #2111-D: statement is unreachable
  	PUTBACK;
  	^

"/pro/3gl/CPAN/perl-current/sv_inline.h", line 468: warning #4276-D: relational operator ">" always evaluates to 'false'
              Zero(new_body, type_details->body_size, char);
              ^

c++: error: +Z: No such file or directory
c++: error: +O2: No such file or directory
c++: error: +Onolimit: No such file or directory
"/pro/3gl/CPAN/perl-current/sv_inline.h", line 487: warning #4232-D: conversion from "XPVIO *" to a more strictly aligned type "XPVMG *" may cause misaligned access
              SvSTASH_set(io, MUTABLE_HV(SvREFCNT_inc(GvHV(iogv))));
              ^

"/pro/3gl/CPAN/perl-current/sv_inline.h", line 468: warning #4276-D: relational operator ">" always evaluates to 'false'
              Zero(new_body, type_details->body_size, char);
              ^

"XSMore.xs", line 48: warning #4276-D: relational operator ">" always evaluates to 'false'
     Newx(*c, lenc+1, char);
     ^

"XSMore.xs", line 63: warning #4276-D: relational operator ">" always evaluates to 'false'
     Newx(*c, lenc+1, char);
     ^

"/pro/3gl/CPAN/perl-current/sv_inline.h", line 487: warning #4232-D: conversion from "XPVIO *" to a more strictly aligned type "XPVMG *" may cause misaligned access
              SvSTASH_set(io, MUTABLE_HV(SvREFCNT_inc(GvHV(iogv))));
              ^

"/pro/3gl/CPAN/perl-current/sv_inline.h", line 468: warning #4276-D: relational operator ">" always evaluates to 'false'
              Zero(new_body, type_details->body_size, char);
              ^

Subroutine Time::HiRes::constant redefined at (eval 37) line 1.
Subroutine Time::HiRes::usleep redefined at (eval 37) line 1.
Subroutine Time::HiRes::nanosleep redefined at (eval 37) line 1.
Subroutine Time::HiRes::sleep redefined at (eval 37) line 1.
Subroutine Time::HiRes::ualarm redefined at (eval 37) line 1.
Subroutine Time::HiRes::alarm redefined at (eval 37) line 1.
Subroutine Time::HiRes::gettimeofday redefined at (eval 37) line 1.
Subroutine Time::HiRes::time redefined at (eval 37) line 1.
Subroutine Time::HiRes::setitimer redefined at (eval 37) line 1.
Subroutine Time::HiRes::getitimer redefined at (eval 37) line 1.
Subroutine Time::HiRes::utime redefined at (eval 37) line 1.
Subroutine Time::HiRes::clock_gettime redefined at (eval 37) line 1.
Subroutine Time::HiRes::clock_getres redefined at (eval 37) line 1.
Subroutine Time::HiRes::clock_nanosleep redefined at (eval 37) line 1.
Subroutine Time::HiRes::clock redefined at (eval 37) line 1.
Subroutine Time::HiRes::lstat redefined at (eval 37) line 1.
Subroutine Time::HiRes::stat redefined at (eval 37) line 1.
"../sv_inline.h", line 487: warning #4232-D: conversion from "XPVIO *" to a more strictly aligned type "XPVMG *" may cause misaligned access
              SvSTASH_set(io, MUTABLE_HV(SvREFCNT_inc(GvHV(iogv))));
              ^

"../sv_inline.h", line 468: warning #4276-D: relational operator ">" always evaluates to 'false'
              Zero(new_body, type_details->body_size, char);
              ^

cc: warning 983: The -lc library specified on the command line is also added automatically by the compiler driver.  
# Failed test 1701 - sprintf( "%.54g", 0.3 ) renders correctly at op/sprintf2.t line 1197
#      got "0.299999999999999988897769753748434596"
# expected eq "0.299999999999999988897769753748434595763683319091796875"
make: *** [test_harness] Error 1

error while running harness target 'test_harness': 2 at /pro/3gl/CPAN/smoke/lib/Test/Smoke/App/RunSmoke.pm line 118.
[2022-05-21 04:06:35+0200] 
[2022-05-21 04:06:35+0200] ../dist/Net-Ping/t/450_service.t............................PASSED
[2022-05-21 04:06:35+0200]     9, 18
[2022-05-21 04:06:35+0200] ../t/op/sprintf2.t..........................................FAILED
[2022-05-21 04:06:35+0200]     1701
[2022-05-21 04:06:35+0200] Archived results...
[2022-05-21 04:06:35+0200] TSTENV = perlio	
"../../../../sv_inline.h", line 487: warning #4232-D: conversion from "XPVIO *" to a more strictly aligned type "XPVMG *" may cause misaligned access
              SvSTASH_set(io, MUTABLE_HV(SvREFCNT_inc(GvHV(iogv))));
              ^

"../../../../sv_inline.h", line 468: warning #4276-D: relational operator ">" always evaluates to 'false'
              Zero(new_body, type_details->body_size, char);
              ^

"../../../../sv_inline.h", line 487: warning #4232-D: conversion from "XPVIO *" to a more strictly aligned type "XPVMG *" may cause misaligned access
              SvSTASH_set(io, MUTABLE_HV(SvREFCNT_inc(GvHV(iogv))));
              ^

"../../../../sv_inline.h", line 468: warning #4276-D: relational operator ">" always evaluates to 'false'
              Zero(new_body, type_details->body_size, char);
              ^

"../../../../sv_inline.h", line 487: warning #4232-D: conversion from "XPVIO *" to a more strictly aligned type "XPVMG *" may cause misaligned access
              SvSTASH_set(io, MUTABLE_HV(SvREFCNT_inc(GvHV(iogv))));
              ^

"../../../../sv_inline.h", line 468: warning #4276-D: relational operator ">" always evaluates to 'false'
              Zero(new_body, type_details->body_size, char);
              ^

"../../../../sv_inline.h", line 487: warning #4232-D: conversion from "XPVIO *" to a more strictly aligned type "XPVMG *" may cause misaligned access
              SvSTASH_set(io, MUTABLE_HV(SvREFCNT_inc(GvHV(iogv))));
              ^

"../../../../sv_inline.h", line 468: warning #4276-D: relational operator ">" always evaluates to 'false'
              Zero(new_body, type_details->body_size, char);
              ^

"../../../../sv_inline.h", line 487: warning #4232-D: conversion from "XPVIO *" to a more strictly aligned type "XPVMG *" may cause misaligned access
              SvSTASH_set(io, MUTABLE_HV(SvREFCNT_inc(GvHV(iogv))));
              ^

"../../../../sv_inline.h", line 468: warning #4276-D: relational operator ">" always evaluates to 'false'
              Zero(new_body, type_details->body_size, char);
              ^

"../../../../sv_inline.h", line 487: warning #4232-D: conversion from "XPVIO *" to a more strictly aligned type "XPVMG *" may cause misaligned access
              SvSTASH_set(io, MUTABLE_HV(SvREFCNT_inc(GvHV(iogv))));
              ^

"../../../../sv_inline.h", line 468: warning #4276-D: relational operator ">" always evaluates to 'false'
              Zero(new_body, type_details->body_size, char);
              ^

"../../../../sv_inline.h", line 487: warning #4232-D: conversion from "XPVIO *" to a more strictly aligned type "XPVMG *" may cause misaligned access
              SvSTASH_set(io, MUTABLE_HV(SvREFCNT_inc(GvHV(iogv))));
              ^

"../../../../sv_inline.h", line 468: warning #4276-D: relational operator ">" always evaluates to 'false'
              Zero(new_body, type_details->body_size, char);
              ^

"/pro/3gl/CPAN/perl-current/sv_inline.h", line 487: warning #4232-D: conversion from "XPVIO *" to a more strictly aligned type "XPVMG *" may cause misaligned access
              SvSTASH_set(io, MUTABLE_HV(SvREFCNT_inc(GvHV(iogv))));
              ^

"XSTest.c", line 249: warning #2111-D: statement is unreachable
  	PUTBACK;
  	^

"/pro/3gl/CPAN/perl-current/sv_inline.h", line 468: warning #4276-D: relational operator ">" always evaluates to 'false'
              Zero(new_body, type_details->body_size, char);
              ^

"/pro/3gl/CPAN/perl-current/sv_inline.h", line 487: warning #4232-D: conversion from "XPVIO *" to a more strictly aligned type "XPVMG *" may cause misaligned access
              SvSTASH_set(io, MUTABLE_HV(SvREFCNT_inc(GvHV(iogv))));
              ^

"/pro/3gl/CPAN/perl-current/sv_inline.h", line 468: warning #4276-D: relational operator ">" always evaluates to 'false'
              Zero(new_body, type_details->body_size, char);
              ^

"XSMore.xs", line 48: warning #4276-D: relational operator ">" always evaluates to 'false'
     Newx(*c, lenc+1, char);
     ^

"XSMore.xs", line 63: warning #4276-D: relational operator ">" always evaluates to 'false'
     Newx(*c, lenc+1, char);
     ^

"/pro/3gl/CPAN/perl-current/sv_inline.h", line 487: warning #4232-D: conversion from "XPVIO *" to a more strictly aligned type "XPVMG *" may cause misaligned access
              SvSTASH_set(io, MUTABLE_HV(SvREFCNT_inc(GvHV(iogv))));
              ^

"/pro/3gl/CPAN/perl-current/sv_inline.h", line 468: warning #4276-D: relational operator ">" always evaluates to 'false'
              Zero(new_body, type_details->body_size, char);
              ^

c++: error: +Z: No such file or directory
c++: error: +O2: No such file or directory
c++: error: +Onolimit: No such file or directory
# 
# 
# Compress::Raw::Zlib::VERSION        2.105
# 
# ZLIB_VERSION (from zlib.h)          1.2.12
# zlib_version (from zlib library)    1.2.12
# 
# ZLIB_VERNUM                         0x12C0
# BUILD_ZLIB                          1
# GZIP_OS_CODE                        3
# 
# zlibCompileFlags                    85
#   Type Sizes
#     size of uInt                    32 bit
#     size of uLong                   32 bit
#     size of pointer                 32 bit
#     size of z_off_t                 32 bit
#   Compiler Options                  None
#   One-time table building           None
#   Library content                   None
#   Operation variations              None
# 
"../sv_inline.h", line 487: warning #4232-D: conversion from "XPVIO *" to a more strictly aligned type "XPVMG *" may cause misaligned access
              SvSTASH_set(io, MUTABLE_HV(SvREFCNT_inc(GvHV(iogv))));
              ^

"../sv_inline.h", line 468: warning #4276-D: relational operator ">" always evaluates to 'false'
              Zero(new_body, type_details->body_size, char);
              ^

cc: warning 983: The -lc library specified on the command line is also added automatically by the compiler driver.  
# Failed test 1701 - sprintf( "%.54g", 0.3 ) renders correctly at op/sprintf2.t line 1197
#      got "0.299999999999999988897769753748434596"
# expected eq "0.299999999999999988897769753748434595763683319091796875"
# Connected to 127.0.0.1
# Connected to 127.0.0.1
Subroutine Time::HiRes::constant redefined at (eval 37) line 1.
Subroutine Time::HiRes::usleep redefined at (eval 37) line 1.
Subroutine Time::HiRes::nanosleep redefined at (eval 37) line 1.
Subroutine Time::HiRes::sleep redefined at (eval 37) line 1.
Subroutine Time::HiRes::ualarm redefined at (eval 37) line 1.
Subroutine Time::HiRes::alarm redefined at (eval 37) line 1.
Subroutine Time::HiRes::gettimeofday redefined at (eval 37) line 1.
Subroutine Time::HiRes::time redefined at (eval 37) line 1.
Subroutine Time::HiRes::setitimer redefined at (eval 37) line 1.
Subroutine Time::HiRes::getitimer redefined at (eval 37) line 1.
Subroutine Time::HiRes::utime redefined at (eval 37) line 1.
Subroutine Time::HiRes::clock_gettime redefined at (eval 37) line 1.
Subroutine Time::HiRes::clock_getres redefined at (eval 37) line 1.
Subroutine Time::HiRes::clock_nanosleep redefined at (eval 37) line 1.
Subroutine Time::HiRes::clock redefined at (eval 37) line 1.
Subroutine Time::HiRes::lstat redefined at (eval 37) line 1.
Subroutine Time::HiRes::stat redefined at (eval 37) line 1.
Cannot figure out an encoding to use at t/use-Encode-Alias.t line 5.
Integer overflow in hexadecimal number at t/broken_univ_can.t line 13.
make: *** [test_harness] Error 1

error while running harness target 'test_harness': 2 at /pro/3gl/CPAN/smoke/lib/Test/Smoke/App/RunSmoke.pm line 118.
[2022-05-21 04:22:22+0200] 
[2022-05-21 04:22:22+0200] ../dist/Net-Ping/t/450_service.t............................PASSED
[2022-05-21 04:22:22+0200]     9, 18
[2022-05-21 04:22:22+0200] ../t/op/sprintf2.t..........................................FAILED
[2022-05-21 04:22:22+0200]     1701
[2022-05-21 04:22:22+0200] Archived results...
[2022-05-21 04:22:22+0200] TSTENV = locale:en_US.utf8	
"../../../../sv_inline.h", line 487: warning #4232-D: conversion from "XPVIO *" to a more strictly aligned type "XPVMG *" may cause misaligned access
              SvSTASH_set(io, MUTABLE_HV(SvREFCNT_inc(GvHV(iogv))));
              ^

"../../../../sv_inline.h", line 468: warning #4276-D: relational operator ">" always evaluates to 'false'
              Zero(new_body, type_details->body_size, char);
              ^

"../../../../sv_inline.h", line 487: warning #4232-D: conversion from "XPVIO *" to a more strictly aligned type "XPVMG *" may cause misaligned access
              SvSTASH_set(io, MUTABLE_HV(SvREFCNT_inc(GvHV(iogv))));
              ^

"../../../../sv_inline.h", line 468: warning #4276-D: relational operator ">" always evaluates to 'false'
              Zero(new_body, type_details->body_size, char);
              ^

"../../../../sv_inline.h", line 487: warning #4232-D: conversion from "XPVIO *" to a more strictly aligned type "XPVMG *" may cause misaligned access
              SvSTASH_set(io, MUTABLE_HV(SvREFCNT_inc(GvHV(iogv))));
              ^

"../../../../sv_inline.h", line 468: warning #4276-D: relational operator ">" always evaluates to 'false'
              Zero(new_body, type_details->body_size, char);
              ^

"../../../../sv_inline.h", line 487: warning #4232-D: conversion from "XPVIO *" to a more strictly aligned type "XPVMG *" may cause misaligned access
              SvSTASH_set(io, MUTABLE_HV(SvREFCNT_inc(GvHV(iogv))));
              ^

"../../../../sv_inline.h", line 468: warning #4276-D: relational operator ">" always evaluates to 'false'
              Zero(new_body, type_details->body_size, char);
              ^

"../../../../sv_inline.h", line 487: warning #4232-D: conversion from "XPVIO *" to a more strictly aligned type "XPVMG *" may cause misaligned access
              SvSTASH_set(io, MUTABLE_HV(SvREFCNT_inc(GvHV(iogv))));
              ^

"../../../../sv_inline.h", line 468: warning #4276-D: relational operator ">" always evaluates to 'false'
              Zero(new_body, type_details->body_size, char);
              ^

"../../../../sv_inline.h", line 487: warning #4232-D: conversion from "XPVIO *" to a more strictly aligned type "XPVMG *" may cause misaligned access
              SvSTASH_set(io, MUTABLE_HV(SvREFCNT_inc(GvHV(iogv))));
              ^

"../../../../sv_inline.h", line 468: warning #4276-D: relational operator ">" always evaluates to 'false'
              Zero(new_body, type_details->body_size, char);
              ^

"../../../../sv_inline.h", line 487: warning #4232-D: conversion from "XPVIO *" to a more strictly aligned type "XPVMG *" may cause misaligned access
              SvSTASH_set(io, MUTABLE_HV(SvREFCNT_inc(GvHV(iogv))));
              ^

"../../../../sv_inline.h", line 468: warning #4276-D: relational operator ">" always evaluates to 'false'
              Zero(new_body, type_details->body_size, char);
              ^

"/pro/3gl/CPAN/perl-current/sv_inline.h", line 487: warning #4232-D: conversion from "XPVIO *" to a more strictly aligned type "XPVMG *" may cause misaligned access
              SvSTASH_set(io, MUTABLE_HV(SvREFCNT_inc(GvHV(iogv))));
              ^

"XSTest.c", line 249: warning #2111-D: statement is unreachable
  	PUTBACK;
  	^

"/pro/3gl/CPAN/perl-current/sv_inline.h", line 468: warning #4276-D: relational operator ">" always evaluates to 'false'
              Zero(new_body, type_details->body_size, char);
              ^

"/pro/3gl/CPAN/perl-current/sv_inline.h", line 487: warning #4232-D: conversion from "XPVIO *" to a more strictly aligned type "XPVMG *" may cause misaligned access
              SvSTASH_set(io, MUTABLE_HV(SvREFCNT_inc(GvHV(iogv))));
              ^

"/pro/3gl/CPAN/perl-current/sv_inline.h", line 468: warning #4276-D: relational operator ">" always evaluates to 'false'
              Zero(new_body, type_details->body_size, char);
              ^

"XSMore.xs", line 48: warning #4276-D: relational operator ">" always evaluates to 'false'
     Newx(*c, lenc+1, char);
     ^

"XSMore.xs", line 63: warning #4276-D: relational operator ">" always evaluates to 'false'
     Newx(*c, lenc+1, char);
     ^

"/pro/3gl/CPAN/perl-current/sv_inline.h", line 487: warning #4232-D: conversion from "XPVIO *" to a more strictly aligned type "XPVMG *" may cause misaligned access
              SvSTASH_set(io, MUTABLE_HV(SvREFCNT_inc(GvHV(iogv))));
              ^

"/pro/3gl/CPAN/perl-current/sv_inline.h", line 468: warning #4276-D: relational operator ">" always evaluates to 'false'
              Zero(new_body, type_details->body_size, char);
              ^

c++: error: +Z: No such file or directory
c++: error: +O2: No such file or directory
c++: error: +Onolimit: No such file or directory
# 
# 
# Compress::Raw::Zlib::VERSION        2.105
# 
# ZLIB_VERSION (from zlib.h)          1.2.12
# zlib_version (from zlib library)    1.2.12
# 
# ZLIB_VERNUM                         0x12C0
# BUILD_ZLIB                          1
# GZIP_OS_CODE                        3
# 
# zlibCompileFlags                    85
#   Type Sizes
#     size of uInt                    32 bit
#     size of uLong                   32 bit
#     size of pointer                 32 bit
#     size of z_off_t                 32 bit
#   Compiler Options                  None
#   One-time table building           None
#   Library content                   None
#   Operation variations              None
# 
"../sv_inline.h", line 487: warning #4232-D: conversion from "XPVIO *" to a more strictly aligned type "XPVMG *" may cause misaligned access
              SvSTASH_set(io, MUTABLE_HV(SvREFCNT_inc(GvHV(iogv))));
              ^

"../sv_inline.h", line 468: warning #4276-D: relational operator ">" always evaluates to 'false'
              Zero(new_body, type_details->body_size, char);
              ^

cc: warning 983: The -lc library specified on the command line is also added automatically by the compiler driver.  
# Failed test 1701 - sprintf( "%.54g", 0.3 ) renders correctly at op/sprintf2.t line 1197
#      got "0.299999999999999988897769753748434596"
# expected eq "0.299999999999999988897769753748434595763683319091796875"
Subroutine Time::HiRes::constant redefined at (eval 37) line 1.
Subroutine Time::HiRes::usleep redefined at (eval 37) line 1.
Subroutine Time::HiRes::nanosleep redefined at (eval 37) line 1.
Subroutine Time::HiRes::sleep redefined at (eval 37) line 1.
Subroutine Time::HiRes::ualarm redefined at (eval 37) line 1.
Subroutine Time::HiRes::alarm redefined at (eval 37) line 1.
Subroutine Time::HiRes::gettimeofday redefined at (eval 37) line 1.
Subroutine Time::HiRes::time redefined at (eval 37) line 1.
Subroutine Time::HiRes::setitimer redefined at (eval 37) line 1.
Subroutine Time::HiRes::getitimer redefined at (eval 37) line 1.
Subroutine Time::HiRes::utime redefined at (eval 37) line 1.
Subroutine Time::HiRes::clock_gettime redefined at (eval 37) line 1.
Subroutine Time::HiRes::clock_getres redefined at (eval 37) line 1.
Subroutine Time::HiRes::clock_nanosleep redefined at (eval 37) line 1.
Subroutine Time::HiRes::clock redefined at (eval 37) line 1.
Subroutine Time::HiRes::lstat redefined at (eval 37) line 1.
Subroutine Time::HiRes::stat redefined at (eval 37) line 1.
# Connected to 127.0.0.1
# Connected to 127.0.0.1
Integer overflow in hexadecimal number at t/broken_univ_can.t line 13.
make: *** [test_harness] Error 1

error while running harness target 'test_harness': 2 at /pro/3gl/CPAN/smoke/lib/Test/Smoke/App/RunSmoke.pm line 118.
[2022-05-21 04:38:17+0200] 
[2022-05-21 04:38:17+0200] ../dist/Net-Ping/t/450_service.t............................PASSED
[2022-05-21 04:38:17+0200]     9, 18
[2022-05-21 04:38:17+0200] ../t/op/sprintf2.t..........................................FAILED
[2022-05-21 04:38:17+0200]     1701
[2022-05-21 04:38:17+0200] Archived results...
[2022-05-21 04:38:17+0200] Unskip tests from '/pro/3gl/CPAN/smoke/p59.skip'
[2022-05-21 04:38:17+0200] 
[2022-05-21 04:38:17+0200] Configuration: -Dusedevel -Duseithreads -DDEBUGGING
[2022-05-21 04:38:17+0200] ------------------------------------------------------------------------------
[2022-05-21 04:38:17+0200] make distclean ...
[2022-05-21 04:39:00+0200] 
[2022-05-21 04:39:00+0200] Copy Policy.sh ...
[2022-05-21 04:39:00+0200] 
[2022-05-21 04:39:00+0200] Configure ...
[2022-05-21 04:40:40+0200] 
[2022-05-21 04:40:40+0200] make ...
[2022-05-21 05:03:09+0200] Skip tests from '/pro/3gl/CPAN/smoke/p59.skip'
[2022-05-21 05:03:09+0200] 	cpan/Sys-Syslog/t/syslog.t
[2022-05-21 05:03:09+0200] 
[2022-05-21 05:03:09+0200]  Tests start here:
[2022-05-21 05:03:09+0200] TSTENV = stdio	
No saved state, selection will be empty
# 
# 
# Compress::Raw::Zlib::VERSION        2.105
# 
# ZLIB_VERSION (from zlib.h)          1.2.12
# zlib_version (from zlib library)    1.2.12
# 
# ZLIB_VERNUM                         0x12C0
# BUILD_ZLIB                          1
# GZIP_OS_CODE                        3
# 
# zlibCompileFlags                    85
#   Type Sizes
#     size of uInt                    32 bit
#     size of uLong                   32 bit
#     size of pointer                 32 bit
#     size of z_off_t                 32 bit
#   Compiler Options                  None
#   One-time table building           None
#   Library content                   None
#   Operation variations              None
# 
Cannot figure out an encoding to use at t/use-Encode-Alias.t line 5.
"../../../../sv_inline.h", line 487: warning #4232-D: conversion from "XPVIO *" to a more strictly aligned type "XPVMG *" may cause misaligned access
              SvSTASH_set(io, MUTABLE_HV(SvREFCNT_inc(GvHV(iogv))));
              ^

"../../../../sv_inline.h", line 468: warning #4276-D: relational operator ">" always evaluates to 'false'
              Zero(new_body, type_details->body_size, char);
              ^

"../../../../sv_inline.h", line 487: warning #4232-D: conversion from "XPVIO *" to a more strictly aligned type "XPVMG *" may cause misaligned access
              SvSTASH_set(io, MUTABLE_HV(SvREFCNT_inc(GvHV(iogv))));
              ^

"../../../../sv_inline.h", line 468: warning #4276-D: relational operator ">" always evaluates to 'false'
              Zero(new_body, type_details->body_size, char);
              ^

"../../../../sv_inline.h", line 487: warning #4232-D: conversion from "XPVIO *" to a more strictly aligned type "XPVMG *" may cause misaligned access
              SvSTASH_set(io, MUTABLE_HV(SvREFCNT_inc(GvHV(iogv))));
              ^

"../../../../sv_inline.h", line 468: warning #4276-D: relational operator ">" always evaluates to 'false'
              Zero(new_body, type_details->body_size, char);
              ^

"../../../../sv_inline.h", line 487: warning #4232-D: conversion from "XPVIO *" to a more strictly aligned type "XPVMG *" may cause misaligned access
              SvSTASH_set(io, MUTABLE_HV(SvREFCNT_inc(GvHV(iogv))));
              ^

"../../../../sv_inline.h", line 468: warning #4276-D: relational operator ">" always evaluates to 'false'
              Zero(new_body, type_details->body_size, char);
              ^

"../../../../sv_inline.h", line 487: warning #4232-D: conversion from "XPVIO *" to a more strictly aligned type "XPVMG *" may cause misaligned access
              SvSTASH_set(io, MUTABLE_HV(SvREFCNT_inc(GvHV(iogv))));
              ^

"../../../../sv_inline.h", line 468: warning #4276-D: relational operator ">" always evaluates to 'false'
              Zero(new_body, type_details->body_size, char);
              ^

"../../../../sv_inline.h", line 487: warning #4232-D: conversion from "XPVIO *" to a more strictly aligned type "XPVMG *" may cause misaligned access
              SvSTASH_set(io, MUTABLE_HV(SvREFCNT_inc(GvHV(iogv))));
              ^

"../../../../sv_inline.h", line 468: warning #4276-D: relational operator ">" always evaluates to 'false'
              Zero(new_body, type_details->body_size, char);
              ^

"../../../../sv_inline.h", line 487: warning #4232-D: conversion from "XPVIO *" to a more strictly aligned type "XPVMG *" may cause misaligned access
              SvSTASH_set(io, MUTABLE_HV(SvREFCNT_inc(GvHV(iogv))));
              ^

"../../../../sv_inline.h", line 468: warning #4276-D: relational operator ">" always evaluates to 'false'
              Zero(new_body, type_details->body_size, char);
              ^

# Connected to 127.0.0.1
# Connected to 127.0.0.1
Integer overflow in hexadecimal number at t/broken_univ_can.t line 13.
Redefining sub xChild::foo at xChild--6690 line 2.
Redefining sub Data::ok at -e line 1.
"/pro/3gl/CPAN/perl-current/sv_inline.h", line 487: warning #4232-D: conversion from "XPVIO *" to a more strictly aligned type "XPVMG *" may cause misaligned access
              SvSTASH_set(io, MUTABLE_HV(SvREFCNT_inc(GvHV(iogv))));
              ^

"XSTest.c", line 249: warning #2111-D: statement is unreachable
  	PUTBACK;
  	^

"/pro/3gl/CPAN/perl-current/sv_inline.h", line 468: warning #4276-D: relational operator ">" always evaluates to 'false'
              Zero(new_body, type_details->body_size, char);
              ^

c++: error: +Z: No such file or directory
c++: error: +O2: No such file or directory
c++: error: +Onolimit: No such file or directory
"/pro/3gl/CPAN/perl-current/sv_inline.h", line 487: warning #4232-D: conversion from "XPVIO *" to a more strictly aligned type "XPVMG *" may cause misaligned access
              SvSTASH_set(io, MUTABLE_HV(SvREFCNT_inc(GvHV(iogv))));
              ^

"/pro/3gl/CPAN/perl-current/sv_inline.h", line 468: warning #4276-D: relational operator ">" always evaluates to 'false'
              Zero(new_body, type_details->body_size, char);
              ^

"XSMore.xs", line 48: warning #4276-D: relational operator ">" always evaluates to 'false'
     Newx(*c, lenc+1, char);
     ^

"XSMore.xs", line 63: warning #4276-D: relational operator ">" always evaluates to 'false'
     Newx(*c, lenc+1, char);
     ^

"/pro/3gl/CPAN/perl-current/sv_inline.h", line 487: warning #4232-D: conversion from "XPVIO *" to a more strictly aligned type "XPVMG *" may cause misaligned access
              SvSTASH_set(io, MUTABLE_HV(SvREFCNT_inc(GvHV(iogv))));
              ^

"/pro/3gl/CPAN/perl-current/sv_inline.h", line 468: warning #4276-D: relational operator ">" always evaluates to 'false'
              Zero(new_body, type_details->body_size, char);
              ^

Subroutine Time::HiRes::constant redefined at (eval 37) line 1.
Subroutine Time::HiRes::usleep redefined at (eval 37) line 1.
Subroutine Time::HiRes::nanosleep redefined at (eval 37) line 1.
Subroutine Time::HiRes::sleep redefined at (eval 37) line 1.
Subroutine Time::HiRes::ualarm redefined at (eval 37) line 1.
Subroutine Time::HiRes::alarm redefined at (eval 37) line 1.
Subroutine Time::HiRes::gettimeofday redefined at (eval 37) line 1.
Subroutine Time::HiRes::time redefined at (eval 37) line 1.
Subroutine Time::HiRes::setitimer redefined at (eval 37) line 1.
Subroutine Time::HiRes::getitimer redefined at (eval 37) line 1.
Subroutine Time::HiRes::utime redefined at (eval 37) line 1.
Subroutine Time::HiRes::clock_gettime redefined at (eval 37) line 1.
Subroutine Time::HiRes::clock_getres redefined at (eval 37) line 1.
Subroutine Time::HiRes::clock_nanosleep redefined at (eval 37) line 1.
Subroutine Time::HiRes::clock redefined at (eval 37) line 1.
Subroutine Time::HiRes::lstat redefined at (eval 37) line 1.
Subroutine Time::HiRes::stat redefined at (eval 37) line 1.
"../sv_inline.h", line 487: warning #4232-D: conversion from "XPVIO *" to a more strictly aligned type "XPVMG *" may cause misaligned access
              SvSTASH_set(io, MUTABLE_HV(SvREFCNT_inc(GvHV(iogv))));
              ^

"../sv_inline.h", line 468: warning #4276-D: relational operator ">" always evaluates to 'false'
              Zero(new_body, type_details->body_size, char);
              ^

cc: warning 983: The -lc library specified on the command line is also added automatically by the compiler driver.  
# Failed test 1701 - sprintf( "%.54g", 0.3 ) renders correctly at op/sprintf2.t line 1197
#      got "0.299999999999999988897769753748434596"
# expected eq "0.299999999999999988897769753748434595763683319091796875"
make: *** [test_harness] Error 1

error while running harness target 'test_harness': 2 at /pro/3gl/CPAN/smoke/lib/Test/Smoke/App/RunSmoke.pm line 118.
[2022-05-21 05:24:11+0200] 
[2022-05-21 05:24:11+0200] ../dist/Net-Ping/t/450_service.t............................PASSED
[2022-05-21 05:24:11+0200]     9, 18
[2022-05-21 05:24:11+0200] ../t/op/sprintf2.t..........................................FAILED
[2022-05-21 05:24:11+0200]     1701
[2022-05-21 05:24:11+0200] Archived results...
[2022-05-21 05:24:11+0200] TSTENV = perlio	
"../../../../sv_inline.h", line 487: warning #4232-D: conversion from "XPVIO *" to a more strictly aligned type "XPVMG *" may cause misaligned access
              SvSTASH_set(io, MUTABLE_HV(SvREFCNT_inc(GvHV(iogv))));
              ^

"../../../../sv_inline.h", line 468: warning #4276-D: relational operator ">" always evaluates to 'false'
              Zero(new_body, type_details->body_size, char);
              ^

"../../../../sv_inline.h", line 487: warning #4232-D: conversion from "XPVIO *" to a more strictly aligned type "XPVMG *" may cause misaligned access
              SvSTASH_set(io, MUTABLE_HV(SvREFCNT_inc(GvHV(iogv))));
              ^

"../../../../sv_inline.h", line 468: warning #4276-D: relational operator ">" always evaluates to 'false'
              Zero(new_body, type_details->body_size, char);
              ^

"../../../../sv_inline.h", line 487: warning #4232-D: conversion from "XPVIO *" to a more strictly aligned type "XPVMG *" may cause misaligned access
              SvSTASH_set(io, MUTABLE_HV(SvREFCNT_inc(GvHV(iogv))));
              ^

"../../../../sv_inline.h", line 468: warning #4276-D: relational operator ">" always evaluates to 'false'
              Zero(new_body, type_details->body_size, char);
              ^

"../../../../sv_inline.h", line 487: warning #4232-D: conversion from "XPVIO *" to a more strictly aligned type "XPVMG *" may cause misaligned access
              SvSTASH_set(io, MUTABLE_HV(SvREFCNT_inc(GvHV(iogv))));
              ^

"../../../../sv_inline.h", line 468: warning #4276-D: relational operator ">" always evaluates to 'false'
              Zero(new_body, type_details->body_size, char);
              ^

"../../../../sv_inline.h", line 487: warning #4232-D: conversion from "XPVIO *" to a more strictly aligned type "XPVMG *" may cause misaligned access
              SvSTASH_set(io, MUTABLE_HV(SvREFCNT_inc(GvHV(iogv))));
              ^

"../../../../sv_inline.h", line 468: warning #4276-D: relational operator ">" always evaluates to 'false'
              Zero(new_body, type_details->body_size, char);
              ^

"../../../../sv_inline.h", line 487: warning #4232-D: conversion from "XPVIO *" to a more strictly aligned type "XPVMG *" may cause misaligned access
              SvSTASH_set(io, MUTABLE_HV(SvREFCNT_inc(GvHV(iogv))));
              ^

"../../../../sv_inline.h", line 468: warning #4276-D: relational operator ">" always evaluates to 'false'
              Zero(new_body, type_details->body_size, char);
              ^

"../../../../sv_inline.h", line 487: warning #4232-D: conversion from "XPVIO *" to a more strictly aligned type "XPVMG *" may cause misaligned access
              SvSTASH_set(io, MUTABLE_HV(SvREFCNT_inc(GvHV(iogv))));
              ^

"../../../../sv_inline.h", line 468: warning #4276-D: relational operator ">" always evaluates to 'false'
              Zero(new_body, type_details->body_size, char);
              ^

"/pro/3gl/CPAN/perl-current/sv_inline.h", line 487: warning #4232-D: conversion from "XPVIO *" to a more strictly aligned type "XPVMG *" may cause misaligned access
              SvSTASH_set(io, MUTABLE_HV(SvREFCNT_inc(GvHV(iogv))));
              ^

"XSTest.c", line 249: warning #2111-D: statement is unreachable
  	PUTBACK;
  	^

"/pro/3gl/CPAN/perl-current/sv_inline.h", line 468: warning #4276-D: relational operator ">" always evaluates to 'false'
              Zero(new_body, type_details->body_size, char);
              ^

"/pro/3gl/CPAN/perl-current/sv_inline.h", line 487: warning #4232-D: conversion from "XPVIO *" to a more strictly aligned type "XPVMG *" may cause misaligned access
              SvSTASH_set(io, MUTABLE_HV(SvREFCNT_inc(GvHV(iogv))));
              ^

"/pro/3gl/CPAN/perl-current/sv_inline.h", line 468: warning #4276-D: relational operator ">" always evaluates to 'false'
              Zero(new_body, type_details->body_size, char);
              ^

"XSMore.xs", line 48: warning #4276-D: relational operator ">" always evaluates to 'false'
     Newx(*c, lenc+1, char);
     ^

"XSMore.xs", line 63: warning #4276-D: relational operator ">" always evaluates to 'false'
     Newx(*c, lenc+1, char);
     ^

"/pro/3gl/CPAN/perl-current/sv_inline.h", line 487: warning #4232-D: conversion from "XPVIO *" to a more strictly aligned type "XPVMG *" may cause misaligned access
              SvSTASH_set(io, MUTABLE_HV(SvREFCNT_inc(GvHV(iogv))));
              ^

"/pro/3gl/CPAN/perl-current/sv_inline.h", line 468: warning #4276-D: relational operator ">" always evaluates to 'false'
              Zero(new_body, type_details->body_size, char);
              ^

c++: error: +Z: No such file or directory
c++: error: +O2: No such file or directory
c++: error: +Onolimit: No such file or directory
# 
# 
# Compress::Raw::Zlib::VERSION        2.105
# 
# ZLIB_VERSION (from zlib.h)          1.2.12
# zlib_version (from zlib library)    1.2.12
# 
# ZLIB_VERNUM                         0x12C0
# BUILD_ZLIB                          1
# GZIP_OS_CODE                        3
# 
# zlibCompileFlags                    85
#   Type Sizes
#     size of uInt                    32 bit
#     size of uLong                   32 bit
#     size of pointer                 32 bit
#     size of z_off_t                 32 bit
#   Compiler Options                  None
#   One-time table building           None
#   Library content                   None
#   Operation variations              None
# 
"../sv_inline.h", line 487: warning #4232-D: conversion from "XPVIO *" to a more strictly aligned type "XPVMG *" may cause misaligned access
              SvSTASH_set(io, MUTABLE_HV(SvREFCNT_inc(GvHV(iogv))));
              ^

"../sv_inline.h", line 468: warning #4276-D: relational operator ">" always evaluates to 'false'
              Zero(new_body, type_details->body_size, char);
              ^

cc: warning 983: The -lc library specified on the command line is also added automatically by the compiler driver.  
# Failed test 1701 - sprintf( "%.54g", 0.3 ) renders correctly at op/sprintf2.t line 1197
#      got "0.299999999999999988897769753748434596"
# expected eq "0.299999999999999988897769753748434595763683319091796875"
Subroutine Time::HiRes::constant redefined at (eval 37) line 1.
Subroutine Time::HiRes::usleep redefined at (eval 37) line 1.
Subroutine Time::HiRes::nanosleep redefined at (eval 37) line 1.
Subroutine Time::HiRes::sleep redefined at (eval 37) line 1.
Subroutine Time::HiRes::ualarm redefined at (eval 37) line 1.
Subroutine Time::HiRes::alarm redefined at (eval 37) line 1.
Subroutine Time::HiRes::gettimeofday redefined at (eval 37) line 1.
Subroutine Time::HiRes::time redefined at (eval 37) line 1.
Subroutine Time::HiRes::setitimer redefined at (eval 37) line 1.
Subroutine Time::HiRes::getitimer redefined at (eval 37) line 1.
Subroutine Time::HiRes::utime redefined at (eval 37) line 1.
Subroutine Time::HiRes::clock_gettime redefined at (eval 37) line 1.
Subroutine Time::HiRes::clock_getres redefined at (eval 37) line 1.
Subroutine Time::HiRes::clock_nanosleep redefined at (eval 37) line 1.
Subroutine Time::HiRes::clock redefined at (eval 37) line 1.
Subroutine Time::HiRes::lstat redefined at (eval 37) line 1.
Subroutine Time::HiRes::stat redefined at (eval 37) line 1.
Cannot figure out an encoding to use at t/use-Encode-Alias.t line 5.
# Connected to 127.0.0.1
# Connected to 127.0.0.1
Integer overflow in hexadecimal number at t/broken_univ_can.t line 13.
make: *** [test_harness] Error 1

error while running harness target 'test_harness': 2 at /pro/3gl/CPAN/smoke/lib/Test/Smoke/App/RunSmoke.pm line 118.
[2022-05-21 05:42:46+0200] 
[2022-05-21 05:42:46+0200] ../dist/Net-Ping/t/450_service.t............................PASSED
[2022-05-21 05:42:46+0200]     9, 18
[2022-05-21 05:42:46+0200] ../t/op/sprintf2.t..........................................FAILED
[2022-05-21 05:42:46+0200]     1701
[2022-05-21 05:42:46+0200] Archived results...
[2022-05-21 05:42:46+0200] TSTENV = locale:en_US.utf8	
"../../../../sv_inline.h", line 487: warning #4232-D: conversion from "XPVIO *" to a more strictly aligned type "XPVMG *" may cause misaligned access
              SvSTASH_set(io, MUTABLE_HV(SvREFCNT_inc(GvHV(iogv))));
              ^

"../../../../sv_inline.h", line 468: warning #4276-D: relational operator ">" always evaluates to 'false'
              Zero(new_body, type_details->body_size, char);
              ^

"../../../../sv_inline.h", line 487: warning #4232-D: conversion from "XPVIO *" to a more strictly aligned type "XPVMG *" may cause misaligned access
              SvSTASH_set(io, MUTABLE_HV(SvREFCNT_inc(GvHV(iogv))));
              ^

"../../../../sv_inline.h", line 468: warning #4276-D: relational operator ">" always evaluates to 'false'
              Zero(new_body, type_details->body_size, char);
              ^

"../../../../sv_inline.h", line 487: warning #4232-D: conversion from "XPVIO *" to a more strictly aligned type "XPVMG *" may cause misaligned access
              SvSTASH_set(io, MUTABLE_HV(SvREFCNT_inc(GvHV(iogv))));
              ^

"../../../../sv_inline.h", line 468: warning #4276-D: relational operator ">" always evaluates to 'false'
              Zero(new_body, type_details->body_size, char);
              ^

"../../../../sv_inline.h", line 487: warning #4232-D: conversion from "XPVIO *" to a more strictly aligned type "XPVMG *" may cause misaligned access
              SvSTASH_set(io, MUTABLE_HV(SvREFCNT_inc(GvHV(iogv))));
              ^

"../../../../sv_inline.h", line 468: warning #4276-D: relational operator ">" always evaluates to 'false'
              Zero(new_body, type_details->body_size, char);
              ^

"../../../../sv_inline.h", line 487: warning #4232-D: conversion from "XPVIO *" to a more strictly aligned type "XPVMG *" may cause misaligned access
              SvSTASH_set(io, MUTABLE_HV(SvREFCNT_inc(GvHV(iogv))));
              ^

"../../../../sv_inline.h", line 468: warning #4276-D: relational operator ">" always evaluates to 'false'
              Zero(new_body, type_details->body_size, char);
              ^

"../../../../sv_inline.h", line 487: warning #4232-D: conversion from "XPVIO *" to a more strictly aligned type "XPVMG *" may cause misaligned access
              SvSTASH_set(io, MUTABLE_HV(SvREFCNT_inc(GvHV(iogv))));
              ^

"../../../../sv_inline.h", line 468: warning #4276-D: relational operator ">" always evaluates to 'false'
              Zero(new_body, type_details->body_size, char);
              ^

"../../../../sv_inline.h", line 487: warning #4232-D: conversion from "XPVIO *" to a more strictly aligned type "XPVMG *" may cause misaligned access
              SvSTASH_set(io, MUTABLE_HV(SvREFCNT_inc(GvHV(iogv))));
              ^

"../../../../sv_inline.h", line 468: warning #4276-D: relational operator ">" always evaluates to 'false'
              Zero(new_body, type_details->body_size, char);
              ^

"/pro/3gl/CPAN/perl-current/sv_inline.h", line 487: warning #4232-D: conversion from "XPVIO *" to a more strictly aligned type "XPVMG *" may cause misaligned access
              SvSTASH_set(io, MUTABLE_HV(SvREFCNT_inc(GvHV(iogv))));
              ^

"XSTest.c", line 249: warning #2111-D: statement is unreachable
  	PUTBACK;
  	^

"/pro/3gl/CPAN/perl-current/sv_inline.h", line 468: warning #4276-D: relational operator ">" always evaluates to 'false'
              Zero(new_body, type_details->body_size, char);
              ^

"/pro/3gl/CPAN/perl-current/sv_inline.h", line 487: warning #4232-D: conversion from "XPVIO *" to a more strictly aligned type "XPVMG *" may cause misaligned access
              SvSTASH_set(io, MUTABLE_HV(SvREFCNT_inc(GvHV(iogv))));
              ^

"/pro/3gl/CPAN/perl-current/sv_inline.h", line 468: warning #4276-D: relational operator ">" always evaluates to 'false'
              Zero(new_body, type_details->body_size, char);
              ^

"XSMore.xs", line 48: warning #4276-D: relational operator ">" always evaluates to 'false'
     Newx(*c, lenc+1, char);
     ^

"XSMore.xs", line 63: warning #4276-D: relational operator ">" always evaluates to 'false'
     Newx(*c, lenc+1, char);
     ^

"/pro/3gl/CPAN/perl-current/sv_inline.h", line 487: warning #4232-D: conversion from "XPVIO *" to a more strictly aligned type "XPVMG *" may cause misaligned access
              SvSTASH_set(io, MUTABLE_HV(SvREFCNT_inc(GvHV(iogv))));
              ^

"/pro/3gl/CPAN/perl-current/sv_inline.h", line 468: warning #4276-D: relational operator ">" always evaluates to 'false'
              Zero(new_body, type_details->body_size, char);
              ^

c++: error: +Z: No such file or directory
c++: error: +O2: No such file or directory
c++: error: +Onolimit: No such file or directory
# 
# 
# Compress::Raw::Zlib::VERSION        2.105
# 
# ZLIB_VERSION (from zlib.h)          1.2.12
# zlib_version (from zlib library)    1.2.12
# 
# ZLIB_VERNUM                         0x12C0
# BUILD_ZLIB                          1
# GZIP_OS_CODE                        3
# 
# zlibCompileFlags                    85
#   Type Sizes
#     size of uInt                    32 bit
#     size of uLong                   32 bit
#     size of pointer                 32 bit
#     size of z_off_t                 32 bit
#   Compiler Options                  None
#   One-time table building           None
#   Library content                   None
#   Operation variations              None
# 
"../sv_inline.h", line 487: warning #4232-D: conversion from "XPVIO *" to a more strictly aligned type "XPVMG *" may cause misaligned access
              SvSTASH_set(io, MUTABLE_HV(SvREFCNT_inc(GvHV(iogv))));
              ^

"../sv_inline.h", line 468: warning #4276-D: relational operator ">" always evaluates to 'false'
              Zero(new_body, type_details->body_size, char);
              ^

cc: warning 983: The -lc library specified on the command line is also added automatically by the compiler driver.  
# Failed test 1701 - sprintf( "%.54g", 0.3 ) renders correctly at op/sprintf2.t line 1197
#      got "0.299999999999999988897769753748434596"
# expected eq "0.299999999999999988897769753748434595763683319091796875"
Subroutine Time::HiRes::constant redefined at (eval 37) line 1.
Subroutine Time::HiRes::usleep redefined at (eval 37) line 1.
Subroutine Time::HiRes::nanosleep redefined at (eval 37) line 1.
Subroutine Time::HiRes::sleep redefined at (eval 37) line 1.
Subroutine Time::HiRes::ualarm redefined at (eval 37) line 1.
Subroutine Time::HiRes::alarm redefined at (eval 37) line 1.
Subroutine Time::HiRes::gettimeofday redefined at (eval 37) line 1.
Subroutine Time::HiRes::time redefined at (eval 37) line 1.
Subroutine Time::HiRes::setitimer redefined at (eval 37) line 1.
Subroutine Time::HiRes::getitimer redefined at (eval 37) line 1.
Subroutine Time::HiRes::utime redefined at (eval 37) line 1.
Subroutine Time::HiRes::clock_gettime redefined at (eval 37) line 1.
Subroutine Time::HiRes::clock_getres redefined at (eval 37) line 1.
Subroutine Time::HiRes::clock_nanosleep redefined at (eval 37) line 1.
Subroutine Time::HiRes::clock redefined at (eval 37) line 1.
Subroutine Time::HiRes::lstat redefined at (eval 37) line 1.
Subroutine Time::HiRes::stat redefined at (eval 37) line 1.
# Connected to 127.0.0.1
# Connected to 127.0.0.1
Integer overflow in hexadecimal number at t/broken_univ_can.t line 13.
make: *** [test_harness] Error 1

error while running harness target 'test_harness': 2 at /pro/3gl/CPAN/smoke/lib/Test/Smoke/App/RunSmoke.pm line 118.
[2022-05-21 06:01:21+0200] 
[2022-05-21 06:01:21+0200] ../dist/Net-Ping/t/450_service.t............................PASSED
[2022-05-21 06:01:21+0200]     9, 18
[2022-05-21 06:01:21+0200] ../t/op/sprintf2.t..........................................FAILED
[2022-05-21 06:01:21+0200]     1701
[2022-05-21 06:01:21+0200] Archived results...
[2022-05-21 06:01:21+0200] Unskip tests from '/pro/3gl/CPAN/smoke/p59.skip'
[2022-05-21 06:01:21+0200] 
[2022-05-21 06:01:21+0200] Configuration: -Dusedevel -Duseithreads -Duse64bitall
[2022-05-21 06:01:21+0200] ------------------------------------------------------------------------------
[2022-05-21 06:01:21+0200] make distclean ...
[2022-05-21 06:02:08+0200] 
[2022-05-21 06:02:08+0200] Copy Policy.sh ...
[2022-05-21 06:02:08+0200] 
[2022-05-21 06:02:08+0200] Configure ...
[2022-05-21 06:03:46+0200] 
[2022-05-21 06:03:46+0200] make ...
[2022-05-21 06:21:58+0200] Skip tests from '/pro/3gl/CPAN/smoke/p59.skip'
[2022-05-21 06:21:58+0200] 	cpan/Sys-Syslog/t/syslog.t
[2022-05-21 06:21:58+0200] 
[2022-05-21 06:21:58+0200]  Tests start here:
[2022-05-21 06:21:58+0200] TSTENV = stdio	
No saved state, selection will be empty
# 
# 
# Compress::Raw::Zlib::VERSION        2.105
# 
# ZLIB_VERSION (from zlib.h)          1.2.12
# zlib_version (from zlib library)    1.2.12
# 
# ZLIB_VERNUM                         0x12C0
# BUILD_ZLIB                          1
# GZIP_OS_CODE                        3
# 
# zlibCompileFlags                    169
#   Type Sizes
#     size of uInt                    32 bit
#     size of uLong                   64 bit
#     size of pointer                 64 bit
#     size of z_off_t                 64 bit
#   Compiler Options                  None
#   One-time table building           None
#   Library content                   None
#   Operation variations              None
# 
Cannot figure out an encoding to use at t/use-Encode-Alias.t line 5.
"../../../../sv_inline.h", line 468: warning #4276-D: relational operator ">" always evaluates to 'false'
              Zero(new_body, type_details->body_size, char);
              ^

"../../../../sv_inline.h", line 468: warning #4276-D: relational operator ">" always evaluates to 'false'
              Zero(new_body, type_details->body_size, char);
              ^

"../../../../sv_inline.h", line 468: warning #4276-D: relational operator ">" always evaluates to 'false'
              Zero(new_body, type_details->body_size, char);
              ^

"../../../../sv_inline.h", line 468: warning #4276-D: relational operator ">" always evaluates to 'false'
              Zero(new_body, type_details->body_size, char);
              ^

"../../../../sv_inline.h", line 468: warning #4276-D: relational operator ">" always evaluates to 'false'
              Zero(new_body, type_details->body_size, char);
              ^

"../../../../sv_inline.h", line 468: warning #4276-D: relational operator ">" always evaluates to 'false'
              Zero(new_body, type_details->body_size, char);
              ^

"../../../../sv_inline.h", line 468: warning #4276-D: relational operator ">" always evaluates to 'false'
              Zero(new_body, type_details->body_size, char);
              ^

# Connected to 127.0.0.1
# Connected to 127.0.0.1
Redefining sub xChild::foo at xChild--16992 line 2.
Redefining sub Data::ok at -e line 1.
"XSTest.c", line 249: warning #2111-D: statement is unreachable
  	PUTBACK;
  	^

"/pro/3gl/CPAN/perl-current/sv_inline.h", line 468: warning #4276-D: relational operator ">" always evaluates to 'false'
              Zero(new_body, type_details->body_size, char);
              ^

c++: error: +Z: No such file or directory
c++: error: +O2: No such file or directory
c++: error: +Onolimit: No such file or directory
"/pro/3gl/CPAN/perl-current/sv_inline.h", line 468: warning #4276-D: relational operator ">" always evaluates to 'false'
              Zero(new_body, type_details->body_size, char);
              ^

"XSMore.xs", line 48: warning #4276-D: relational operator ">" always evaluates to 'false'
     Newx(*c, lenc+1, char);
     ^

"XSMore.xs", line 63: warning #4276-D: relational operator ">" always evaluates to 'false'
     Newx(*c, lenc+1, char);
     ^

"/pro/3gl/CPAN/perl-current/sv_inline.h", line 468: warning #4276-D: relational operator ">" always evaluates to 'false'
              Zero(new_body, type_details->body_size, char);
              ^

Subroutine Time::HiRes::constant redefined at (eval 37) line 1.
Subroutine Time::HiRes::usleep redefined at (eval 37) line 1.
Subroutine Time::HiRes::nanosleep redefined at (eval 37) line 1.
Subroutine Time::HiRes::sleep redefined at (eval 37) line 1.
Subroutine Time::HiRes::ualarm redefined at (eval 37) line 1.
Subroutine Time::HiRes::alarm redefined at (eval 37) line 1.
Subroutine Time::HiRes::gettimeofday redefined at (eval 37) line 1.
Subroutine Time::HiRes::time redefined at (eval 37) line 1.
Subroutine Time::HiRes::setitimer redefined at (eval 37) line 1.
Subroutine Time::HiRes::getitimer redefined at (eval 37) line 1.
Subroutine Time::HiRes::utime redefined at (eval 37) line 1.
Subroutine Time::HiRes::clock_gettime redefined at (eval 37) line 1.
Subroutine Time::HiRes::clock_getres redefined at (eval 37) line 1.
Subroutine Time::HiRes::clock_nanosleep redefined at (eval 37) line 1.
Subroutine Time::HiRes::clock redefined at (eval 37) line 1.
Subroutine Time::HiRes::lstat redefined at (eval 37) line 1.
Subroutine Time::HiRes::stat redefined at (eval 37) line 1.
"../sv_inline.h", line 468: warning #4276-D: relational operator ">" always evaluates to 'false'
              Zero(new_body, type_details->body_size, char);
              ^

cc: warning 983: The -lc library specified on the command line is also added automatically by the compiler driver.  
# Failed test 1704 - sprintf( "%.54g", 0.3 ) renders correctly at op/sprintf2.t line 1197
#      got "0.299999999999999988897769753748434596"
# expected eq "0.299999999999999988897769753748434595763683319091796875"
make: *** [test_harness] Error 1

error while running harness target 'test_harness': 2 at /pro/3gl/CPAN/smoke/lib/Test/Smoke/App/RunSmoke.pm line 118.
[2022-05-21 06:41:31+0200] 
[2022-05-21 06:41:31+0200] ../dist/Net-Ping/t/450_service.t............................PASSED
[2022-05-21 06:41:31+0200]     9, 18
[2022-05-21 06:41:31+0200] ../t/op/sprintf2.t..........................................FAILED
[2022-05-21 06:41:31+0200]     1704
[2022-05-21 06:41:31+0200] ../t/re/reg_mesg.t..........................................FAILED
[2022-05-21 06:41:31+0200]     No plan found in TAP output
[2022-05-21 06:41:31+0200] ../t/re/regex_sets.t........................................FAILED
[2022-05-21 06:41:31+0200]     No plan found in TAP output
[2022-05-21 06:41:31+0200] Archived results...
[2022-05-21 06:41:31+0200] TSTENV = perlio	
"../../../../sv_inline.h", line 468: warning #4276-D: relational operator ">" always evaluates to 'false'
              Zero(new_body, type_details->body_size, char);
              ^

"../../../../sv_inline.h", line 468: warning #4276-D: relational operator ">" always evaluates to 'false'
              Zero(new_body, type_details->body_size, char);
              ^

"../../../../sv_inline.h", line 468: warning #4276-D: relational operator ">" always evaluates to 'false'
              Zero(new_body, type_details->body_size, char);
              ^

"../../../../sv_inline.h", line 468: warning #4276-D: relational operator ">" always evaluates to 'false'
              Zero(new_body, type_details->body_size, char);
              ^

"../../../../sv_inline.h", line 468: warning #4276-D: relational operator ">" always evaluates to 'false'
              Zero(new_body, type_details->body_size, char);
              ^

"../../../../sv_inline.h", line 468: warning #4276-D: relational operator ">" always evaluates to 'false'
              Zero(new_body, type_details->body_size, char);
              ^

"../../../../sv_inline.h", line 468: warning #4276-D: relational operator ">" always evaluates to 'false'
              Zero(new_body, type_details->body_size, char);
              ^

"XSTest.c", line 249: warning #2111-D: statement is unreachable
  	PUTBACK;
  	^

"/pro/3gl/CPAN/perl-current/sv_inline.h", line 468: warning #4276-D: relational operator ">" always evaluates to 'false'
              Zero(new_body, type_details->body_size, char);
              ^

"/pro/3gl/CPAN/perl-current/sv_inline.h", line 468: warning #4276-D: relational operator ">" always evaluates to 'false'
              Zero(new_body, type_details->body_size, char);
              ^

"XSMore.xs", line 48: warning #4276-D: relational operator ">" always evaluates to 'false'
     Newx(*c, lenc+1, char);
     ^

"XSMore.xs", line 63: warning #4276-D: relational operator ">" always evaluates to 'false'
     Newx(*c, lenc+1, char);
     ^

"/pro/3gl/CPAN/perl-current/sv_inline.h", line 468: warning #4276-D: relational operator ">" always evaluates to 'false'
              Zero(new_body, type_details->body_size, char);
              ^

c++: error: +Z: No such file or directory
c++: error: +O2: No such file or directory
c++: error: +Onolimit: No such file or directory
# 
# 
# Compress::Raw::Zlib::VERSION        2.105
# 
# ZLIB_VERSION (from zlib.h)          1.2.12
# zlib_version (from zlib library)    1.2.12
# 
# ZLIB_VERNUM                         0x12C0
# BUILD_ZLIB                          1
# GZIP_OS_CODE                        3
# 
# zlibCompileFlags                    169
#   Type Sizes
#     size of uInt                    32 bit
#     size of uLong                   64 bit
#     size of pointer                 64 bit
#     size of z_off_t                 64 bit
#   Compiler Options                  None
#   One-time table building           None
#   Library content                   None
#   Operation variations              None
# 
"../sv_inline.h", line 468: warning #4276-D: relational operator ">" always evaluates to 'false'
              Zero(new_body, type_details->body_size, char);
              ^

cc: warning 983: The -lc library specified on the command line is also added automatically by the compiler driver.  
# Failed test 1704 - sprintf( "%.54g", 0.3 ) renders correctly at op/sprintf2.t line 1197
#      got "0.299999999999999988897769753748434596"
# expected eq "0.299999999999999988897769753748434595763683319091796875"
# Connected to 127.0.0.1
# Connected to 127.0.0.1
Subroutine Time::HiRes::constant redefined at (eval 37) line 1.
Subroutine Time::HiRes::usleep redefined at (eval 37) line 1.
Subroutine Time::HiRes::nanosleep redefined at (eval 37) line 1.
Subroutine Time::HiRes::sleep redefined at (eval 37) line 1.
Subroutine Time::HiRes::ualarm redefined at (eval 37) line 1.
Subroutine Time::HiRes::alarm redefined at (eval 37) line 1.
Subroutine Time::HiRes::gettimeofday redefined at (eval 37) line 1.
Subroutine Time::HiRes::time redefined at (eval 37) line 1.
Subroutine Time::HiRes::setitimer redefined at (eval 37) line 1.
Subroutine Time::HiRes::getitimer redefined at (eval 37) line 1.
Subroutine Time::HiRes::utime redefined at (eval 37) line 1.
Subroutine Time::HiRes::clock_gettime redefined at (eval 37) line 1.
Subroutine Time::HiRes::clock_getres redefined at (eval 37) line 1.
Subroutine Time::HiRes::clock_nanosleep redefined at (eval 37) line 1.
Subroutine Time::HiRes::clock redefined at (eval 37) line 1.
Subroutine Time::HiRes::lstat redefined at (eval 37) line 1.
Subroutine Time::HiRes::stat redefined at (eval 37) line 1.
Cannot figure out an encoding to use at t/use-Encode-Alias.t line 5.
make: *** [test_harness] Error 1

error while running harness target 'test_harness': 2 at /pro/3gl/CPAN/smoke/lib/Test/Smoke/App/RunSmoke.pm line 118.
[2022-05-21 06:58:26+0200] 
[2022-05-21 06:58:26+0200] ../dist/Net-Ping/t/450_service.t............................PASSED
[2022-05-21 06:58:26+0200]     9, 18
[2022-05-21 06:58:26+0200] ../t/op/sprintf2.t..........................................FAILED
[2022-05-21 06:58:26+0200]     1704
[2022-05-21 06:58:26+0200] ../t/re/regex_sets.t........................................FAILED
[2022-05-21 06:58:26+0200]     No plan found in TAP output
[2022-05-21 06:58:26+0200] ../t/re/reg_mesg.t..........................................FAILED
[2022-05-21 06:58:26+0200]     No plan found in TAP output
[2022-05-21 06:58:26+0200] Archived results...
[2022-05-21 06:58:26+0200] TSTENV = locale:en_US.utf8	
"../../../../sv_inline.h", line 468: warning #4276-D: relational operator ">" always evaluates to 'false'
              Zero(new_body, type_details->body_size, char);
              ^

"../../../../sv_inline.h", line 468: warning #4276-D: relational operator ">" always evaluates to 'false'
              Zero(new_body, type_details->body_size, char);
              ^

"../../../../sv_inline.h", line 468: warning #4276-D: relational operator ">" always evaluates to 'false'
              Zero(new_body, type_details->body_size, char);
              ^

"../../../../sv_inline.h", line 468: warning #4276-D: relational operator ">" always evaluates to 'false'
              Zero(new_body, type_details->body_size, char);
              ^

"../../../../sv_inline.h", line 468: warning #4276-D: relational operator ">" always evaluates to 'false'
              Zero(new_body, type_details->body_size, char);
              ^

"../../../../sv_inline.h", line 468: warning #4276-D: relational operator ">" always evaluates to 'false'
              Zero(new_body, type_details->body_size, char);
              ^

"../../../../sv_inline.h", line 468: warning #4276-D: relational operator ">" always evaluates to 'false'
              Zero(new_body, type_details->body_size, char);
              ^

"XSTest.c", line 249: warning #2111-D: statement is unreachable
  	PUTBACK;
  	^

"/pro/3gl/CPAN/perl-current/sv_inline.h", line 468: warning #4276-D: relational operator ">" always evaluates to 'false'
              Zero(new_body, type_details->body_size, char);
              ^

"/pro/3gl/CPAN/perl-current/sv_inline.h", line 468: warning #4276-D: relational operator ">" always evaluates to 'false'
              Zero(new_body, type_details->body_size, char);
              ^

"XSMore.xs", line 48: warning #4276-D: relational operator ">" always evaluates to 'false'
     Newx(*c, lenc+1, char);
     ^

"XSMore.xs", line 63: warning #4276-D: relational operator ">" always evaluates to 'false'
     Newx(*c, lenc+1, char);
     ^

"/pro/3gl/CPAN/perl-current/sv_inline.h", line 468: warning #4276-D: relational operator ">" always evaluates to 'false'
              Zero(new_body, type_details->body_size, char);
              ^

c++: error: +Z: No such file or directory
c++: error: +O2: No such file or directory
c++: error: +Onolimit: No such file or directory
# 
# 
# Compress::Raw::Zlib::VERSION        2.105
# 
# ZLIB_VERSION (from zlib.h)          1.2.12
# zlib_version (from zlib library)    1.2.12
# 
# ZLIB_VERNUM                         0x12C0
# BUILD_ZLIB                          1
# GZIP_OS_CODE                        3
# 
# zlibCompileFlags                    169
#   Type Sizes
#     size of uInt                    32 bit
#     size of uLong                   64 bit
#     size of pointer                 64 bit
#     size of z_off_t                 64 bit
#   Compiler Options                  None
#   One-time table building           None
#   Library content                   None
#   Operation variations              None
# 
"../sv_inline.h", line 468: warning #4276-D: relational operator ">" always evaluates to 'false'
              Zero(new_body, type_details->body_size, char);
              ^

cc: warning 983: The -lc library specified on the command line is also added automatically by the compiler driver.  
# Failed test 1704 - sprintf( "%.54g", 0.3 ) renders correctly at op/sprintf2.t line 1197
#      got "0.299999999999999988897769753748434596"
# expected eq "0.299999999999999988897769753748434595763683319091796875"
Subroutine Time::HiRes::constant redefined at (eval 37) line 1.
Subroutine Time::HiRes::usleep redefined at (eval 37) line 1.
Subroutine Time::HiRes::nanosleep redefined at (eval 37) line 1.
Subroutine Time::HiRes::sleep redefined at (eval 37) line 1.
Subroutine Time::HiRes::ualarm redefined at (eval 37) line 1.
Subroutine Time::HiRes::alarm redefined at (eval 37) line 1.
Subroutine Time::HiRes::gettimeofday redefined at (eval 37) line 1.
Subroutine Time::HiRes::time redefined at (eval 37) line 1.
Subroutine Time::HiRes::setitimer redefined at (eval 37) line 1.
Subroutine Time::HiRes::getitimer redefined at (eval 37) line 1.
Subroutine Time::HiRes::utime redefined at (eval 37) line 1.
Subroutine Time::HiRes::clock_gettime redefined at (eval 37) line 1.
Subroutine Time::HiRes::clock_getres redefined at (eval 37) line 1.
Subroutine Time::HiRes::clock_nanosleep redefined at (eval 37) line 1.
Subroutine Time::HiRes::clock redefined at (eval 37) line 1.
Subroutine Time::HiRes::lstat redefined at (eval 37) line 1.
Subroutine Time::HiRes::stat redefined at (eval 37) line 1.
# Connected to 127.0.0.1
# Connected to 127.0.0.1
make: *** [test_harness] Error 1

error while running harness target 'test_harness': 2 at /pro/3gl/CPAN/smoke/lib/Test/Smoke/App/RunSmoke.pm line 118.
[2022-05-21 07:15:29+0200] 
[2022-05-21 07:15:29+0200] ../dist/Net-Ping/t/450_service.t............................PASSED
[2022-05-21 07:15:29+0200]     9, 18
[2022-05-21 07:15:29+0200] ../t/op/sprintf2.t..........................................FAILED
[2022-05-21 07:15:29+0200]     1704
[2022-05-21 07:15:29+0200] ../t/re/reg_mesg.t..........................................FAILED
[2022-05-21 07:15:29+0200]     No plan found in TAP output
[2022-05-21 07:15:29+0200] ../t/re/regex_sets.t........................................FAILED
[2022-05-21 07:15:29+0200]     No plan found in TAP output
[2022-05-21 07:15:29+0200] Archived results...
[2022-05-21 07:15:29+0200] Unskip tests from '/pro/3gl/CPAN/smoke/p59.skip'
[2022-05-21 07:15:29+0200] 
[2022-05-21 07:15:29+0200] Configuration: -Dusedevel -Duseithreads -Duse64bitall -DDEBUGGING
[2022-05-21 07:15:29+0200] ------------------------------------------------------------------------------
[2022-05-21 07:15:29+0200] make distclean ...
[2022-05-21 07:16:12+0200] 
[2022-05-21 07:16:12+0200] Copy Policy.sh ...
[2022-05-21 07:16:12+0200] 
[2022-05-21 07:16:12+0200] Configure ...
[2022-05-21 07:17:52+0200] 
[2022-05-21 07:17:52+0200] make ...
[2022-05-21 07:40:43+0200] Skip tests from '/pro/3gl/CPAN/smoke/p59.skip'
[2022-05-21 07:40:43+0200] 	cpan/Sys-Syslog/t/syslog.t
[2022-05-21 07:40:43+0200] 
[2022-05-21 07:40:43+0200]  Tests start here:
[2022-05-21 07:40:43+0200] TSTENV = stdio	
No saved state, selection will be empty
# 
# 
# Compress::Raw::Zlib::VERSION        2.105
# 
# ZLIB_VERSION (from zlib.h)          1.2.12
# zlib_version (from zlib library)    1.2.12
# 
# ZLIB_VERNUM                         0x12C0
# BUILD_ZLIB                          1
# GZIP_OS_CODE                        3
# 
# zlibCompileFlags                    169
#   Type Sizes
#     size of uInt                    32 bit
#     size of uLong                   64 bit
#     size of pointer                 64 bit
#     size of z_off_t                 64 bit
#   Compiler Options                  None
#   One-time table building           None
#   Library content                   None
#   Operation variations              None
# 
Cannot figure out an encoding to use at t/use-Encode-Alias.t line 5.
"../../../../sv_inline.h", line 468: warning #4276-D: relational operator ">" always evaluates to 'false'
              Zero(new_body, type_details->body_size, char);
              ^

"../../../../sv_inline.h", line 468: warning #4276-D: relational operator ">" always evaluates to 'false'
              Zero(new_body, type_details->body_size, char);
              ^

"../../../../sv_inline.h", line 468: warning #4276-D: relational operator ">" always evaluates to 'false'
              Zero(new_body, type_details->body_size, char);
              ^

"../../../../sv_inline.h", line 468: warning #4276-D: relational operator ">" always evaluates to 'false'
              Zero(new_body, type_details->body_size, char);
              ^

"../../../../sv_inline.h", line 468: warning #4276-D: relational operator ">" always evaluates to 'false'
              Zero(new_body, type_details->body_size, char);
              ^

"../../../../sv_inline.h", line 468: warning #4276-D: relational operator ">" always evaluates to 'false'
              Zero(new_body, type_details->body_size, char);
              ^

"../../../../sv_inline.h", line 468: warning #4276-D: relational operator ">" always evaluates to 'false'
              Zero(new_body, type_details->body_size, char);
              ^

# Connected to 127.0.0.1
# Connected to 127.0.0.1
Redefining sub xChild::foo at xChild--27512 line 2.
Redefining sub Data::ok at -e line 1.
"XSTest.c", line 249: warning #2111-D: statement is unreachable
  	PUTBACK;
  	^

"/pro/3gl/CPAN/perl-current/sv_inline.h", line 468: warning #4276-D: relational operator ">" always evaluates to 'false'
              Zero(new_body, type_details->body_size, char);
              ^

c++: error: +Z: No such file or directory
c++: error: +O2: No such file or directory
c++: error: +Onolimit: No such file or directory
"/pro/3gl/CPAN/perl-current/sv_inline.h", line 468: warning #4276-D: relational operator ">" always evaluates to 'false'
              Zero(new_body, type_details->body_size, char);
              ^

"XSMore.xs", line 48: warning #4276-D: relational operator ">" always evaluates to 'false'
     Newx(*c, lenc+1, char);
     ^

"XSMore.xs", line 63: warning #4276-D: relational operator ">" always evaluates to 'false'
     Newx(*c, lenc+1, char);
     ^

"/pro/3gl/CPAN/perl-current/sv_inline.h", line 468: warning #4276-D: relational operator ">" always evaluates to 'false'
              Zero(new_body, type_details->body_size, char);
              ^

Subroutine Time::HiRes::constant redefined at (eval 37) line 1.
Subroutine Time::HiRes::usleep redefined at (eval 37) line 1.
Subroutine Time::HiRes::nanosleep redefined at (eval 37) line 1.
Subroutine Time::HiRes::sleep redefined at (eval 37) line 1.
Subroutine Time::HiRes::ualarm redefined at (eval 37) line 1.
Subroutine Time::HiRes::alarm redefined at (eval 37) line 1.
Subroutine Time::HiRes::gettimeofday redefined at (eval 37) line 1.
Subroutine Time::HiRes::time redefined at (eval 37) line 1.
Subroutine Time::HiRes::setitimer redefined at (eval 37) line 1.
Subroutine Time::HiRes::getitimer redefined at (eval 37) line 1.
Subroutine Time::HiRes::utime redefined at (eval 37) line 1.
Subroutine Time::HiRes::clock_gettime redefined at (eval 37) line 1.
Subroutine Time::HiRes::clock_getres redefined at (eval 37) line 1.
Subroutine Time::HiRes::clock_nanosleep redefined at (eval 37) line 1.
Subroutine Time::HiRes::clock redefined at (eval 37) line 1.
Subroutine Time::HiRes::lstat redefined at (eval 37) line 1.
Subroutine Time::HiRes::stat redefined at (eval 37) line 1.
"../sv_inline.h", line 468: warning #4276-D: relational operator ">" always evaluates to 'false'
              Zero(new_body, type_details->body_size, char);
              ^

cc: warning 983: The -lc library specified on the command line is also added automatically by the compiler driver.  
# Failed test 1704 - sprintf( "%.54g", 0.3 ) renders correctly at op/sprintf2.t line 1197
#      got "0.299999999999999988897769753748434596"
# expected eq "0.299999999999999988897769753748434595763683319091796875"
make: *** [test_harness] Error 1

error while running harness target 'test_harness': 2 at /pro/3gl/CPAN/smoke/lib/Test/Smoke/App/RunSmoke.pm line 118.
[2022-05-21 08:02:49+0200] 
[2022-05-21 08:02:49+0200] ../dist/Net-Ping/t/450_service.t............................PASSED
[2022-05-21 08:02:49+0200]     9, 18
[2022-05-21 08:02:49+0200] ../t/op/sprintf2.t..........................................FAILED
[2022-05-21 08:02:49+0200]     1704
[2022-05-21 08:02:49+0200] ../t/re/reg_mesg.t..........................................FAILED
[2022-05-21 08:02:49+0200]     No plan found in TAP output
[2022-05-21 08:02:49+0200] ../t/re/regex_sets.t........................................FAILED
[2022-05-21 08:02:49+0200]     No plan found in TAP output
[2022-05-21 08:02:49+0200] Archived results...
[2022-05-21 08:02:49+0200] TSTENV = perlio	
"../../../../sv_inline.h", line 468: warning #4276-D: relational operator ">" always evaluates to 'false'
              Zero(new_body, type_details->body_size, char);
              ^

"../../../../sv_inline.h", line 468: warning #4276-D: relational operator ">" always evaluates to 'false'
              Zero(new_body, type_details->body_size, char);
              ^

"../../../../sv_inline.h", line 468: warning #4276-D: relational operator ">" always evaluates to 'false'
              Zero(new_body, type_details->body_size, char);
              ^

"../../../../sv_inline.h", line 468: warning #4276-D: relational operator ">" always evaluates to 'false'
              Zero(new_body, type_details->body_size, char);
              ^

"../../../../sv_inline.h", line 468: warning #4276-D: relational operator ">" always evaluates to 'false'
              Zero(new_body, type_details->body_size, char);
              ^

"../../../../sv_inline.h", line 468: warning #4276-D: relational operator ">" always evaluates to 'false'
              Zero(new_body, type_details->body_size, char);
              ^

"../../../../sv_inline.h", line 468: warning #4276-D: relational operator ">" always evaluates to 'false'
              Zero(new_body, type_details->body_size, char);
              ^

"XSTest.c", line 249: warning #2111-D: statement is unreachable
  	PUTBACK;
  	^

"/pro/3gl/CPAN/perl-current/sv_inline.h", line 468: warning #4276-D: relational operator ">" always evaluates to 'false'
              Zero(new_body, type_details->body_size, char);
              ^

"/pro/3gl/CPAN/perl-current/sv_inline.h", line 468: warning #4276-D: relational operator ">" always evaluates to 'false'
              Zero(new_body, type_details->body_size, char);
              ^

"XSMore.xs", line 48: warning #4276-D: relational operator ">" always evaluates to 'false'
     Newx(*c, lenc+1, char);
     ^

"XSMore.xs", line 63: warning #4276-D: relational operator ">" always evaluates to 'false'
     Newx(*c, lenc+1, char);
     ^

"/pro/3gl/CPAN/perl-current/sv_inline.h", line 468: warning #4276-D: relational operator ">" always evaluates to 'false'
              Zero(new_body, type_details->body_size, char);
              ^

c++: error: +Z: No such file or directory
c++: error: +O2: No such file or directory
c++: error: +Onolimit: No such file or directory
# 
# 
# Compress::Raw::Zlib::VERSION        2.105
# 
# ZLIB_VERSION (from zlib.h)          1.2.12
# zlib_version (from zlib library)    1.2.12
# 
# ZLIB_VERNUM                         0x12C0
# BUILD_ZLIB                          1
# GZIP_OS_CODE                        3
# 
# zlibCompileFlags                    169
#   Type Sizes
#     size of uInt                    32 bit
#     size of uLong                   64 bit
#     size of pointer                 64 bit
#     size of z_off_t                 64 bit
#   Compiler Options                  None
#   One-time table building           None
#   Library content                   None
#   Operation variations              None
# 
"../sv_inline.h", line 468: warning #4276-D: relational operator ">" always evaluates to 'false'
              Zero(new_body, type_details->body_size, char);
              ^

cc: warning 983: The -lc library specified on the command line is also added automatically by the compiler driver.  
# Failed test 1704 - sprintf( "%.54g", 0.3 ) renders correctly at op/sprintf2.t line 1197
#      got "0.299999999999999988897769753748434596"
# expected eq "0.299999999999999988897769753748434595763683319091796875"
# Connected to 127.0.0.1
# Connected to 127.0.0.1
Subroutine Time::HiRes::constant redefined at (eval 37) line 1.
Subroutine Time::HiRes::usleep redefined at (eval 37) line 1.
Subroutine Time::HiRes::nanosleep redefined at (eval 37) line 1.
Subroutine Time::HiRes::sleep redefined at (eval 37) line 1.
Subroutine Time::HiRes::ualarm redefined at (eval 37) line 1.
Subroutine Time::HiRes::alarm redefined at (eval 37) line 1.
Subroutine Time::HiRes::gettimeofday redefined at (eval 37) line 1.
Subroutine Time::HiRes::time redefined at (eval 37) line 1.
Subroutine Time::HiRes::setitimer redefined at (eval 37) line 1.
Subroutine Time::HiRes::getitimer redefined at (eval 37) line 1.
Subroutine Time::HiRes::utime redefined at (eval 37) line 1.
Subroutine Time::HiRes::clock_gettime redefined at (eval 37) line 1.
Subroutine Time::HiRes::clock_getres redefined at (eval 37) line 1.
Subroutine Time::HiRes::clock_nanosleep redefined at (eval 37) line 1.
Subroutine Time::HiRes::clock redefined at (eval 37) line 1.
Subroutine Time::HiRes::lstat redefined at (eval 37) line 1.
Subroutine Time::HiRes::stat redefined at (eval 37) line 1.
Cannot figure out an encoding to use at t/use-Encode-Alias.t line 5.
make: *** [test_harness] Error 1

error while running harness target 'test_harness': 2 at /pro/3gl/CPAN/smoke/lib/Test/Smoke/App/RunSmoke.pm line 118.
[2022-05-21 08:22:29+0200] 
[2022-05-21 08:22:29+0200] ../dist/Net-Ping/t/450_service.t............................PASSED
[2022-05-21 08:22:29+0200]     9, 18
[2022-05-21 08:22:29+0200] ../t/op/sprintf2.t..........................................FAILED
[2022-05-21 08:22:29+0200]     1704
[2022-05-21 08:22:29+0200] ../t/re/regex_sets.t........................................FAILED
[2022-05-21 08:22:29+0200]     No plan found in TAP output
[2022-05-21 08:22:29+0200] ../t/re/reg_mesg.t..........................................FAILED
[2022-05-21 08:22:29+0200]     No plan found in TAP output
[2022-05-21 08:22:29+0200] Archived results...
[2022-05-21 08:22:29+0200] TSTENV = locale:en_US.utf8	
"../../../../sv_inline.h", line 468: warning #4276-D: relational operator ">" always evaluates to 'false'
              Zero(new_body, type_details->body_size, char);
              ^

"../../../../sv_inline.h", line 468: warning #4276-D: relational operator ">" always evaluates to 'false'
              Zero(new_body, type_details->body_size, char);
              ^

"../../../../sv_inline.h", line 468: warning #4276-D: relational operator ">" always evaluates to 'false'
              Zero(new_body, type_details->body_size, char);
              ^

"../../../../sv_inline.h", line 468: warning #4276-D: relational operator ">" always evaluates to 'false'
              Zero(new_body, type_details->body_size, char);
              ^

"../../../../sv_inline.h", line 468: warning #4276-D: relational operator ">" always evaluates to 'false'
              Zero(new_body, type_details->body_size, char);
              ^

"../../../../sv_inline.h", line 468: warning #4276-D: relational operator ">" always evaluates to 'false'
              Zero(new_body, type_details->body_size, char);
              ^

"../../../../sv_inline.h", line 468: warning #4276-D: relational operator ">" always evaluates to 'false'
              Zero(new_body, type_details->body_size, char);
              ^

"XSTest.c", line 249: warning #2111-D: statement is unreachable
  	PUTBACK;
  	^

"/pro/3gl/CPAN/perl-current/sv_inline.h", line 468: warning #4276-D: relational operator ">" always evaluates to 'false'
              Zero(new_body, type_details->body_size, char);
              ^

"/pro/3gl/CPAN/perl-current/sv_inline.h", line 468: warning #4276-D: relational operator ">" always evaluates to 'false'
              Zero(new_body, type_details->body_size, char);
              ^

"XSMore.xs", line 48: warning #4276-D: relational operator ">" always evaluates to 'false'
     Newx(*c, lenc+1, char);
     ^

"XSMore.xs", line 63: warning #4276-D: relational operator ">" always evaluates to 'false'
     Newx(*c, lenc+1, char);
     ^

"/pro/3gl/CPAN/perl-current/sv_inline.h", line 468: warning #4276-D: relational operator ">" always evaluates to 'false'
              Zero(new_body, type_details->body_size, char);
              ^

c++: error: +Z: No such file or directory
c++: error: +O2: No such file or directory
c++: error: +Onolimit: No such file or directory
# 
# 
# Compress::Raw::Zlib::VERSION        2.105
# 
# ZLIB_VERSION (from zlib.h)          1.2.12
# zlib_version (from zlib library)    1.2.12
# 
# ZLIB_VERNUM                         0x12C0
# BUILD_ZLIB                          1
# GZIP_OS_CODE                        3
# 
# zlibCompileFlags                    169
#   Type Sizes
#     size of uInt                    32 bit
#     size of uLong                   64 bit
#     size of pointer                 64 bit
#     size of z_off_t                 64 bit
#   Compiler Options                  None
#   One-time table building           None
#   Library content                   None
#   Operation variations              None
# 
"../sv_inline.h", line 468: warning #4276-D: relational operator ">" always evaluates to 'false'
              Zero(new_body, type_details->body_size, char);
              ^

cc: warning 983: The -lc library specified on the command line is also added automatically by the compiler driver.  
# Failed test 1704 - sprintf( "%.54g", 0.3 ) renders correctly at op/sprintf2.t line 1197
#      got "0.299999999999999988897769753748434596"
# expected eq "0.299999999999999988897769753748434595763683319091796875"
Subroutine Time::HiRes::constant redefined at (eval 37) line 1.
Subroutine Time::HiRes::usleep redefined at (eval 37) line 1.
Subroutine Time::HiRes::nanosleep redefined at (eval 37) line 1.
Subroutine Time::HiRes::sleep redefined at (eval 37) line 1.
Subroutine Time::HiRes::ualarm redefined at (eval 37) line 1.
Subroutine Time::HiRes::alarm redefined at (eval 37) line 1.
Subroutine Time::HiRes::gettimeofday redefined at (eval 37) line 1.
Subroutine Time::HiRes::time redefined at (eval 37) line 1.
Subroutine Time::HiRes::setitimer redefined at (eval 37) line 1.
Subroutine Time::HiRes::getitimer redefined at (eval 37) line 1.
Subroutine Time::HiRes::utime redefined at (eval 37) line 1.
Subroutine Time::HiRes::clock_gettime redefined at (eval 37) line 1.
Subroutine Time::HiRes::clock_getres redefined at (eval 37) line 1.
Subroutine Time::HiRes::clock_nanosleep redefined at (eval 37) line 1.
Subroutine Time::HiRes::clock redefined at (eval 37) line 1.
Subroutine Time::HiRes::lstat redefined at (eval 37) line 1.
Subroutine Time::HiRes::stat redefined at (eval 37) line 1.
# Connected to 127.0.0.1
# Connected to 127.0.0.1
make: *** [test_harness] Error 1

error while running harness target 'test_harness': 2 at /pro/3gl/CPAN/smoke/lib/Test/Smoke/App/RunSmoke.pm line 118.
[2022-05-21 08:42:12+0200] 
[2022-05-21 08:42:12+0200] ../dist/Net-Ping/t/450_service.t............................PASSED
[2022-05-21 08:42:12+0200]     9, 18
[2022-05-21 08:42:12+0200] ../t/op/sprintf2.t..........................................FAILED
[2022-05-21 08:42:12+0200]     1704
[2022-05-21 08:42:12+0200] ../t/re/regex_sets.t........................................FAILED
[2022-05-21 08:42:12+0200]     No plan found in TAP output
[2022-05-21 08:42:12+0200] ../t/re/reg_mesg.t..........................................FAILED
[2022-05-21 08:42:12+0200]     No plan found in TAP output
[2022-05-21 08:42:12+0200] Archived results...
[2022-05-21 08:42:12+0200] Unskip tests from '/pro/3gl/CPAN/smoke/p59.skip'
[2022-05-21 08:42:12+0200] Finished smoking e815fc9e521a3f7203f08588dfcd102261bdacd7 v5.35.11-262-ge815fc9 blead
[2022-05-21 08:42:12+0200] Reading smokeresult from /pro/3gl/CPAN/perl-current/mktest.out
[2022-05-21 08:42:21+0200] Processing []
[2022-05-21 08:42:21+0200] Processing [-DDEBUGGING]
[2022-05-21 08:42:21+0200] Processing [-Duse64bitall]
[2022-05-21 08:42:21+0200] Processing [-DDEBUGGING -Duse64bitall]
[2022-05-21 08:42:21+0200] Processing [-Duseithreads]
[2022-05-21 08:42:21+0200] Processing [-DDEBUGGING -Duseithreads]
[2022-05-21 08:42:21+0200] Processing [-Duseithreads -Duse64bitall]
[2022-05-21 08:42:21+0200] Processing [-DDEBUGGING -Duseithreads -Duse64bitall]
[2022-05-21 08:42:21+0200] ==> Starting reporter
[2022-05-21 08:42:21+0200] Writing report to '/pro/3gl/CPAN/perl-current/mktest.rpt'
[2022-05-21 08:42:21+0200] Locally applied patches from '/pro/3gl/CPAN/perl-current/patchlevel.h'
[2022-05-21 08:42:21+0200] Patches: 'uncommitted-changes'
[2022-05-21 08:42:21+0200] Looking for cc messages: 'hpux'
-- 
Report generated by Test::Smoke::Gateway v0.12