Show report
[2022-05-18 22:45:13+0200] ==> Skipping synctree
[2022-05-18 22:45:13+0200] ==> Starting runsmoke
[2022-05-18 22:45:13+0200] [tssmokeperl.pl] chdir(/pro/3gl/CPAN/perl-current)
[2022-05-18 22:45:13+0200] Setup alarm: Thu May 19 22:15:13 2022
[2022-05-18 22:45:13+0200] qx[/pro/bin/perl -e "require q[/pro/3gl/CPAN/perl-current/cpan/Test-Harness/lib/Test/Harness.pm];print Test::Harness->VERSION" 2>&1]
[2022-05-18 22:45:13+0200] Found: Test::Harness version 3.44.
[2022-05-18 22:45:13+0200] Reading build configurations from /pro/3gl/CPAN/smoke/p59.cfg
[2022-05-18 22:45:13+0200] Reading 'Policy.sh' from ../Policy.sh (v=1)
[2022-05-18 22:45:13+0200] Running test suite only with 'harness'
[2022-05-18 22:45:13+0200] make distclean ...
[2022-05-18 22:45:13+0200] Smoking patch 06d31977c06ed237a3bb5b1bf22fc9cedd14134b v5.35.11-229-g06d3197
[2022-05-18 22:45:13+0200] Smoking branch blead
[2022-05-18 22:45:14+0200] Locally applied patches from '/pro/3gl/CPAN/perl-current/patchlevel.h'
[2022-05-18 22:45:14+0200] Patches: 'uncommitted-changes'
[2022-05-18 22:45:14+0200] Adding 'SMOKE06d31977c06ed237a3bb5b1bf22fc9cedd14134b' to the registered patches.
[2022-05-18 22:45:14+0200] 
[2022-05-18 22:45:14+0200] Configuration: -Dusedevel
[2022-05-18 22:45:14+0200] ------------------------------------------------------------------------------
[2022-05-18 22:45:14+0200] make distclean ...
[2022-05-18 22:45:14+0200] 
[2022-05-18 22:45:14+0200] Copy Policy.sh ...
[2022-05-18 22:45:14+0200] 
[2022-05-18 22:45:14+0200] Configure ...
[2022-05-18 22:46:51+0200] 
[2022-05-18 22:46:51+0200] make ...
[2022-05-18 23:04:29+0200] Skip tests from '/pro/3gl/CPAN/smoke/p59.skip'
[2022-05-18 23:04:29+0200] 	cpan/Sys-Syslog/t/syslog.t
[2022-05-18 23:04:29+0200] 
[2022-05-18 23:04:29+0200]  Tests start here:
[2022-05-18 23:04:29+0200] TSTENV = stdio	
No saved state, selection will be empty
Cannot figure out an encoding to use at t/use-Encode-Alias.t line 5.
"../../../../sv_inline.h", line 487: warning #4232-D: conversion from "XPVIO *" to a more strictly aligned type "XPVMG *" may cause misaligned access
              SvSTASH_set(io, MUTABLE_HV(SvREFCNT_inc(GvHV(iogv))));
              ^

"../../../../sv_inline.h", line 468: warning #4276-D: relational operator ">" always evaluates to 'false'
              Zero(new_body, type_details->body_size, char);
              ^

"../../../../sv_inline.h", line 487: warning #4232-D: conversion from "XPVIO *" to a more strictly aligned type "XPVMG *" may cause misaligned access
              SvSTASH_set(io, MUTABLE_HV(SvREFCNT_inc(GvHV(iogv))));
              ^

"../../../../sv_inline.h", line 468: warning #4276-D: relational operator ">" always evaluates to 'false'
              Zero(new_body, type_details->body_size, char);
              ^

"../../../../sv_inline.h", line 487: warning #4232-D: conversion from "XPVIO *" to a more strictly aligned type "XPVMG *" may cause misaligned access
              SvSTASH_set(io, MUTABLE_HV(SvREFCNT_inc(GvHV(iogv))));
              ^

"../../../../sv_inline.h", line 468: warning #4276-D: relational operator ">" always evaluates to 'false'
              Zero(new_body, type_details->body_size, char);
              ^

"../../../../sv_inline.h", line 487: warning #4232-D: conversion from "XPVIO *" to a more strictly aligned type "XPVMG *" may cause misaligned access
              SvSTASH_set(io, MUTABLE_HV(SvREFCNT_inc(GvHV(iogv))));
              ^

"../../../../sv_inline.h", line 468: warning #4276-D: relational operator ">" always evaluates to 'false'
              Zero(new_body, type_details->body_size, char);
              ^

"../../../../sv_inline.h", line 487: warning #4232-D: conversion from "XPVIO *" to a more strictly aligned type "XPVMG *" may cause misaligned access
              SvSTASH_set(io, MUTABLE_HV(SvREFCNT_inc(GvHV(iogv))));
              ^

"../../../../sv_inline.h", line 468: warning #4276-D: relational operator ">" always evaluates to 'false'
              Zero(new_body, type_details->body_size, char);
              ^

"../../../../sv_inline.h", line 487: warning #4232-D: conversion from "XPVIO *" to a more strictly aligned type "XPVMG *" may cause misaligned access
              SvSTASH_set(io, MUTABLE_HV(SvREFCNT_inc(GvHV(iogv))));
              ^

"../../../../sv_inline.h", line 468: warning #4276-D: relational operator ">" always evaluates to 'false'
              Zero(new_body, type_details->body_size, char);
              ^

"../../../../sv_inline.h", line 487: warning #4232-D: conversion from "XPVIO *" to a more strictly aligned type "XPVMG *" may cause misaligned access
              SvSTASH_set(io, MUTABLE_HV(SvREFCNT_inc(GvHV(iogv))));
              ^

"../../../../sv_inline.h", line 468: warning #4276-D: relational operator ">" always evaluates to 'false'
              Zero(new_body, type_details->body_size, char);
              ^

# Connected to 127.0.0.1
# Connected to 127.0.0.1
Integer overflow in hexadecimal number at t/broken_univ_can.t line 13.
Redefining sub xChild::foo at xChild--1345 line 2.
Redefining sub Data::ok at -e line 1.
"/pro/3gl/CPAN/perl-current/sv_inline.h", line 487: warning #4232-D: conversion from "XPVIO *" to a more strictly aligned type "XPVMG *" may cause misaligned access
              SvSTASH_set(io, MUTABLE_HV(SvREFCNT_inc(GvHV(iogv))));
              ^

"XSTest.c", line 249: warning #2111-D: statement is unreachable
  	PUTBACK;
  	^

"/pro/3gl/CPAN/perl-current/sv_inline.h", line 468: warning #4276-D: relational operator ">" always evaluates to 'false'
              Zero(new_body, type_details->body_size, char);
              ^

c++: error: +Z: No such file or directory
c++: error: +O2: No such file or directory
c++: error: +Onolimit: No such file or directory
"/pro/3gl/CPAN/perl-current/sv_inline.h", line 487: warning #4232-D: conversion from "XPVIO *" to a more strictly aligned type "XPVMG *" may cause misaligned access
              SvSTASH_set(io, MUTABLE_HV(SvREFCNT_inc(GvHV(iogv))));
              ^

"/pro/3gl/CPAN/perl-current/sv_inline.h", line 468: warning #4276-D: relational operator ">" always evaluates to 'false'
              Zero(new_body, type_details->body_size, char);
              ^

"XSMore.xs", line 48: warning #4276-D: relational operator ">" always evaluates to 'false'
     Newx(*c, lenc+1, char);
     ^

"XSMore.xs", line 63: warning #4276-D: relational operator ">" always evaluates to 'false'
     Newx(*c, lenc+1, char);
     ^

"/pro/3gl/CPAN/perl-current/sv_inline.h", line 487: warning #4232-D: conversion from "XPVIO *" to a more strictly aligned type "XPVMG *" may cause misaligned access
              SvSTASH_set(io, MUTABLE_HV(SvREFCNT_inc(GvHV(iogv))));
              ^

"/pro/3gl/CPAN/perl-current/sv_inline.h", line 468: warning #4276-D: relational operator ">" always evaluates to 'false'
              Zero(new_body, type_details->body_size, char);
              ^

Subroutine Time::HiRes::constant redefined at (eval 37) line 1.
Subroutine Time::HiRes::usleep redefined at (eval 37) line 1.
Subroutine Time::HiRes::nanosleep redefined at (eval 37) line 1.
Subroutine Time::HiRes::sleep redefined at (eval 37) line 1.
Subroutine Time::HiRes::ualarm redefined at (eval 37) line 1.
Subroutine Time::HiRes::alarm redefined at (eval 37) line 1.
Subroutine Time::HiRes::gettimeofday redefined at (eval 37) line 1.
Subroutine Time::HiRes::time redefined at (eval 37) line 1.
Subroutine Time::HiRes::setitimer redefined at (eval 37) line 1.
Subroutine Time::HiRes::getitimer redefined at (eval 37) line 1.
Subroutine Time::HiRes::utime redefined at (eval 37) line 1.
Subroutine Time::HiRes::clock_gettime redefined at (eval 37) line 1.
Subroutine Time::HiRes::clock_getres redefined at (eval 37) line 1.
Subroutine Time::HiRes::clock_nanosleep redefined at (eval 37) line 1.
Subroutine Time::HiRes::clock redefined at (eval 37) line 1.
Subroutine Time::HiRes::lstat redefined at (eval 37) line 1.
Subroutine Time::HiRes::stat redefined at (eval 37) line 1.
"../sv_inline.h", line 487: warning #4232-D: conversion from "XPVIO *" to a more strictly aligned type "XPVMG *" may cause misaligned access
              SvSTASH_set(io, MUTABLE_HV(SvREFCNT_inc(GvHV(iogv))));
              ^

"../sv_inline.h", line 468: warning #4276-D: relational operator ">" always evaluates to 'false'
              Zero(new_body, type_details->body_size, char);
              ^

cc: warning 983: The -lc library specified on the command line is also added automatically by the compiler driver.  
# Failed test 1701 - sprintf( "%.54g", 0.3 ) renders correctly at op/sprintf2.t line 1197
#      got "0.299999999999999988897769753748434596"
# expected eq "0.299999999999999988897769753748434595763683319091796875"
make: *** [test_harness] Error 1

error while running harness target 'test_harness': 2 at /pro/3gl/CPAN/smoke/lib/Test/Smoke/App/RunSmoke.pm line 118.
[2022-05-18 23:20:52+0200] 
[2022-05-18 23:20:52+0200] ../dist/Net-Ping/t/450_service.t............................PASSED
[2022-05-18 23:20:52+0200]     9, 18
[2022-05-18 23:20:52+0200] ../t/op/sprintf2.t..........................................FAILED
[2022-05-18 23:20:52+0200]     1701
[2022-05-18 23:20:52+0200] Archived results...
[2022-05-18 23:20:52+0200] TSTENV = perlio	
"../../../../sv_inline.h", line 487: warning #4232-D: conversion from "XPVIO *" to a more strictly aligned type "XPVMG *" may cause misaligned access
              SvSTASH_set(io, MUTABLE_HV(SvREFCNT_inc(GvHV(iogv))));
              ^

"../../../../sv_inline.h", line 468: warning #4276-D: relational operator ">" always evaluates to 'false'
              Zero(new_body, type_details->body_size, char);
              ^

"../../../../sv_inline.h", line 487: warning #4232-D: conversion from "XPVIO *" to a more strictly aligned type "XPVMG *" may cause misaligned access
              SvSTASH_set(io, MUTABLE_HV(SvREFCNT_inc(GvHV(iogv))));
              ^

"../../../../sv_inline.h", line 468: warning #4276-D: relational operator ">" always evaluates to 'false'
              Zero(new_body, type_details->body_size, char);
              ^

"../../../../sv_inline.h", line 487: warning #4232-D: conversion from "XPVIO *" to a more strictly aligned type "XPVMG *" may cause misaligned access
              SvSTASH_set(io, MUTABLE_HV(SvREFCNT_inc(GvHV(iogv))));
              ^

"../../../../sv_inline.h", line 468: warning #4276-D: relational operator ">" always evaluates to 'false'
              Zero(new_body, type_details->body_size, char);
              ^

"../../../../sv_inline.h", line 487: warning #4232-D: conversion from "XPVIO *" to a more strictly aligned type "XPVMG *" may cause misaligned access
              SvSTASH_set(io, MUTABLE_HV(SvREFCNT_inc(GvHV(iogv))));
              ^

"../../../../sv_inline.h", line 468: warning #4276-D: relational operator ">" always evaluates to 'false'
              Zero(new_body, type_details->body_size, char);
              ^

"../../../../sv_inline.h", line 487: warning #4232-D: conversion from "XPVIO *" to a more strictly aligned type "XPVMG *" may cause misaligned access
              SvSTASH_set(io, MUTABLE_HV(SvREFCNT_inc(GvHV(iogv))));
              ^

"../../../../sv_inline.h", line 468: warning #4276-D: relational operator ">" always evaluates to 'false'
              Zero(new_body, type_details->body_size, char);
              ^

"../../../../sv_inline.h", line 487: warning #4232-D: conversion from "XPVIO *" to a more strictly aligned type "XPVMG *" may cause misaligned access
              SvSTASH_set(io, MUTABLE_HV(SvREFCNT_inc(GvHV(iogv))));
              ^

"../../../../sv_inline.h", line 468: warning #4276-D: relational operator ">" always evaluates to 'false'
              Zero(new_body, type_details->body_size, char);
              ^

"../../../../sv_inline.h", line 487: warning #4232-D: conversion from "XPVIO *" to a more strictly aligned type "XPVMG *" may cause misaligned access
              SvSTASH_set(io, MUTABLE_HV(SvREFCNT_inc(GvHV(iogv))));
              ^

"../../../../sv_inline.h", line 468: warning #4276-D: relational operator ">" always evaluates to 'false'
              Zero(new_body, type_details->body_size, char);
              ^

"/pro/3gl/CPAN/perl-current/sv_inline.h", line 487: warning #4232-D: conversion from "XPVIO *" to a more strictly aligned type "XPVMG *" may cause misaligned access
              SvSTASH_set(io, MUTABLE_HV(SvREFCNT_inc(GvHV(iogv))));
              ^

"XSTest.c", line 249: warning #2111-D: statement is unreachable
  	PUTBACK;
  	^

"/pro/3gl/CPAN/perl-current/sv_inline.h", line 468: warning #4276-D: relational operator ">" always evaluates to 'false'
              Zero(new_body, type_details->body_size, char);
              ^

"/pro/3gl/CPAN/perl-current/sv_inline.h", line 487: warning #4232-D: conversion from "XPVIO *" to a more strictly aligned type "XPVMG *" may cause misaligned access
              SvSTASH_set(io, MUTABLE_HV(SvREFCNT_inc(GvHV(iogv))));
              ^

"/pro/3gl/CPAN/perl-current/sv_inline.h", line 468: warning #4276-D: relational operator ">" always evaluates to 'false'
              Zero(new_body, type_details->body_size, char);
              ^

"XSMore.xs", line 48: warning #4276-D: relational operator ">" always evaluates to 'false'
     Newx(*c, lenc+1, char);
     ^

"XSMore.xs", line 63: warning #4276-D: relational operator ">" always evaluates to 'false'
     Newx(*c, lenc+1, char);
     ^

"/pro/3gl/CPAN/perl-current/sv_inline.h", line 487: warning #4232-D: conversion from "XPVIO *" to a more strictly aligned type "XPVMG *" may cause misaligned access
              SvSTASH_set(io, MUTABLE_HV(SvREFCNT_inc(GvHV(iogv))));
              ^

"/pro/3gl/CPAN/perl-current/sv_inline.h", line 468: warning #4276-D: relational operator ">" always evaluates to 'false'
              Zero(new_body, type_details->body_size, char);
              ^

c++: error: +Z: No such file or directory
c++: error: +O2: No such file or directory
c++: error: +Onolimit: No such file or directory
"../sv_inline.h", line 487: warning #4232-D: conversion from "XPVIO *" to a more strictly aligned type "XPVMG *" may cause misaligned access
              SvSTASH_set(io, MUTABLE_HV(SvREFCNT_inc(GvHV(iogv))));
              ^

"../sv_inline.h", line 468: warning #4276-D: relational operator ">" always evaluates to 'false'
              Zero(new_body, type_details->body_size, char);
              ^

cc: warning 983: The -lc library specified on the command line is also added automatically by the compiler driver.  
# Failed test 1701 - sprintf( "%.54g", 0.3 ) renders correctly at op/sprintf2.t line 1197
#      got "0.299999999999999988897769753748434596"
# expected eq "0.299999999999999988897769753748434595763683319091796875"
# Connected to 127.0.0.1
# Connected to 127.0.0.1
Subroutine Time::HiRes::constant redefined at (eval 37) line 1.
Subroutine Time::HiRes::usleep redefined at (eval 37) line 1.
Subroutine Time::HiRes::nanosleep redefined at (eval 37) line 1.
Subroutine Time::HiRes::sleep redefined at (eval 37) line 1.
Subroutine Time::HiRes::ualarm redefined at (eval 37) line 1.
Subroutine Time::HiRes::alarm redefined at (eval 37) line 1.
Subroutine Time::HiRes::gettimeofday redefined at (eval 37) line 1.
Subroutine Time::HiRes::time redefined at (eval 37) line 1.
Subroutine Time::HiRes::setitimer redefined at (eval 37) line 1.
Subroutine Time::HiRes::getitimer redefined at (eval 37) line 1.
Subroutine Time::HiRes::utime redefined at (eval 37) line 1.
Subroutine Time::HiRes::clock_gettime redefined at (eval 37) line 1.
Subroutine Time::HiRes::clock_getres redefined at (eval 37) line 1.
Subroutine Time::HiRes::clock_nanosleep redefined at (eval 37) line 1.
Subroutine Time::HiRes::clock redefined at (eval 37) line 1.
Subroutine Time::HiRes::lstat redefined at (eval 37) line 1.
Subroutine Time::HiRes::stat redefined at (eval 37) line 1.
Cannot figure out an encoding to use at t/use-Encode-Alias.t line 5.
Integer overflow in hexadecimal number at t/broken_univ_can.t line 13.
make: *** [test_harness] Error 1

error while running harness target 'test_harness': 2 at /pro/3gl/CPAN/smoke/lib/Test/Smoke/App/RunSmoke.pm line 118.
[2022-05-18 23:34:57+0200] 
[2022-05-18 23:34:57+0200] ../dist/Net-Ping/t/450_service.t............................PASSED
[2022-05-18 23:34:57+0200]     9, 18
[2022-05-18 23:34:57+0200] ../t/op/sprintf2.t..........................................FAILED
[2022-05-18 23:34:57+0200]     1701
[2022-05-18 23:34:57+0200] Archived results...
[2022-05-18 23:34:57+0200] TSTENV = locale:en_US.utf8	
"../../../../sv_inline.h", line 487: warning #4232-D: conversion from "XPVIO *" to a more strictly aligned type "XPVMG *" may cause misaligned access
              SvSTASH_set(io, MUTABLE_HV(SvREFCNT_inc(GvHV(iogv))));
              ^

"../../../../sv_inline.h", line 468: warning #4276-D: relational operator ">" always evaluates to 'false'
              Zero(new_body, type_details->body_size, char);
              ^

"../../../../sv_inline.h", line 487: warning #4232-D: conversion from "XPVIO *" to a more strictly aligned type "XPVMG *" may cause misaligned access
              SvSTASH_set(io, MUTABLE_HV(SvREFCNT_inc(GvHV(iogv))));
              ^

"../../../../sv_inline.h", line 468: warning #4276-D: relational operator ">" always evaluates to 'false'
              Zero(new_body, type_details->body_size, char);
              ^

"../../../../sv_inline.h", line 487: warning #4232-D: conversion from "XPVIO *" to a more strictly aligned type "XPVMG *" may cause misaligned access
              SvSTASH_set(io, MUTABLE_HV(SvREFCNT_inc(GvHV(iogv))));
              ^

"../../../../sv_inline.h", line 468: warning #4276-D: relational operator ">" always evaluates to 'false'
              Zero(new_body, type_details->body_size, char);
              ^

"../../../../sv_inline.h", line 487: warning #4232-D: conversion from "XPVIO *" to a more strictly aligned type "XPVMG *" may cause misaligned access
              SvSTASH_set(io, MUTABLE_HV(SvREFCNT_inc(GvHV(iogv))));
              ^

"../../../../sv_inline.h", line 468: warning #4276-D: relational operator ">" always evaluates to 'false'
              Zero(new_body, type_details->body_size, char);
              ^

"../../../../sv_inline.h", line 487: warning #4232-D: conversion from "XPVIO *" to a more strictly aligned type "XPVMG *" may cause misaligned access
              SvSTASH_set(io, MUTABLE_HV(SvREFCNT_inc(GvHV(iogv))));
              ^

"../../../../sv_inline.h", line 468: warning #4276-D: relational operator ">" always evaluates to 'false'
              Zero(new_body, type_details->body_size, char);
              ^

"../../../../sv_inline.h", line 487: warning #4232-D: conversion from "XPVIO *" to a more strictly aligned type "XPVMG *" may cause misaligned access
              SvSTASH_set(io, MUTABLE_HV(SvREFCNT_inc(GvHV(iogv))));
              ^

"../../../../sv_inline.h", line 468: warning #4276-D: relational operator ">" always evaluates to 'false'
              Zero(new_body, type_details->body_size, char);
              ^

"../../../../sv_inline.h", line 487: warning #4232-D: conversion from "XPVIO *" to a more strictly aligned type "XPVMG *" may cause misaligned access
              SvSTASH_set(io, MUTABLE_HV(SvREFCNT_inc(GvHV(iogv))));
              ^

"../../../../sv_inline.h", line 468: warning #4276-D: relational operator ">" always evaluates to 'false'
              Zero(new_body, type_details->body_size, char);
              ^

"/pro/3gl/CPAN/perl-current/sv_inline.h", line 487: warning #4232-D: conversion from "XPVIO *" to a more strictly aligned type "XPVMG *" may cause misaligned access
              SvSTASH_set(io, MUTABLE_HV(SvREFCNT_inc(GvHV(iogv))));
              ^

"XSTest.c", line 249: warning #2111-D: statement is unreachable
  	PUTBACK;
  	^

"/pro/3gl/CPAN/perl-current/sv_inline.h", line 468: warning #4276-D: relational operator ">" always evaluates to 'false'
              Zero(new_body, type_details->body_size, char);
              ^

"/pro/3gl/CPAN/perl-current/sv_inline.h", line 487: warning #4232-D: conversion from "XPVIO *" to a more strictly aligned type "XPVMG *" may cause misaligned access
              SvSTASH_set(io, MUTABLE_HV(SvREFCNT_inc(GvHV(iogv))));
              ^

"/pro/3gl/CPAN/perl-current/sv_inline.h", line 468: warning #4276-D: relational operator ">" always evaluates to 'false'
              Zero(new_body, type_details->body_size, char);
              ^

"XSMore.xs", line 48: warning #4276-D: relational operator ">" always evaluates to 'false'
     Newx(*c, lenc+1, char);
     ^

"XSMore.xs", line 63: warning #4276-D: relational operator ">" always evaluates to 'false'
     Newx(*c, lenc+1, char);
     ^

"/pro/3gl/CPAN/perl-current/sv_inline.h", line 487: warning #4232-D: conversion from "XPVIO *" to a more strictly aligned type "XPVMG *" may cause misaligned access
              SvSTASH_set(io, MUTABLE_HV(SvREFCNT_inc(GvHV(iogv))));
              ^

"/pro/3gl/CPAN/perl-current/sv_inline.h", line 468: warning #4276-D: relational operator ">" always evaluates to 'false'
              Zero(new_body, type_details->body_size, char);
              ^

c++: error: +Z: No such file or directory
c++: error: +O2: No such file or directory
c++: error: +Onolimit: No such file or directory
"../sv_inline.h", line 487: warning #4232-D: conversion from "XPVIO *" to a more strictly aligned type "XPVMG *" may cause misaligned access
              SvSTASH_set(io, MUTABLE_HV(SvREFCNT_inc(GvHV(iogv))));
              ^

"../sv_inline.h", line 468: warning #4276-D: relational operator ">" always evaluates to 'false'
              Zero(new_body, type_details->body_size, char);
              ^

cc: warning 983: The -lc library specified on the command line is also added automatically by the compiler driver.  
# Failed test 1701 - sprintf( "%.54g", 0.3 ) renders correctly at op/sprintf2.t line 1197
#      got "0.299999999999999988897769753748434596"
# expected eq "0.299999999999999988897769753748434595763683319091796875"
Subroutine Time::HiRes::constant redefined at (eval 37) line 1.
Subroutine Time::HiRes::usleep redefined at (eval 37) line 1.
Subroutine Time::HiRes::nanosleep redefined at (eval 37) line 1.
Subroutine Time::HiRes::sleep redefined at (eval 37) line 1.
Subroutine Time::HiRes::ualarm redefined at (eval 37) line 1.
Subroutine Time::HiRes::alarm redefined at (eval 37) line 1.
Subroutine Time::HiRes::gettimeofday redefined at (eval 37) line 1.
Subroutine Time::HiRes::time redefined at (eval 37) line 1.
Subroutine Time::HiRes::setitimer redefined at (eval 37) line 1.
Subroutine Time::HiRes::getitimer redefined at (eval 37) line 1.
Subroutine Time::HiRes::utime redefined at (eval 37) line 1.
Subroutine Time::HiRes::clock_gettime redefined at (eval 37) line 1.
Subroutine Time::HiRes::clock_getres redefined at (eval 37) line 1.
Subroutine Time::HiRes::clock_nanosleep redefined at (eval 37) line 1.
Subroutine Time::HiRes::clock redefined at (eval 37) line 1.
Subroutine Time::HiRes::lstat redefined at (eval 37) line 1.
Subroutine Time::HiRes::stat redefined at (eval 37) line 1.
# Connected to 127.0.0.1
# Connected to 127.0.0.1
Integer overflow in hexadecimal number at t/broken_univ_can.t line 13.
make: *** [test_harness] Error 1

error while running harness target 'test_harness': 2 at /pro/3gl/CPAN/smoke/lib/Test/Smoke/App/RunSmoke.pm line 118.
[2022-05-18 23:48:54+0200] 
[2022-05-18 23:48:54+0200] ../dist/Net-Ping/t/450_service.t............................PASSED
[2022-05-18 23:48:54+0200]     9, 18
[2022-05-18 23:48:54+0200] ../t/op/sprintf2.t..........................................FAILED
[2022-05-18 23:48:54+0200]     1701
[2022-05-18 23:48:54+0200] Archived results...
[2022-05-18 23:48:54+0200] Unskip tests from '/pro/3gl/CPAN/smoke/p59.skip'
[2022-05-18 23:48:54+0200] 
[2022-05-18 23:48:54+0200] Configuration: -Dusedevel -DDEBUGGING
[2022-05-18 23:48:54+0200] ------------------------------------------------------------------------------
[2022-05-18 23:48:54+0200] make distclean ...
[2022-05-18 23:49:33+0200] 
[2022-05-18 23:49:33+0200] Copy Policy.sh ...
[2022-05-18 23:49:33+0200] 
[2022-05-18 23:49:33+0200] Configure ...
[2022-05-18 23:51:08+0200] 
[2022-05-18 23:51:08+0200] make ...
[2022-05-19 00:13:02+0200] Skip tests from '/pro/3gl/CPAN/smoke/p59.skip'
[2022-05-19 00:13:02+0200] 	cpan/Sys-Syslog/t/syslog.t
[2022-05-19 00:13:02+0200] 
[2022-05-19 00:13:02+0200]  Tests start here:
[2022-05-19 00:13:02+0200] TSTENV = stdio	
No saved state, selection will be empty
Cannot figure out an encoding to use at t/use-Encode-Alias.t line 5.
"../../../../sv_inline.h", line 487: warning #4232-D: conversion from "XPVIO *" to a more strictly aligned type "XPVMG *" may cause misaligned access
              SvSTASH_set(io, MUTABLE_HV(SvREFCNT_inc(GvHV(iogv))));
              ^

"../../../../sv_inline.h", line 468: warning #4276-D: relational operator ">" always evaluates to 'false'
              Zero(new_body, type_details->body_size, char);
              ^

"../../../../sv_inline.h", line 487: warning #4232-D: conversion from "XPVIO *" to a more strictly aligned type "XPVMG *" may cause misaligned access
              SvSTASH_set(io, MUTABLE_HV(SvREFCNT_inc(GvHV(iogv))));
              ^

"../../../../sv_inline.h", line 468: warning #4276-D: relational operator ">" always evaluates to 'false'
              Zero(new_body, type_details->body_size, char);
              ^

"../../../../sv_inline.h", line 487: warning #4232-D: conversion from "XPVIO *" to a more strictly aligned type "XPVMG *" may cause misaligned access
              SvSTASH_set(io, MUTABLE_HV(SvREFCNT_inc(GvHV(iogv))));
              ^

"../../../../sv_inline.h", line 468: warning #4276-D: relational operator ">" always evaluates to 'false'
              Zero(new_body, type_details->body_size, char);
              ^

"../../../../sv_inline.h", line 487: warning #4232-D: conversion from "XPVIO *" to a more strictly aligned type "XPVMG *" may cause misaligned access
              SvSTASH_set(io, MUTABLE_HV(SvREFCNT_inc(GvHV(iogv))));
              ^

"../../../../sv_inline.h", line 468: warning #4276-D: relational operator ">" always evaluates to 'false'
              Zero(new_body, type_details->body_size, char);
              ^

"../../../../sv_inline.h", line 487: warning #4232-D: conversion from "XPVIO *" to a more strictly aligned type "XPVMG *" may cause misaligned access
              SvSTASH_set(io, MUTABLE_HV(SvREFCNT_inc(GvHV(iogv))));
              ^

"../../../../sv_inline.h", line 468: warning #4276-D: relational operator ">" always evaluates to 'false'
              Zero(new_body, type_details->body_size, char);
              ^

"../../../../sv_inline.h", line 487: warning #4232-D: conversion from "XPVIO *" to a more strictly aligned type "XPVMG *" may cause misaligned access
              SvSTASH_set(io, MUTABLE_HV(SvREFCNT_inc(GvHV(iogv))));
              ^

"../../../../sv_inline.h", line 468: warning #4276-D: relational operator ">" always evaluates to 'false'
              Zero(new_body, type_details->body_size, char);
              ^

"../../../../sv_inline.h", line 487: warning #4232-D: conversion from "XPVIO *" to a more strictly aligned type "XPVMG *" may cause misaligned access
              SvSTASH_set(io, MUTABLE_HV(SvREFCNT_inc(GvHV(iogv))));
              ^

"../../../../sv_inline.h", line 468: warning #4276-D: relational operator ">" always evaluates to 'false'
              Zero(new_body, type_details->body_size, char);
              ^

# Connected to 127.0.0.1
# Connected to 127.0.0.1
Integer overflow in hexadecimal number at t/broken_univ_can.t line 13.
Redefining sub xChild::foo at xChild--9755 line 2.
Redefining sub Data::ok at -e line 1.
"/pro/3gl/CPAN/perl-current/sv_inline.h", line 487: warning #4232-D: conversion from "XPVIO *" to a more strictly aligned type "XPVMG *" may cause misaligned access
              SvSTASH_set(io, MUTABLE_HV(SvREFCNT_inc(GvHV(iogv))));
              ^

"XSTest.c", line 249: warning #2111-D: statement is unreachable
  	PUTBACK;
  	^

"/pro/3gl/CPAN/perl-current/sv_inline.h", line 468: warning #4276-D: relational operator ">" always evaluates to 'false'
              Zero(new_body, type_details->body_size, char);
              ^

c++: error: +Z: No such file or directory
c++: error: +O2: No such file or directory
c++: error: +Onolimit: No such file or directory
"/pro/3gl/CPAN/perl-current/sv_inline.h", line 487: warning #4232-D: conversion from "XPVIO *" to a more strictly aligned type "XPVMG *" may cause misaligned access
              SvSTASH_set(io, MUTABLE_HV(SvREFCNT_inc(GvHV(iogv))));
              ^

"/pro/3gl/CPAN/perl-current/sv_inline.h", line 468: warning #4276-D: relational operator ">" always evaluates to 'false'
              Zero(new_body, type_details->body_size, char);
              ^

"XSMore.xs", line 48: warning #4276-D: relational operator ">" always evaluates to 'false'
     Newx(*c, lenc+1, char);
     ^

"XSMore.xs", line 63: warning #4276-D: relational operator ">" always evaluates to 'false'
     Newx(*c, lenc+1, char);
     ^

"/pro/3gl/CPAN/perl-current/sv_inline.h", line 487: warning #4232-D: conversion from "XPVIO *" to a more strictly aligned type "XPVMG *" may cause misaligned access
              SvSTASH_set(io, MUTABLE_HV(SvREFCNT_inc(GvHV(iogv))));
              ^

"/pro/3gl/CPAN/perl-current/sv_inline.h", line 468: warning #4276-D: relational operator ">" always evaluates to 'false'
              Zero(new_body, type_details->body_size, char);
              ^

Subroutine Time::HiRes::constant redefined at (eval 37) line 1.
Subroutine Time::HiRes::usleep redefined at (eval 37) line 1.
Subroutine Time::HiRes::nanosleep redefined at (eval 37) line 1.
Subroutine Time::HiRes::sleep redefined at (eval 37) line 1.
Subroutine Time::HiRes::ualarm redefined at (eval 37) line 1.
Subroutine Time::HiRes::alarm redefined at (eval 37) line 1.
Subroutine Time::HiRes::gettimeofday redefined at (eval 37) line 1.
Subroutine Time::HiRes::time redefined at (eval 37) line 1.
Subroutine Time::HiRes::setitimer redefined at (eval 37) line 1.
Subroutine Time::HiRes::getitimer redefined at (eval 37) line 1.
Subroutine Time::HiRes::utime redefined at (eval 37) line 1.
Subroutine Time::HiRes::clock_gettime redefined at (eval 37) line 1.
Subroutine Time::HiRes::clock_getres redefined at (eval 37) line 1.
Subroutine Time::HiRes::clock_nanosleep redefined at (eval 37) line 1.
Subroutine Time::HiRes::clock redefined at (eval 37) line 1.
Subroutine Time::HiRes::lstat redefined at (eval 37) line 1.
Subroutine Time::HiRes::stat redefined at (eval 37) line 1.
"../sv_inline.h", line 487: warning #4232-D: conversion from "XPVIO *" to a more strictly aligned type "XPVMG *" may cause misaligned access
              SvSTASH_set(io, MUTABLE_HV(SvREFCNT_inc(GvHV(iogv))));
              ^

"../sv_inline.h", line 468: warning #4276-D: relational operator ">" always evaluates to 'false'
              Zero(new_body, type_details->body_size, char);
              ^

cc: warning 983: The -lc library specified on the command line is also added automatically by the compiler driver.  
# Failed test 1701 - sprintf( "%.54g", 0.3 ) renders correctly at op/sprintf2.t line 1197
#      got "0.299999999999999988897769753748434596"
# expected eq "0.299999999999999988897769753748434595763683319091796875"
make: *** [test_harness] Error 1

error while running harness target 'test_harness': 2 at /pro/3gl/CPAN/smoke/lib/Test/Smoke/App/RunSmoke.pm line 118.
[2022-05-19 00:31:26+0200] 
[2022-05-19 00:31:26+0200] ../dist/Net-Ping/t/450_service.t............................PASSED
[2022-05-19 00:31:26+0200]     9, 18
[2022-05-19 00:31:26+0200] ../t/op/sprintf2.t..........................................FAILED
[2022-05-19 00:31:26+0200]     1701
[2022-05-19 00:31:26+0200] Archived results...
[2022-05-19 00:31:26+0200] TSTENV = perlio	
"../../../../sv_inline.h", line 487: warning #4232-D: conversion from "XPVIO *" to a more strictly aligned type "XPVMG *" may cause misaligned access
              SvSTASH_set(io, MUTABLE_HV(SvREFCNT_inc(GvHV(iogv))));
              ^

"../../../../sv_inline.h", line 468: warning #4276-D: relational operator ">" always evaluates to 'false'
              Zero(new_body, type_details->body_size, char);
              ^

"../../../../sv_inline.h", line 487: warning #4232-D: conversion from "XPVIO *" to a more strictly aligned type "XPVMG *" may cause misaligned access
              SvSTASH_set(io, MUTABLE_HV(SvREFCNT_inc(GvHV(iogv))));
              ^

"../../../../sv_inline.h", line 468: warning #4276-D: relational operator ">" always evaluates to 'false'
              Zero(new_body, type_details->body_size, char);
              ^

"../../../../sv_inline.h", line 487: warning #4232-D: conversion from "XPVIO *" to a more strictly aligned type "XPVMG *" may cause misaligned access
              SvSTASH_set(io, MUTABLE_HV(SvREFCNT_inc(GvHV(iogv))));
              ^

"../../../../sv_inline.h", line 468: warning #4276-D: relational operator ">" always evaluates to 'false'
              Zero(new_body, type_details->body_size, char);
              ^

"../../../../sv_inline.h", line 487: warning #4232-D: conversion from "XPVIO *" to a more strictly aligned type "XPVMG *" may cause misaligned access
              SvSTASH_set(io, MUTABLE_HV(SvREFCNT_inc(GvHV(iogv))));
              ^

"../../../../sv_inline.h", line 468: warning #4276-D: relational operator ">" always evaluates to 'false'
              Zero(new_body, type_details->body_size, char);
              ^

"../../../../sv_inline.h", line 487: warning #4232-D: conversion from "XPVIO *" to a more strictly aligned type "XPVMG *" may cause misaligned access
              SvSTASH_set(io, MUTABLE_HV(SvREFCNT_inc(GvHV(iogv))));
              ^

"../../../../sv_inline.h", line 468: warning #4276-D: relational operator ">" always evaluates to 'false'
              Zero(new_body, type_details->body_size, char);
              ^

"../../../../sv_inline.h", line 487: warning #4232-D: conversion from "XPVIO *" to a more strictly aligned type "XPVMG *" may cause misaligned access
              SvSTASH_set(io, MUTABLE_HV(SvREFCNT_inc(GvHV(iogv))));
              ^

"../../../../sv_inline.h", line 468: warning #4276-D: relational operator ">" always evaluates to 'false'
              Zero(new_body, type_details->body_size, char);
              ^

"../../../../sv_inline.h", line 487: warning #4232-D: conversion from "XPVIO *" to a more strictly aligned type "XPVMG *" may cause misaligned access
              SvSTASH_set(io, MUTABLE_HV(SvREFCNT_inc(GvHV(iogv))));
              ^

"../../../../sv_inline.h", line 468: warning #4276-D: relational operator ">" always evaluates to 'false'
              Zero(new_body, type_details->body_size, char);
              ^

"/pro/3gl/CPAN/perl-current/sv_inline.h", line 487: warning #4232-D: conversion from "XPVIO *" to a more strictly aligned type "XPVMG *" may cause misaligned access
              SvSTASH_set(io, MUTABLE_HV(SvREFCNT_inc(GvHV(iogv))));
              ^

"XSTest.c", line 249: warning #2111-D: statement is unreachable
  	PUTBACK;
  	^

"/pro/3gl/CPAN/perl-current/sv_inline.h", line 468: warning #4276-D: relational operator ">" always evaluates to 'false'
              Zero(new_body, type_details->body_size, char);
              ^

"/pro/3gl/CPAN/perl-current/sv_inline.h", line 487: warning #4232-D: conversion from "XPVIO *" to a more strictly aligned type "XPVMG *" may cause misaligned access
              SvSTASH_set(io, MUTABLE_HV(SvREFCNT_inc(GvHV(iogv))));
              ^

"/pro/3gl/CPAN/perl-current/sv_inline.h", line 468: warning #4276-D: relational operator ">" always evaluates to 'false'
              Zero(new_body, type_details->body_size, char);
              ^

"XSMore.xs", line 48: warning #4276-D: relational operator ">" always evaluates to 'false'
     Newx(*c, lenc+1, char);
     ^

"XSMore.xs", line 63: warning #4276-D: relational operator ">" always evaluates to 'false'
     Newx(*c, lenc+1, char);
     ^

"/pro/3gl/CPAN/perl-current/sv_inline.h", line 487: warning #4232-D: conversion from "XPVIO *" to a more strictly aligned type "XPVMG *" may cause misaligned access
              SvSTASH_set(io, MUTABLE_HV(SvREFCNT_inc(GvHV(iogv))));
              ^

"/pro/3gl/CPAN/perl-current/sv_inline.h", line 468: warning #4276-D: relational operator ">" always evaluates to 'false'
              Zero(new_body, type_details->body_size, char);
              ^

c++: error: +Z: No such file or directory
c++: error: +O2: No such file or directory
c++: error: +Onolimit: No such file or directory
"../sv_inline.h", line 487: warning #4232-D: conversion from "XPVIO *" to a more strictly aligned type "XPVMG *" may cause misaligned access
              SvSTASH_set(io, MUTABLE_HV(SvREFCNT_inc(GvHV(iogv))));
              ^

"../sv_inline.h", line 468: warning #4276-D: relational operator ">" always evaluates to 'false'
              Zero(new_body, type_details->body_size, char);
              ^

cc: warning 983: The -lc library specified on the command line is also added automatically by the compiler driver.  
# Failed test 1701 - sprintf( "%.54g", 0.3 ) renders correctly at op/sprintf2.t line 1197
#      got "0.299999999999999988897769753748434596"
# expected eq "0.299999999999999988897769753748434595763683319091796875"
# Connected to 127.0.0.1
# Connected to 127.0.0.1
Subroutine Time::HiRes::constant redefined at (eval 37) line 1.
Subroutine Time::HiRes::usleep redefined at (eval 37) line 1.
Subroutine Time::HiRes::nanosleep redefined at (eval 37) line 1.
Subroutine Time::HiRes::sleep redefined at (eval 37) line 1.
Subroutine Time::HiRes::ualarm redefined at (eval 37) line 1.
Subroutine Time::HiRes::alarm redefined at (eval 37) line 1.
Subroutine Time::HiRes::gettimeofday redefined at (eval 37) line 1.
Subroutine Time::HiRes::time redefined at (eval 37) line 1.
Subroutine Time::HiRes::setitimer redefined at (eval 37) line 1.
Subroutine Time::HiRes::getitimer redefined at (eval 37) line 1.
Subroutine Time::HiRes::utime redefined at (eval 37) line 1.
Subroutine Time::HiRes::clock_gettime redefined at (eval 37) line 1.
Subroutine Time::HiRes::clock_getres redefined at (eval 37) line 1.
Subroutine Time::HiRes::clock_nanosleep redefined at (eval 37) line 1.
Subroutine Time::HiRes::clock redefined at (eval 37) line 1.
Subroutine Time::HiRes::lstat redefined at (eval 37) line 1.
Subroutine Time::HiRes::stat redefined at (eval 37) line 1.
Cannot figure out an encoding to use at t/use-Encode-Alias.t line 5.
Integer overflow in hexadecimal number at t/broken_univ_can.t line 13.
make: *** [test_harness] Error 1

error while running harness target 'test_harness': 2 at /pro/3gl/CPAN/smoke/lib/Test/Smoke/App/RunSmoke.pm line 118.
[2022-05-19 00:47:18+0200] 
[2022-05-19 00:47:18+0200] ../dist/Net-Ping/t/450_service.t............................PASSED
[2022-05-19 00:47:18+0200]     9, 18
[2022-05-19 00:47:18+0200] ../t/op/sprintf2.t..........................................FAILED
[2022-05-19 00:47:18+0200]     1701
[2022-05-19 00:47:18+0200] Archived results...
[2022-05-19 00:47:18+0200] TSTENV = locale:en_US.utf8	
"../../../../sv_inline.h", line 487: warning #4232-D: conversion from "XPVIO *" to a more strictly aligned type "XPVMG *" may cause misaligned access
              SvSTASH_set(io, MUTABLE_HV(SvREFCNT_inc(GvHV(iogv))));
              ^

"../../../../sv_inline.h", line 468: warning #4276-D: relational operator ">" always evaluates to 'false'
              Zero(new_body, type_details->body_size, char);
              ^

"../../../../sv_inline.h", line 487: warning #4232-D: conversion from "XPVIO *" to a more strictly aligned type "XPVMG *" may cause misaligned access
              SvSTASH_set(io, MUTABLE_HV(SvREFCNT_inc(GvHV(iogv))));
              ^

"../../../../sv_inline.h", line 468: warning #4276-D: relational operator ">" always evaluates to 'false'
              Zero(new_body, type_details->body_size, char);
              ^

"../../../../sv_inline.h", line 487: warning #4232-D: conversion from "XPVIO *" to a more strictly aligned type "XPVMG *" may cause misaligned access
              SvSTASH_set(io, MUTABLE_HV(SvREFCNT_inc(GvHV(iogv))));
              ^

"../../../../sv_inline.h", line 468: warning #4276-D: relational operator ">" always evaluates to 'false'
              Zero(new_body, type_details->body_size, char);
              ^

"../../../../sv_inline.h", line 487: warning #4232-D: conversion from "XPVIO *" to a more strictly aligned type "XPVMG *" may cause misaligned access
              SvSTASH_set(io, MUTABLE_HV(SvREFCNT_inc(GvHV(iogv))));
              ^

"../../../../sv_inline.h", line 468: warning #4276-D: relational operator ">" always evaluates to 'false'
              Zero(new_body, type_details->body_size, char);
              ^

"../../../../sv_inline.h", line 487: warning #4232-D: conversion from "XPVIO *" to a more strictly aligned type "XPVMG *" may cause misaligned access
              SvSTASH_set(io, MUTABLE_HV(SvREFCNT_inc(GvHV(iogv))));
              ^

"../../../../sv_inline.h", line 468: warning #4276-D: relational operator ">" always evaluates to 'false'
              Zero(new_body, type_details->body_size, char);
              ^

"../../../../sv_inline.h", line 487: warning #4232-D: conversion from "XPVIO *" to a more strictly aligned type "XPVMG *" may cause misaligned access
              SvSTASH_set(io, MUTABLE_HV(SvREFCNT_inc(GvHV(iogv))));
              ^

"../../../../sv_inline.h", line 468: warning #4276-D: relational operator ">" always evaluates to 'false'
              Zero(new_body, type_details->body_size, char);
              ^

"../../../../sv_inline.h", line 487: warning #4232-D: conversion from "XPVIO *" to a more strictly aligned type "XPVMG *" may cause misaligned access
              SvSTASH_set(io, MUTABLE_HV(SvREFCNT_inc(GvHV(iogv))));
              ^

"../../../../sv_inline.h", line 468: warning #4276-D: relational operator ">" always evaluates to 'false'
              Zero(new_body, type_details->body_size, char);
              ^

"/pro/3gl/CPAN/perl-current/sv_inline.h", line 487: warning #4232-D: conversion from "XPVIO *" to a more strictly aligned type "XPVMG *" may cause misaligned access
              SvSTASH_set(io, MUTABLE_HV(SvREFCNT_inc(GvHV(iogv))));
              ^

"XSTest.c", line 249: warning #2111-D: statement is unreachable
  	PUTBACK;
  	^

"/pro/3gl/CPAN/perl-current/sv_inline.h", line 468: warning #4276-D: relational operator ">" always evaluates to 'false'
              Zero(new_body, type_details->body_size, char);
              ^

"/pro/3gl/CPAN/perl-current/sv_inline.h", line 487: warning #4232-D: conversion from "XPVIO *" to a more strictly aligned type "XPVMG *" may cause misaligned access
              SvSTASH_set(io, MUTABLE_HV(SvREFCNT_inc(GvHV(iogv))));
              ^

"/pro/3gl/CPAN/perl-current/sv_inline.h", line 468: warning #4276-D: relational operator ">" always evaluates to 'false'
              Zero(new_body, type_details->body_size, char);
              ^

"XSMore.xs", line 48: warning #4276-D: relational operator ">" always evaluates to 'false'
     Newx(*c, lenc+1, char);
     ^

"XSMore.xs", line 63: warning #4276-D: relational operator ">" always evaluates to 'false'
     Newx(*c, lenc+1, char);
     ^

"/pro/3gl/CPAN/perl-current/sv_inline.h", line 487: warning #4232-D: conversion from "XPVIO *" to a more strictly aligned type "XPVMG *" may cause misaligned access
              SvSTASH_set(io, MUTABLE_HV(SvREFCNT_inc(GvHV(iogv))));
              ^

"/pro/3gl/CPAN/perl-current/sv_inline.h", line 468: warning #4276-D: relational operator ">" always evaluates to 'false'
              Zero(new_body, type_details->body_size, char);
              ^

c++: error: +Z: No such file or directory
c++: error: +O2: No such file or directory
c++: error: +Onolimit: No such file or directory
"../sv_inline.h", line 487: warning #4232-D: conversion from "XPVIO *" to a more strictly aligned type "XPVMG *" may cause misaligned access
              SvSTASH_set(io, MUTABLE_HV(SvREFCNT_inc(GvHV(iogv))));
              ^

"../sv_inline.h", line 468: warning #4276-D: relational operator ">" always evaluates to 'false'
              Zero(new_body, type_details->body_size, char);
              ^

cc: warning 983: The -lc library specified on the command line is also added automatically by the compiler driver.  
# Failed test 1701 - sprintf( "%.54g", 0.3 ) renders correctly at op/sprintf2.t line 1197
#      got "0.299999999999999988897769753748434596"
# expected eq "0.299999999999999988897769753748434595763683319091796875"
Subroutine Time::HiRes::constant redefined at (eval 37) line 1.
Subroutine Time::HiRes::usleep redefined at (eval 37) line 1.
Subroutine Time::HiRes::nanosleep redefined at (eval 37) line 1.
Subroutine Time::HiRes::sleep redefined at (eval 37) line 1.
Subroutine Time::HiRes::ualarm redefined at (eval 37) line 1.
Subroutine Time::HiRes::alarm redefined at (eval 37) line 1.
Subroutine Time::HiRes::gettimeofday redefined at (eval 37) line 1.
Subroutine Time::HiRes::time redefined at (eval 37) line 1.
Subroutine Time::HiRes::setitimer redefined at (eval 37) line 1.
Subroutine Time::HiRes::getitimer redefined at (eval 37) line 1.
Subroutine Time::HiRes::utime redefined at (eval 37) line 1.
Subroutine Time::HiRes::clock_gettime redefined at (eval 37) line 1.
Subroutine Time::HiRes::clock_getres redefined at (eval 37) line 1.
Subroutine Time::HiRes::clock_nanosleep redefined at (eval 37) line 1.
Subroutine Time::HiRes::clock redefined at (eval 37) line 1.
Subroutine Time::HiRes::lstat redefined at (eval 37) line 1.
Subroutine Time::HiRes::stat redefined at (eval 37) line 1.
# Connected to 127.0.0.1
# Connected to 127.0.0.1
Integer overflow in hexadecimal number at t/broken_univ_can.t line 13.
make: *** [test_harness] Error 1

error while running harness target 'test_harness': 2 at /pro/3gl/CPAN/smoke/lib/Test/Smoke/App/RunSmoke.pm line 118.
[2022-05-19 01:03:24+0200] 
[2022-05-19 01:03:24+0200] ../dist/Net-Ping/t/450_service.t............................PASSED
[2022-05-19 01:03:24+0200]     9, 18
[2022-05-19 01:03:24+0200] ../t/op/sprintf2.t..........................................FAILED
[2022-05-19 01:03:24+0200]     1701
[2022-05-19 01:03:24+0200] Archived results...
[2022-05-19 01:03:24+0200] Unskip tests from '/pro/3gl/CPAN/smoke/p59.skip'
[2022-05-19 01:03:24+0200] 
[2022-05-19 01:03:24+0200] Configuration: -Dusedevel -Duse64bitall
[2022-05-19 01:03:24+0200] ------------------------------------------------------------------------------
[2022-05-19 01:03:24+0200] make distclean ...
[2022-05-19 01:04:08+0200] 
[2022-05-19 01:04:08+0200] Copy Policy.sh ...
[2022-05-19 01:04:08+0200] 
[2022-05-19 01:04:08+0200] Configure ...
[2022-05-19 01:05:40+0200] 
[2022-05-19 01:05:40+0200] make ...
[2022-05-19 01:23:11+0200] Skip tests from '/pro/3gl/CPAN/smoke/p59.skip'
[2022-05-19 01:23:11+0200] 	cpan/Sys-Syslog/t/syslog.t
[2022-05-19 01:23:12+0200] 
[2022-05-19 01:23:12+0200]  Tests start here:
[2022-05-19 01:23:12+0200] TSTENV = stdio	
No saved state, selection will be empty
Cannot figure out an encoding to use at t/use-Encode-Alias.t line 5.
"../../../../sv_inline.h", line 468: warning #4276-D: relational operator ">" always evaluates to 'false'
              Zero(new_body, type_details->body_size, char);
              ^

"../../../../sv_inline.h", line 468: warning #4276-D: relational operator ">" always evaluates to 'false'
              Zero(new_body, type_details->body_size, char);
              ^

"../../../../sv_inline.h", line 468: warning #4276-D: relational operator ">" always evaluates to 'false'
              Zero(new_body, type_details->body_size, char);
              ^

"../../../../sv_inline.h", line 468: warning #4276-D: relational operator ">" always evaluates to 'false'
              Zero(new_body, type_details->body_size, char);
              ^

"../../../../sv_inline.h", line 468: warning #4276-D: relational operator ">" always evaluates to 'false'
              Zero(new_body, type_details->body_size, char);
              ^

"../../../../sv_inline.h", line 468: warning #4276-D: relational operator ">" always evaluates to 'false'
              Zero(new_body, type_details->body_size, char);
              ^

"../../../../sv_inline.h", line 468: warning #4276-D: relational operator ">" always evaluates to 'false'
              Zero(new_body, type_details->body_size, char);
              ^

# Connected to 127.0.0.1
# Connected to 127.0.0.1
Redefining sub xChild::foo at xChild--18001 line 2.
Redefining sub Data::ok at -e line 1.
"XSTest.c", line 249: warning #2111-D: statement is unreachable
  	PUTBACK;
  	^

"/pro/3gl/CPAN/perl-current/sv_inline.h", line 468: warning #4276-D: relational operator ">" always evaluates to 'false'
              Zero(new_body, type_details->body_size, char);
              ^

c++: error: +Z: No such file or directory
c++: error: +O2: No such file or directory
c++: error: +Onolimit: No such file or directory
"/pro/3gl/CPAN/perl-current/sv_inline.h", line 468: warning #4276-D: relational operator ">" always evaluates to 'false'
              Zero(new_body, type_details->body_size, char);
              ^

"XSMore.xs", line 48: warning #4276-D: relational operator ">" always evaluates to 'false'
     Newx(*c, lenc+1, char);
     ^

"XSMore.xs", line 63: warning #4276-D: relational operator ">" always evaluates to 'false'
     Newx(*c, lenc+1, char);
     ^

"/pro/3gl/CPAN/perl-current/sv_inline.h", line 468: warning #4276-D: relational operator ">" always evaluates to 'false'
              Zero(new_body, type_details->body_size, char);
              ^

Subroutine Time::HiRes::constant redefined at (eval 37) line 1.
Subroutine Time::HiRes::usleep redefined at (eval 37) line 1.
Subroutine Time::HiRes::nanosleep redefined at (eval 37) line 1.
Subroutine Time::HiRes::sleep redefined at (eval 37) line 1.
Subroutine Time::HiRes::ualarm redefined at (eval 37) line 1.
Subroutine Time::HiRes::alarm redefined at (eval 37) line 1.
Subroutine Time::HiRes::gettimeofday redefined at (eval 37) line 1.
Subroutine Time::HiRes::time redefined at (eval 37) line 1.
Subroutine Time::HiRes::setitimer redefined at (eval 37) line 1.
Subroutine Time::HiRes::getitimer redefined at (eval 37) line 1.
Subroutine Time::HiRes::utime redefined at (eval 37) line 1.
Subroutine Time::HiRes::clock_gettime redefined at (eval 37) line 1.
Subroutine Time::HiRes::clock_getres redefined at (eval 37) line 1.
Subroutine Time::HiRes::clock_nanosleep redefined at (eval 37) line 1.
Subroutine Time::HiRes::clock redefined at (eval 37) line 1.
Subroutine Time::HiRes::lstat redefined at (eval 37) line 1.
Subroutine Time::HiRes::stat redefined at (eval 37) line 1.
"../sv_inline.h", line 468: warning #4276-D: relational operator ">" always evaluates to 'false'
              Zero(new_body, type_details->body_size, char);
              ^

cc: warning 983: The -lc library specified on the command line is also added automatically by the compiler driver.  
# Failed test 1704 - sprintf( "%.54g", 0.3 ) renders correctly at op/sprintf2.t line 1197
#      got "0.299999999999999988897769753748434596"
# expected eq "0.299999999999999988897769753748434595763683319091796875"
make: *** [test_harness] Error 1

error while running harness target 'test_harness': 2 at /pro/3gl/CPAN/smoke/lib/Test/Smoke/App/RunSmoke.pm line 118.
[2022-05-19 01:40:19+0200] 
[2022-05-19 01:40:19+0200] ../dist/Net-Ping/t/450_service.t............................PASSED
[2022-05-19 01:40:19+0200]     9, 18
[2022-05-19 01:40:19+0200] ../t/op/sprintf2.t..........................................FAILED
[2022-05-19 01:40:19+0200]     1704
[2022-05-19 01:40:19+0200] ../t/re/reg_mesg.t..........................................FAILED
[2022-05-19 01:40:19+0200]     No plan found in TAP output
[2022-05-19 01:40:19+0200] ../t/re/regex_sets.t........................................FAILED
[2022-05-19 01:40:19+0200]     No plan found in TAP output
[2022-05-19 01:40:19+0200] Archived results...
[2022-05-19 01:40:19+0200] TSTENV = perlio	
"../../../../sv_inline.h", line 468: warning #4276-D: relational operator ">" always evaluates to 'false'
              Zero(new_body, type_details->body_size, char);
              ^

"../../../../sv_inline.h", line 468: warning #4276-D: relational operator ">" always evaluates to 'false'
              Zero(new_body, type_details->body_size, char);
              ^

"../../../../sv_inline.h", line 468: warning #4276-D: relational operator ">" always evaluates to 'false'
              Zero(new_body, type_details->body_size, char);
              ^

"../../../../sv_inline.h", line 468: warning #4276-D: relational operator ">" always evaluates to 'false'
              Zero(new_body, type_details->body_size, char);
              ^

"../../../../sv_inline.h", line 468: warning #4276-D: relational operator ">" always evaluates to 'false'
              Zero(new_body, type_details->body_size, char);
              ^

"../../../../sv_inline.h", line 468: warning #4276-D: relational operator ">" always evaluates to 'false'
              Zero(new_body, type_details->body_size, char);
              ^

"../../../../sv_inline.h", line 468: warning #4276-D: relational operator ">" always evaluates to 'false'
              Zero(new_body, type_details->body_size, char);
              ^

"XSTest.c", line 249: warning #2111-D: statement is unreachable
  	PUTBACK;
  	^

"/pro/3gl/CPAN/perl-current/sv_inline.h", line 468: warning #4276-D: relational operator ">" always evaluates to 'false'
              Zero(new_body, type_details->body_size, char);
              ^

"/pro/3gl/CPAN/perl-current/sv_inline.h", line 468: warning #4276-D: relational operator ">" always evaluates to 'false'
              Zero(new_body, type_details->body_size, char);
              ^

"XSMore.xs", line 48: warning #4276-D: relational operator ">" always evaluates to 'false'
     Newx(*c, lenc+1, char);
     ^

"XSMore.xs", line 63: warning #4276-D: relational operator ">" always evaluates to 'false'
     Newx(*c, lenc+1, char);
     ^

"/pro/3gl/CPAN/perl-current/sv_inline.h", line 468: warning #4276-D: relational operator ">" always evaluates to 'false'
              Zero(new_body, type_details->body_size, char);
              ^

c++: error: +Z: No such file or directory
c++: error: +O2: No such file or directory
c++: error: +Onolimit: No such file or directory
"../sv_inline.h", line 468: warning #4276-D: relational operator ">" always evaluates to 'false'
              Zero(new_body, type_details->body_size, char);
              ^

cc: warning 983: The -lc library specified on the command line is also added automatically by the compiler driver.  
# Failed test 1704 - sprintf( "%.54g", 0.3 ) renders correctly at op/sprintf2.t line 1197
#      got "0.299999999999999988897769753748434596"
# expected eq "0.299999999999999988897769753748434595763683319091796875"
# Connected to 127.0.0.1
# Connected to 127.0.0.1
Subroutine Time::HiRes::constant redefined at (eval 37) line 1.
Subroutine Time::HiRes::usleep redefined at (eval 37) line 1.
Subroutine Time::HiRes::nanosleep redefined at (eval 37) line 1.
Subroutine Time::HiRes::sleep redefined at (eval 37) line 1.
Subroutine Time::HiRes::ualarm redefined at (eval 37) line 1.
Subroutine Time::HiRes::alarm redefined at (eval 37) line 1.
Subroutine Time::HiRes::gettimeofday redefined at (eval 37) line 1.
Subroutine Time::HiRes::time redefined at (eval 37) line 1.
Subroutine Time::HiRes::setitimer redefined at (eval 37) line 1.
Subroutine Time::HiRes::getitimer redefined at (eval 37) line 1.
Subroutine Time::HiRes::utime redefined at (eval 37) line 1.
Subroutine Time::HiRes::clock_gettime redefined at (eval 37) line 1.
Subroutine Time::HiRes::clock_getres redefined at (eval 37) line 1.
Subroutine Time::HiRes::clock_nanosleep redefined at (eval 37) line 1.
Subroutine Time::HiRes::clock redefined at (eval 37) line 1.
Subroutine Time::HiRes::lstat redefined at (eval 37) line 1.
Subroutine Time::HiRes::stat redefined at (eval 37) line 1.
Cannot figure out an encoding to use at t/use-Encode-Alias.t line 5.
make: *** [test_harness] Error 2

error while running harness target 'test_harness': 2 at /pro/3gl/CPAN/smoke/lib/Test/Smoke/App/RunSmoke.pm line 118.
[2022-05-19 01:55:09+0200] 
[2022-05-19 01:55:09+0200] ../lib/locale.t.............................................FAILED
[2022-05-19 01:55:09+0200]     448
[2022-05-19 01:55:09+0200] ../dist/Net-Ping/t/450_service.t............................PASSED
[2022-05-19 01:55:09+0200]     9, 18
[2022-05-19 01:55:09+0200] ../t/op/sprintf2.t..........................................FAILED
[2022-05-19 01:55:09+0200]     1704
[2022-05-19 01:55:09+0200] ../t/re/reg_mesg.t..........................................FAILED
[2022-05-19 01:55:09+0200]     No plan found in TAP output
[2022-05-19 01:55:09+0200] ../t/re/regex_sets.t........................................FAILED
[2022-05-19 01:55:09+0200]     No plan found in TAP output
[2022-05-19 01:55:09+0200] Archived results...
[2022-05-19 01:55:09+0200] TSTENV = locale:en_US.utf8	
"../../../../sv_inline.h", line 468: warning #4276-D: relational operator ">" always evaluates to 'false'
              Zero(new_body, type_details->body_size, char);
              ^

"../../../../sv_inline.h", line 468: warning #4276-D: relational operator ">" always evaluates to 'false'
              Zero(new_body, type_details->body_size, char);
              ^

"../../../../sv_inline.h", line 468: warning #4276-D: relational operator ">" always evaluates to 'false'
              Zero(new_body, type_details->body_size, char);
              ^

"../../../../sv_inline.h", line 468: warning #4276-D: relational operator ">" always evaluates to 'false'
              Zero(new_body, type_details->body_size, char);
              ^

"../../../../sv_inline.h", line 468: warning #4276-D: relational operator ">" always evaluates to 'false'
              Zero(new_body, type_details->body_size, char);
              ^

"../../../../sv_inline.h", line 468: warning #4276-D: relational operator ">" always evaluates to 'false'
              Zero(new_body, type_details->body_size, char);
              ^

"../../../../sv_inline.h", line 468: warning #4276-D: relational operator ">" always evaluates to 'false'
              Zero(new_body, type_details->body_size, char);
              ^

"XSTest.c", line 249: warning #2111-D: statement is unreachable
  	PUTBACK;
  	^

"/pro/3gl/CPAN/perl-current/sv_inline.h", line 468: warning #4276-D: relational operator ">" always evaluates to 'false'
              Zero(new_body, type_details->body_size, char);
              ^

"/pro/3gl/CPAN/perl-current/sv_inline.h", line 468: warning #4276-D: relational operator ">" always evaluates to 'false'
              Zero(new_body, type_details->body_size, char);
              ^

"XSMore.xs", line 48: warning #4276-D: relational operator ">" always evaluates to 'false'
     Newx(*c, lenc+1, char);
     ^

"XSMore.xs", line 63: warning #4276-D: relational operator ">" always evaluates to 'false'
     Newx(*c, lenc+1, char);
     ^

"/pro/3gl/CPAN/perl-current/sv_inline.h", line 468: warning #4276-D: relational operator ">" always evaluates to 'false'
              Zero(new_body, type_details->body_size, char);
              ^

c++: error: +Z: No such file or directory
c++: error: +O2: No such file or directory
c++: error: +Onolimit: No such file or directory
"../sv_inline.h", line 468: warning #4276-D: relational operator ">" always evaluates to 'false'
              Zero(new_body, type_details->body_size, char);
              ^

cc: warning 983: The -lc library specified on the command line is also added automatically by the compiler driver.  
# Failed test 1704 - sprintf( "%.54g", 0.3 ) renders correctly at op/sprintf2.t line 1197
#      got "0.299999999999999988897769753748434596"
# expected eq "0.299999999999999988897769753748434595763683319091796875"
Subroutine Time::HiRes::constant redefined at (eval 37) line 1.
Subroutine Time::HiRes::usleep redefined at (eval 37) line 1.
Subroutine Time::HiRes::nanosleep redefined at (eval 37) line 1.
Subroutine Time::HiRes::sleep redefined at (eval 37) line 1.
Subroutine Time::HiRes::ualarm redefined at (eval 37) line 1.
Subroutine Time::HiRes::alarm redefined at (eval 37) line 1.
Subroutine Time::HiRes::gettimeofday redefined at (eval 37) line 1.
Subroutine Time::HiRes::time redefined at (eval 37) line 1.
Subroutine Time::HiRes::setitimer redefined at (eval 37) line 1.
Subroutine Time::HiRes::getitimer redefined at (eval 37) line 1.
Subroutine Time::HiRes::utime redefined at (eval 37) line 1.
Subroutine Time::HiRes::clock_gettime redefined at (eval 37) line 1.
Subroutine Time::HiRes::clock_getres redefined at (eval 37) line 1.
Subroutine Time::HiRes::clock_nanosleep redefined at (eval 37) line 1.
Subroutine Time::HiRes::clock redefined at (eval 37) line 1.
Subroutine Time::HiRes::lstat redefined at (eval 37) line 1.
Subroutine Time::HiRes::stat redefined at (eval 37) line 1.
# Connected to 127.0.0.1
# Connected to 127.0.0.1
make: *** [test_harness] Error 1

error while running harness target 'test_harness': 2 at /pro/3gl/CPAN/smoke/lib/Test/Smoke/App/RunSmoke.pm line 118.
[2022-05-19 02:09:46+0200] 
[2022-05-19 02:09:46+0200] ../dist/Net-Ping/t/450_service.t............................PASSED
[2022-05-19 02:09:46+0200]     9, 18
[2022-05-19 02:09:46+0200] ../t/op/sprintf2.t..........................................FAILED
[2022-05-19 02:09:46+0200]     1704
[2022-05-19 02:09:46+0200] ../t/re/reg_mesg.t..........................................FAILED
[2022-05-19 02:09:46+0200]     No plan found in TAP output
[2022-05-19 02:09:46+0200] ../t/re/regex_sets.t........................................FAILED
[2022-05-19 02:09:46+0200]     No plan found in TAP output
[2022-05-19 02:09:46+0200] Archived results...
[2022-05-19 02:09:46+0200] Unskip tests from '/pro/3gl/CPAN/smoke/p59.skip'
[2022-05-19 02:09:46+0200] 
[2022-05-19 02:09:46+0200] Configuration: -Dusedevel -Duse64bitall -DDEBUGGING
[2022-05-19 02:09:46+0200] ------------------------------------------------------------------------------
[2022-05-19 02:09:46+0200] make distclean ...
[2022-05-19 02:10:26+0200] 
[2022-05-19 02:10:26+0200] Copy Policy.sh ...
[2022-05-19 02:10:26+0200] 
[2022-05-19 02:10:26+0200] Configure ...
[2022-05-19 02:12:00+0200] 
[2022-05-19 02:12:00+0200] make ...
[2022-05-19 02:34:05+0200] Skip tests from '/pro/3gl/CPAN/smoke/p59.skip'
[2022-05-19 02:34:05+0200] 	cpan/Sys-Syslog/t/syslog.t
[2022-05-19 02:34:05+0200] 
[2022-05-19 02:34:05+0200]  Tests start here:
[2022-05-19 02:34:05+0200] TSTENV = stdio	
No saved state, selection will be empty
Cannot figure out an encoding to use at t/use-Encode-Alias.t line 5.
"../../../../sv_inline.h", line 468: warning #4276-D: relational operator ">" always evaluates to 'false'
              Zero(new_body, type_details->body_size, char);
              ^

"../../../../sv_inline.h", line 468: warning #4276-D: relational operator ">" always evaluates to 'false'
              Zero(new_body, type_details->body_size, char);
              ^

"../../../../sv_inline.h", line 468: warning #4276-D: relational operator ">" always evaluates to 'false'
              Zero(new_body, type_details->body_size, char);
              ^

"../../../../sv_inline.h", line 468: warning #4276-D: relational operator ">" always evaluates to 'false'
              Zero(new_body, type_details->body_size, char);
              ^

"../../../../sv_inline.h", line 468: warning #4276-D: relational operator ">" always evaluates to 'false'
              Zero(new_body, type_details->body_size, char);
              ^

"../../../../sv_inline.h", line 468: warning #4276-D: relational operator ">" always evaluates to 'false'
              Zero(new_body, type_details->body_size, char);
              ^

"../../../../sv_inline.h", line 468: warning #4276-D: relational operator ">" always evaluates to 'false'
              Zero(new_body, type_details->body_size, char);
              ^

# Connected to 127.0.0.1
# Connected to 127.0.0.1
Redefining sub xChild::foo at xChild--25897 line 2.
Redefining sub Data::ok at -e line 1.
"XSTest.c", line 249: warning #2111-D: statement is unreachable
  	PUTBACK;
  	^

"/pro/3gl/CPAN/perl-current/sv_inline.h", line 468: warning #4276-D: relational operator ">" always evaluates to 'false'
              Zero(new_body, type_details->body_size, char);
              ^

c++: error: +Z: No such file or directory
c++: error: +O2: No such file or directory
c++: error: +Onolimit: No such file or directory
"/pro/3gl/CPAN/perl-current/sv_inline.h", line 468: warning #4276-D: relational operator ">" always evaluates to 'false'
              Zero(new_body, type_details->body_size, char);
              ^

"XSMore.xs", line 48: warning #4276-D: relational operator ">" always evaluates to 'false'
     Newx(*c, lenc+1, char);
     ^

"XSMore.xs", line 63: warning #4276-D: relational operator ">" always evaluates to 'false'
     Newx(*c, lenc+1, char);
     ^

"/pro/3gl/CPAN/perl-current/sv_inline.h", line 468: warning #4276-D: relational operator ">" always evaluates to 'false'
              Zero(new_body, type_details->body_size, char);
              ^

Subroutine Time::HiRes::constant redefined at (eval 37) line 1.
Subroutine Time::HiRes::usleep redefined at (eval 37) line 1.
Subroutine Time::HiRes::nanosleep redefined at (eval 37) line 1.
Subroutine Time::HiRes::sleep redefined at (eval 37) line 1.
Subroutine Time::HiRes::ualarm redefined at (eval 37) line 1.
Subroutine Time::HiRes::alarm redefined at (eval 37) line 1.
Subroutine Time::HiRes::gettimeofday redefined at (eval 37) line 1.
Subroutine Time::HiRes::time redefined at (eval 37) line 1.
Subroutine Time::HiRes::setitimer redefined at (eval 37) line 1.
Subroutine Time::HiRes::getitimer redefined at (eval 37) line 1.
Subroutine Time::HiRes::utime redefined at (eval 37) line 1.
Subroutine Time::HiRes::clock_gettime redefined at (eval 37) line 1.
Subroutine Time::HiRes::clock_getres redefined at (eval 37) line 1.
Subroutine Time::HiRes::clock_nanosleep redefined at (eval 37) line 1.
Subroutine Time::HiRes::clock redefined at (eval 37) line 1.
Subroutine Time::HiRes::lstat redefined at (eval 37) line 1.
Subroutine Time::HiRes::stat redefined at (eval 37) line 1.
"../sv_inline.h", line 468: warning #4276-D: relational operator ">" always evaluates to 'false'
              Zero(new_body, type_details->body_size, char);
              ^

cc: warning 983: The -lc library specified on the command line is also added automatically by the compiler driver.  
# Failed test 1704 - sprintf( "%.54g", 0.3 ) renders correctly at op/sprintf2.t line 1197
#      got "0.299999999999999988897769753748434596"
# expected eq "0.299999999999999988897769753748434595763683319091796875"
make: *** [test_harness] Error 1

error while running harness target 'test_harness': 2 at /pro/3gl/CPAN/smoke/lib/Test/Smoke/App/RunSmoke.pm line 118.
[2022-05-19 02:53:05+0200] 
[2022-05-19 02:53:05+0200] ../dist/Net-Ping/t/450_service.t............................PASSED
[2022-05-19 02:53:05+0200]     9, 18
[2022-05-19 02:53:05+0200] ../t/op/sprintf2.t..........................................FAILED
[2022-05-19 02:53:05+0200]     1704
[2022-05-19 02:53:05+0200] ../t/re/reg_mesg.t..........................................FAILED
[2022-05-19 02:53:05+0200]     No plan found in TAP output
[2022-05-19 02:53:05+0200] ../t/re/regex_sets.t........................................FAILED
[2022-05-19 02:53:05+0200]     No plan found in TAP output
[2022-05-19 02:53:05+0200] Archived results...
[2022-05-19 02:53:05+0200] TSTENV = perlio	
"../../../../sv_inline.h", line 468: warning #4276-D: relational operator ">" always evaluates to 'false'
              Zero(new_body, type_details->body_size, char);
              ^

"../../../../sv_inline.h", line 468: warning #4276-D: relational operator ">" always evaluates to 'false'
              Zero(new_body, type_details->body_size, char);
              ^

"../../../../sv_inline.h", line 468: warning #4276-D: relational operator ">" always evaluates to 'false'
              Zero(new_body, type_details->body_size, char);
              ^

"../../../../sv_inline.h", line 468: warning #4276-D: relational operator ">" always evaluates to 'false'
              Zero(new_body, type_details->body_size, char);
              ^

"../../../../sv_inline.h", line 468: warning #4276-D: relational operator ">" always evaluates to 'false'
              Zero(new_body, type_details->body_size, char);
              ^

"../../../../sv_inline.h", line 468: warning #4276-D: relational operator ">" always evaluates to 'false'
              Zero(new_body, type_details->body_size, char);
              ^

"../../../../sv_inline.h", line 468: warning #4276-D: relational operator ">" always evaluates to 'false'
              Zero(new_body, type_details->body_size, char);
              ^

"XSTest.c", line 249: warning #2111-D: statement is unreachable
  	PUTBACK;
  	^

"/pro/3gl/CPAN/perl-current/sv_inline.h", line 468: warning #4276-D: relational operator ">" always evaluates to 'false'
              Zero(new_body, type_details->body_size, char);
              ^

"/pro/3gl/CPAN/perl-current/sv_inline.h", line 468: warning #4276-D: relational operator ">" always evaluates to 'false'
              Zero(new_body, type_details->body_size, char);
              ^

"XSMore.xs", line 48: warning #4276-D: relational operator ">" always evaluates to 'false'
     Newx(*c, lenc+1, char);
     ^

"XSMore.xs", line 63: warning #4276-D: relational operator ">" always evaluates to 'false'
     Newx(*c, lenc+1, char);
     ^

"/pro/3gl/CPAN/perl-current/sv_inline.h", line 468: warning #4276-D: relational operator ">" always evaluates to 'false'
              Zero(new_body, type_details->body_size, char);
              ^

c++: error: +Z: No such file or directory
c++: error: +O2: No such file or directory
c++: error: +Onolimit: No such file or directory
"../sv_inline.h", line 468: warning #4276-D: relational operator ">" always evaluates to 'false'
              Zero(new_body, type_details->body_size, char);
              ^

cc: warning 983: The -lc library specified on the command line is also added automatically by the compiler driver.  
# Failed test 1704 - sprintf( "%.54g", 0.3 ) renders correctly at op/sprintf2.t line 1197
#      got "0.299999999999999988897769753748434596"
# expected eq "0.299999999999999988897769753748434595763683319091796875"
# Connected to 127.0.0.1
# Connected to 127.0.0.1
Subroutine Time::HiRes::constant redefined at (eval 37) line 1.
Subroutine Time::HiRes::usleep redefined at (eval 37) line 1.
Subroutine Time::HiRes::nanosleep redefined at (eval 37) line 1.
Subroutine Time::HiRes::sleep redefined at (eval 37) line 1.
Subroutine Time::HiRes::ualarm redefined at (eval 37) line 1.
Subroutine Time::HiRes::alarm redefined at (eval 37) line 1.
Subroutine Time::HiRes::gettimeofday redefined at (eval 37) line 1.
Subroutine Time::HiRes::time redefined at (eval 37) line 1.
Subroutine Time::HiRes::setitimer redefined at (eval 37) line 1.
Subroutine Time::HiRes::getitimer redefined at (eval 37) line 1.
Subroutine Time::HiRes::utime redefined at (eval 37) line 1.
Subroutine Time::HiRes::clock_gettime redefined at (eval 37) line 1.
Subroutine Time::HiRes::clock_getres redefined at (eval 37) line 1.
Subroutine Time::HiRes::clock_nanosleep redefined at (eval 37) line 1.
Subroutine Time::HiRes::clock redefined at (eval 37) line 1.
Subroutine Time::HiRes::lstat redefined at (eval 37) line 1.
Subroutine Time::HiRes::stat redefined at (eval 37) line 1.
Cannot figure out an encoding to use at t/use-Encode-Alias.t line 5.
make: *** [test_harness] Error 1

error while running harness target 'test_harness': 2 at /pro/3gl/CPAN/smoke/lib/Test/Smoke/App/RunSmoke.pm line 118.
[2022-05-19 03:09:47+0200] 
[2022-05-19 03:09:47+0200] ../dist/Net-Ping/t/450_service.t............................PASSED
[2022-05-19 03:09:47+0200]     9, 18
[2022-05-19 03:09:47+0200] ../t/op/sprintf2.t..........................................FAILED
[2022-05-19 03:09:47+0200]     1704
[2022-05-19 03:09:47+0200] ../t/re/regex_sets.t........................................FAILED
[2022-05-19 03:09:47+0200]     No plan found in TAP output
[2022-05-19 03:09:47+0200] ../t/re/reg_mesg.t..........................................FAILED
[2022-05-19 03:09:47+0200]     No plan found in TAP output
[2022-05-19 03:09:47+0200] Archived results...
[2022-05-19 03:09:47+0200] TSTENV = locale:en_US.utf8	
"../../../../sv_inline.h", line 468: warning #4276-D: relational operator ">" always evaluates to 'false'
              Zero(new_body, type_details->body_size, char);
              ^

"../../../../sv_inline.h", line 468: warning #4276-D: relational operator ">" always evaluates to 'false'
              Zero(new_body, type_details->body_size, char);
              ^

"../../../../sv_inline.h", line 468: warning #4276-D: relational operator ">" always evaluates to 'false'
              Zero(new_body, type_details->body_size, char);
              ^

"../../../../sv_inline.h", line 468: warning #4276-D: relational operator ">" always evaluates to 'false'
              Zero(new_body, type_details->body_size, char);
              ^

"../../../../sv_inline.h", line 468: warning #4276-D: relational operator ">" always evaluates to 'false'
              Zero(new_body, type_details->body_size, char);
              ^

"../../../../sv_inline.h", line 468: warning #4276-D: relational operator ">" always evaluates to 'false'
              Zero(new_body, type_details->body_size, char);
              ^

"../../../../sv_inline.h", line 468: warning #4276-D: relational operator ">" always evaluates to 'false'
              Zero(new_body, type_details->body_size, char);
              ^

"XSTest.c", line 249: warning #2111-D: statement is unreachable
  	PUTBACK;
  	^

"/pro/3gl/CPAN/perl-current/sv_inline.h", line 468: warning #4276-D: relational operator ">" always evaluates to 'false'
              Zero(new_body, type_details->body_size, char);
              ^

"/pro/3gl/CPAN/perl-current/sv_inline.h", line 468: warning #4276-D: relational operator ">" always evaluates to 'false'
              Zero(new_body, type_details->body_size, char);
              ^

"XSMore.xs", line 48: warning #4276-D: relational operator ">" always evaluates to 'false'
     Newx(*c, lenc+1, char);
     ^

"XSMore.xs", line 63: warning #4276-D: relational operator ">" always evaluates to 'false'
     Newx(*c, lenc+1, char);
     ^

"/pro/3gl/CPAN/perl-current/sv_inline.h", line 468: warning #4276-D: relational operator ">" always evaluates to 'false'
              Zero(new_body, type_details->body_size, char);
              ^

c++: error: +Z: No such file or directory
c++: error: +O2: No such file or directory
c++: error: +Onolimit: No such file or directory
"../sv_inline.h", line 468: warning #4276-D: relational operator ">" always evaluates to 'false'
              Zero(new_body, type_details->body_size, char);
              ^

cc: warning 983: The -lc library specified on the command line is also added automatically by the compiler driver.  
# Failed test 1704 - sprintf( "%.54g", 0.3 ) renders correctly at op/sprintf2.t line 1197
#      got "0.299999999999999988897769753748434596"
# expected eq "0.299999999999999988897769753748434595763683319091796875"
Subroutine Time::HiRes::constant redefined at (eval 37) line 1.
Subroutine Time::HiRes::usleep redefined at (eval 37) line 1.
Subroutine Time::HiRes::nanosleep redefined at (eval 37) line 1.
Subroutine Time::HiRes::sleep redefined at (eval 37) line 1.
Subroutine Time::HiRes::ualarm redefined at (eval 37) line 1.
Subroutine Time::HiRes::alarm redefined at (eval 37) line 1.
Subroutine Time::HiRes::gettimeofday redefined at (eval 37) line 1.
Subroutine Time::HiRes::time redefined at (eval 37) line 1.
Subroutine Time::HiRes::setitimer redefined at (eval 37) line 1.
Subroutine Time::HiRes::getitimer redefined at (eval 37) line 1.
Subroutine Time::HiRes::utime redefined at (eval 37) line 1.
Subroutine Time::HiRes::clock_gettime redefined at (eval 37) line 1.
Subroutine Time::HiRes::clock_getres redefined at (eval 37) line 1.
Subroutine Time::HiRes::clock_nanosleep redefined at (eval 37) line 1.
Subroutine Time::HiRes::clock redefined at (eval 37) line 1.
Subroutine Time::HiRes::lstat redefined at (eval 37) line 1.
Subroutine Time::HiRes::stat redefined at (eval 37) line 1.
# Connected to 127.0.0.1
# Connected to 127.0.0.1
make: *** [test_harness] Error 1

error while running harness target 'test_harness': 2 at /pro/3gl/CPAN/smoke/lib/Test/Smoke/App/RunSmoke.pm line 118.
[2022-05-19 03:26:21+0200] 
[2022-05-19 03:26:21+0200] ../dist/Net-Ping/t/450_service.t............................PASSED
[2022-05-19 03:26:21+0200]     9, 18
[2022-05-19 03:26:21+0200] ../t/op/sprintf2.t..........................................FAILED
[2022-05-19 03:26:21+0200]     1704
[2022-05-19 03:26:21+0200] ../t/re/regex_sets.t........................................FAILED
[2022-05-19 03:26:21+0200]     No plan found in TAP output
[2022-05-19 03:26:21+0200] ../t/re/reg_mesg.t..........................................FAILED
[2022-05-19 03:26:21+0200]     No plan found in TAP output
[2022-05-19 03:26:21+0200] Archived results...
[2022-05-19 03:26:21+0200] Unskip tests from '/pro/3gl/CPAN/smoke/p59.skip'
[2022-05-19 03:26:21+0200] 
[2022-05-19 03:26:21+0200] Configuration: -Dusedevel -Duseithreads
[2022-05-19 03:26:21+0200] ------------------------------------------------------------------------------
[2022-05-19 03:26:21+0200] make distclean ...
[2022-05-19 03:27:05+0200] 
[2022-05-19 03:27:05+0200] Copy Policy.sh ...
[2022-05-19 03:27:05+0200] 
[2022-05-19 03:27:05+0200] Configure ...
[2022-05-19 03:28:43+0200] 
[2022-05-19 03:28:43+0200] make ...
[2022-05-19 03:46:51+0200] Skip tests from '/pro/3gl/CPAN/smoke/p59.skip'
[2022-05-19 03:46:51+0200] 	cpan/Sys-Syslog/t/syslog.t
[2022-05-19 03:46:51+0200] 
[2022-05-19 03:46:51+0200]  Tests start here:
[2022-05-19 03:46:51+0200] TSTENV = stdio	
No saved state, selection will be empty
Cannot figure out an encoding to use at t/use-Encode-Alias.t line 5.
"../../../../sv_inline.h", line 487: warning #4232-D: conversion from "XPVIO *" to a more strictly aligned type "XPVMG *" may cause misaligned access
              SvSTASH_set(io, MUTABLE_HV(SvREFCNT_inc(GvHV(iogv))));
              ^

"../../../../sv_inline.h", line 468: warning #4276-D: relational operator ">" always evaluates to 'false'
              Zero(new_body, type_details->body_size, char);
              ^

"../../../../sv_inline.h", line 487: warning #4232-D: conversion from "XPVIO *" to a more strictly aligned type "XPVMG *" may cause misaligned access
              SvSTASH_set(io, MUTABLE_HV(SvREFCNT_inc(GvHV(iogv))));
              ^

"../../../../sv_inline.h", line 468: warning #4276-D: relational operator ">" always evaluates to 'false'
              Zero(new_body, type_details->body_size, char);
              ^

"../../../../sv_inline.h", line 487: warning #4232-D: conversion from "XPVIO *" to a more strictly aligned type "XPVMG *" may cause misaligned access
              SvSTASH_set(io, MUTABLE_HV(SvREFCNT_inc(GvHV(iogv))));
              ^

"../../../../sv_inline.h", line 468: warning #4276-D: relational operator ">" always evaluates to 'false'
              Zero(new_body, type_details->body_size, char);
              ^

"../../../../sv_inline.h", line 487: warning #4232-D: conversion from "XPVIO *" to a more strictly aligned type "XPVMG *" may cause misaligned access
              SvSTASH_set(io, MUTABLE_HV(SvREFCNT_inc(GvHV(iogv))));
              ^

"../../../../sv_inline.h", line 468: warning #4276-D: relational operator ">" always evaluates to 'false'
              Zero(new_body, type_details->body_size, char);
              ^

"../../../../sv_inline.h", line 487: warning #4232-D: conversion from "XPVIO *" to a more strictly aligned type "XPVMG *" may cause misaligned access
              SvSTASH_set(io, MUTABLE_HV(SvREFCNT_inc(GvHV(iogv))));
              ^

"../../../../sv_inline.h", line 468: warning #4276-D: relational operator ">" always evaluates to 'false'
              Zero(new_body, type_details->body_size, char);
              ^

"../../../../sv_inline.h", line 487: warning #4232-D: conversion from "XPVIO *" to a more strictly aligned type "XPVMG *" may cause misaligned access
              SvSTASH_set(io, MUTABLE_HV(SvREFCNT_inc(GvHV(iogv))));
              ^

"../../../../sv_inline.h", line 468: warning #4276-D: relational operator ">" always evaluates to 'false'
              Zero(new_body, type_details->body_size, char);
              ^

"../../../../sv_inline.h", line 487: warning #4232-D: conversion from "XPVIO *" to a more strictly aligned type "XPVMG *" may cause misaligned access
              SvSTASH_set(io, MUTABLE_HV(SvREFCNT_inc(GvHV(iogv))));
              ^

"../../../../sv_inline.h", line 468: warning #4276-D: relational operator ">" always evaluates to 'false'
              Zero(new_body, type_details->body_size, char);
              ^

# Connected to 127.0.0.1
# Connected to 127.0.0.1
Integer overflow in hexadecimal number at t/broken_univ_can.t line 13.
Redefining sub xChild::foo at xChild--4791 line 2.
Redefining sub Data::ok at -e line 1.
"/pro/3gl/CPAN/perl-current/sv_inline.h", line 487: warning #4232-D: conversion from "XPVIO *" to a more strictly aligned type "XPVMG *" may cause misaligned access
              SvSTASH_set(io, MUTABLE_HV(SvREFCNT_inc(GvHV(iogv))));
              ^

"XSTest.c", line 249: warning #2111-D: statement is unreachable
  	PUTBACK;
  	^

"/pro/3gl/CPAN/perl-current/sv_inline.h", line 468: warning #4276-D: relational operator ">" always evaluates to 'false'
              Zero(new_body, type_details->body_size, char);
              ^

c++: error: +Z: No such file or directory
c++: error: +O2: No such file or directory
c++: error: +Onolimit: No such file or directory
"/pro/3gl/CPAN/perl-current/sv_inline.h", line 487: warning #4232-D: conversion from "XPVIO *" to a more strictly aligned type "XPVMG *" may cause misaligned access
              SvSTASH_set(io, MUTABLE_HV(SvREFCNT_inc(GvHV(iogv))));
              ^

"/pro/3gl/CPAN/perl-current/sv_inline.h", line 468: warning #4276-D: relational operator ">" always evaluates to 'false'
              Zero(new_body, type_details->body_size, char);
              ^

"XSMore.xs", line 48: warning #4276-D: relational operator ">" always evaluates to 'false'
     Newx(*c, lenc+1, char);
     ^

"XSMore.xs", line 63: warning #4276-D: relational operator ">" always evaluates to 'false'
     Newx(*c, lenc+1, char);
     ^

"/pro/3gl/CPAN/perl-current/sv_inline.h", line 487: warning #4232-D: conversion from "XPVIO *" to a more strictly aligned type "XPVMG *" may cause misaligned access
              SvSTASH_set(io, MUTABLE_HV(SvREFCNT_inc(GvHV(iogv))));
              ^

"/pro/3gl/CPAN/perl-current/sv_inline.h", line 468: warning #4276-D: relational operator ">" always evaluates to 'false'
              Zero(new_body, type_details->body_size, char);
              ^

Subroutine Time::HiRes::constant redefined at (eval 37) line 1.
Subroutine Time::HiRes::usleep redefined at (eval 37) line 1.
Subroutine Time::HiRes::nanosleep redefined at (eval 37) line 1.
Subroutine Time::HiRes::sleep redefined at (eval 37) line 1.
Subroutine Time::HiRes::ualarm redefined at (eval 37) line 1.
Subroutine Time::HiRes::alarm redefined at (eval 37) line 1.
Subroutine Time::HiRes::gettimeofday redefined at (eval 37) line 1.
Subroutine Time::HiRes::time redefined at (eval 37) line 1.
Subroutine Time::HiRes::setitimer redefined at (eval 37) line 1.
Subroutine Time::HiRes::getitimer redefined at (eval 37) line 1.
Subroutine Time::HiRes::utime redefined at (eval 37) line 1.
Subroutine Time::HiRes::clock_gettime redefined at (eval 37) line 1.
Subroutine Time::HiRes::clock_getres redefined at (eval 37) line 1.
Subroutine Time::HiRes::clock_nanosleep redefined at (eval 37) line 1.
Subroutine Time::HiRes::clock redefined at (eval 37) line 1.
Subroutine Time::HiRes::lstat redefined at (eval 37) line 1.
Subroutine Time::HiRes::stat redefined at (eval 37) line 1.
"../sv_inline.h", line 487: warning #4232-D: conversion from "XPVIO *" to a more strictly aligned type "XPVMG *" may cause misaligned access
              SvSTASH_set(io, MUTABLE_HV(SvREFCNT_inc(GvHV(iogv))));
              ^

"../sv_inline.h", line 468: warning #4276-D: relational operator ">" always evaluates to 'false'
              Zero(new_body, type_details->body_size, char);
              ^

cc: warning 983: The -lc library specified on the command line is also added automatically by the compiler driver.  
# Failed test 1701 - sprintf( "%.54g", 0.3 ) renders correctly at op/sprintf2.t line 1197
#      got "0.299999999999999988897769753748434596"
# expected eq "0.299999999999999988897769753748434595763683319091796875"
make: *** [test_harness] Error 1

error while running harness target 'test_harness': 2 at /pro/3gl/CPAN/smoke/lib/Test/Smoke/App/RunSmoke.pm line 118.
[2022-05-19 04:05:16+0200] 
[2022-05-19 04:05:16+0200] ../dist/Net-Ping/t/450_service.t............................PASSED
[2022-05-19 04:05:16+0200]     9, 18
[2022-05-19 04:05:16+0200] ../t/op/sprintf2.t..........................................FAILED
[2022-05-19 04:05:16+0200]     1701
[2022-05-19 04:05:16+0200] Archived results...
[2022-05-19 04:05:16+0200] TSTENV = perlio	
"../../../../sv_inline.h", line 487: warning #4232-D: conversion from "XPVIO *" to a more strictly aligned type "XPVMG *" may cause misaligned access
              SvSTASH_set(io, MUTABLE_HV(SvREFCNT_inc(GvHV(iogv))));
              ^

"../../../../sv_inline.h", line 468: warning #4276-D: relational operator ">" always evaluates to 'false'
              Zero(new_body, type_details->body_size, char);
              ^

"../../../../sv_inline.h", line 487: warning #4232-D: conversion from "XPVIO *" to a more strictly aligned type "XPVMG *" may cause misaligned access
              SvSTASH_set(io, MUTABLE_HV(SvREFCNT_inc(GvHV(iogv))));
              ^

"../../../../sv_inline.h", line 468: warning #4276-D: relational operator ">" always evaluates to 'false'
              Zero(new_body, type_details->body_size, char);
              ^

"../../../../sv_inline.h", line 487: warning #4232-D: conversion from "XPVIO *" to a more strictly aligned type "XPVMG *" may cause misaligned access
              SvSTASH_set(io, MUTABLE_HV(SvREFCNT_inc(GvHV(iogv))));
              ^

"../../../../sv_inline.h", line 468: warning #4276-D: relational operator ">" always evaluates to 'false'
              Zero(new_body, type_details->body_size, char);
              ^

"../../../../sv_inline.h", line 487: warning #4232-D: conversion from "XPVIO *" to a more strictly aligned type "XPVMG *" may cause misaligned access
              SvSTASH_set(io, MUTABLE_HV(SvREFCNT_inc(GvHV(iogv))));
              ^

"../../../../sv_inline.h", line 468: warning #4276-D: relational operator ">" always evaluates to 'false'
              Zero(new_body, type_details->body_size, char);
              ^

"../../../../sv_inline.h", line 487: warning #4232-D: conversion from "XPVIO *" to a more strictly aligned type "XPVMG *" may cause misaligned access
              SvSTASH_set(io, MUTABLE_HV(SvREFCNT_inc(GvHV(iogv))));
              ^

"../../../../sv_inline.h", line 468: warning #4276-D: relational operator ">" always evaluates to 'false'
              Zero(new_body, type_details->body_size, char);
              ^

"../../../../sv_inline.h", line 487: warning #4232-D: conversion from "XPVIO *" to a more strictly aligned type "XPVMG *" may cause misaligned access
              SvSTASH_set(io, MUTABLE_HV(SvREFCNT_inc(GvHV(iogv))));
              ^

"../../../../sv_inline.h", line 468: warning #4276-D: relational operator ">" always evaluates to 'false'
              Zero(new_body, type_details->body_size, char);
              ^

"../../../../sv_inline.h", line 487: warning #4232-D: conversion from "XPVIO *" to a more strictly aligned type "XPVMG *" may cause misaligned access
              SvSTASH_set(io, MUTABLE_HV(SvREFCNT_inc(GvHV(iogv))));
              ^

"../../../../sv_inline.h", line 468: warning #4276-D: relational operator ">" always evaluates to 'false'
              Zero(new_body, type_details->body_size, char);
              ^

"/pro/3gl/CPAN/perl-current/sv_inline.h", line 487: warning #4232-D: conversion from "XPVIO *" to a more strictly aligned type "XPVMG *" may cause misaligned access
              SvSTASH_set(io, MUTABLE_HV(SvREFCNT_inc(GvHV(iogv))));
              ^

"XSTest.c", line 249: warning #2111-D: statement is unreachable
  	PUTBACK;
  	^

"/pro/3gl/CPAN/perl-current/sv_inline.h", line 468: warning #4276-D: relational operator ">" always evaluates to 'false'
              Zero(new_body, type_details->body_size, char);
              ^

"/pro/3gl/CPAN/perl-current/sv_inline.h", line 487: warning #4232-D: conversion from "XPVIO *" to a more strictly aligned type "XPVMG *" may cause misaligned access
              SvSTASH_set(io, MUTABLE_HV(SvREFCNT_inc(GvHV(iogv))));
              ^

"/pro/3gl/CPAN/perl-current/sv_inline.h", line 468: warning #4276-D: relational operator ">" always evaluates to 'false'
              Zero(new_body, type_details->body_size, char);
              ^

"XSMore.xs", line 48: warning #4276-D: relational operator ">" always evaluates to 'false'
     Newx(*c, lenc+1, char);
     ^

"XSMore.xs", line 63: warning #4276-D: relational operator ">" always evaluates to 'false'
     Newx(*c, lenc+1, char);
     ^

"/pro/3gl/CPAN/perl-current/sv_inline.h", line 487: warning #4232-D: conversion from "XPVIO *" to a more strictly aligned type "XPVMG *" may cause misaligned access
              SvSTASH_set(io, MUTABLE_HV(SvREFCNT_inc(GvHV(iogv))));
              ^

"/pro/3gl/CPAN/perl-current/sv_inline.h", line 468: warning #4276-D: relational operator ">" always evaluates to 'false'
              Zero(new_body, type_details->body_size, char);
              ^

c++: error: +Z: No such file or directory
c++: error: +O2: No such file or directory
c++: error: +Onolimit: No such file or directory
"../sv_inline.h", line 487: warning #4232-D: conversion from "XPVIO *" to a more strictly aligned type "XPVMG *" may cause misaligned access
              SvSTASH_set(io, MUTABLE_HV(SvREFCNT_inc(GvHV(iogv))));
              ^

"../sv_inline.h", line 468: warning #4276-D: relational operator ">" always evaluates to 'false'
              Zero(new_body, type_details->body_size, char);
              ^

cc: warning 983: The -lc library specified on the command line is also added automatically by the compiler driver.  
# Failed test 1701 - sprintf( "%.54g", 0.3 ) renders correctly at op/sprintf2.t line 1197
#      got "0.299999999999999988897769753748434596"
# expected eq "0.299999999999999988897769753748434595763683319091796875"
# Connected to 127.0.0.1
# Connected to 127.0.0.1
Subroutine Time::HiRes::constant redefined at (eval 37) line 1.
Subroutine Time::HiRes::usleep redefined at (eval 37) line 1.
Subroutine Time::HiRes::nanosleep redefined at (eval 37) line 1.
Subroutine Time::HiRes::sleep redefined at (eval 37) line 1.
Subroutine Time::HiRes::ualarm redefined at (eval 37) line 1.
Subroutine Time::HiRes::alarm redefined at (eval 37) line 1.
Subroutine Time::HiRes::gettimeofday redefined at (eval 37) line 1.
Subroutine Time::HiRes::time redefined at (eval 37) line 1.
Subroutine Time::HiRes::setitimer redefined at (eval 37) line 1.
Subroutine Time::HiRes::getitimer redefined at (eval 37) line 1.
Subroutine Time::HiRes::utime redefined at (eval 37) line 1.
Subroutine Time::HiRes::clock_gettime redefined at (eval 37) line 1.
Subroutine Time::HiRes::clock_getres redefined at (eval 37) line 1.
Subroutine Time::HiRes::clock_nanosleep redefined at (eval 37) line 1.
Subroutine Time::HiRes::clock redefined at (eval 37) line 1.
Subroutine Time::HiRes::lstat redefined at (eval 37) line 1.
Subroutine Time::HiRes::stat redefined at (eval 37) line 1.
Cannot figure out an encoding to use at t/use-Encode-Alias.t line 5.
Integer overflow in hexadecimal number at t/broken_univ_can.t line 13.
make: *** [test_harness] Error 1

error while running harness target 'test_harness': 2 at /pro/3gl/CPAN/smoke/lib/Test/Smoke/App/RunSmoke.pm line 118.
[2022-05-19 04:21:10+0200] 
[2022-05-19 04:21:10+0200] ../dist/Net-Ping/t/450_service.t............................PASSED
[2022-05-19 04:21:10+0200]     9, 18
[2022-05-19 04:21:10+0200] ../t/op/sprintf2.t..........................................FAILED
[2022-05-19 04:21:10+0200]     1701
[2022-05-19 04:21:10+0200] Archived results...
[2022-05-19 04:21:10+0200] TSTENV = locale:en_US.utf8	
"../../../../sv_inline.h", line 487: warning #4232-D: conversion from "XPVIO *" to a more strictly aligned type "XPVMG *" may cause misaligned access
              SvSTASH_set(io, MUTABLE_HV(SvREFCNT_inc(GvHV(iogv))));
              ^

"../../../../sv_inline.h", line 468: warning #4276-D: relational operator ">" always evaluates to 'false'
              Zero(new_body, type_details->body_size, char);
              ^

"../../../../sv_inline.h", line 487: warning #4232-D: conversion from "XPVIO *" to a more strictly aligned type "XPVMG *" may cause misaligned access
              SvSTASH_set(io, MUTABLE_HV(SvREFCNT_inc(GvHV(iogv))));
              ^

"../../../../sv_inline.h", line 468: warning #4276-D: relational operator ">" always evaluates to 'false'
              Zero(new_body, type_details->body_size, char);
              ^

"../../../../sv_inline.h", line 487: warning #4232-D: conversion from "XPVIO *" to a more strictly aligned type "XPVMG *" may cause misaligned access
              SvSTASH_set(io, MUTABLE_HV(SvREFCNT_inc(GvHV(iogv))));
              ^

"../../../../sv_inline.h", line 468: warning #4276-D: relational operator ">" always evaluates to 'false'
              Zero(new_body, type_details->body_size, char);
              ^

"../../../../sv_inline.h", line 487: warning #4232-D: conversion from "XPVIO *" to a more strictly aligned type "XPVMG *" may cause misaligned access
              SvSTASH_set(io, MUTABLE_HV(SvREFCNT_inc(GvHV(iogv))));
              ^

"../../../../sv_inline.h", line 468: warning #4276-D: relational operator ">" always evaluates to 'false'
              Zero(new_body, type_details->body_size, char);
              ^

"../../../../sv_inline.h", line 487: warning #4232-D: conversion from "XPVIO *" to a more strictly aligned type "XPVMG *" may cause misaligned access
              SvSTASH_set(io, MUTABLE_HV(SvREFCNT_inc(GvHV(iogv))));
              ^

"../../../../sv_inline.h", line 468: warning #4276-D: relational operator ">" always evaluates to 'false'
              Zero(new_body, type_details->body_size, char);
              ^

"../../../../sv_inline.h", line 487: warning #4232-D: conversion from "XPVIO *" to a more strictly aligned type "XPVMG *" may cause misaligned access
              SvSTASH_set(io, MUTABLE_HV(SvREFCNT_inc(GvHV(iogv))));
              ^

"../../../../sv_inline.h", line 468: warning #4276-D: relational operator ">" always evaluates to 'false'
              Zero(new_body, type_details->body_size, char);
              ^

"../../../../sv_inline.h", line 487: warning #4232-D: conversion from "XPVIO *" to a more strictly aligned type "XPVMG *" may cause misaligned access
              SvSTASH_set(io, MUTABLE_HV(SvREFCNT_inc(GvHV(iogv))));
              ^

"../../../../sv_inline.h", line 468: warning #4276-D: relational operator ">" always evaluates to 'false'
              Zero(new_body, type_details->body_size, char);
              ^

"/pro/3gl/CPAN/perl-current/sv_inline.h", line 487: warning #4232-D: conversion from "XPVIO *" to a more strictly aligned type "XPVMG *" may cause misaligned access
              SvSTASH_set(io, MUTABLE_HV(SvREFCNT_inc(GvHV(iogv))));
              ^

"XSTest.c", line 249: warning #2111-D: statement is unreachable
  	PUTBACK;
  	^

"/pro/3gl/CPAN/perl-current/sv_inline.h", line 468: warning #4276-D: relational operator ">" always evaluates to 'false'
              Zero(new_body, type_details->body_size, char);
              ^

"/pro/3gl/CPAN/perl-current/sv_inline.h", line 487: warning #4232-D: conversion from "XPVIO *" to a more strictly aligned type "XPVMG *" may cause misaligned access
              SvSTASH_set(io, MUTABLE_HV(SvREFCNT_inc(GvHV(iogv))));
              ^

"/pro/3gl/CPAN/perl-current/sv_inline.h", line 468: warning #4276-D: relational operator ">" always evaluates to 'false'
              Zero(new_body, type_details->body_size, char);
              ^

"XSMore.xs", line 48: warning #4276-D: relational operator ">" always evaluates to 'false'
     Newx(*c, lenc+1, char);
     ^

"XSMore.xs", line 63: warning #4276-D: relational operator ">" always evaluates to 'false'
     Newx(*c, lenc+1, char);
     ^

"/pro/3gl/CPAN/perl-current/sv_inline.h", line 487: warning #4232-D: conversion from "XPVIO *" to a more strictly aligned type "XPVMG *" may cause misaligned access
              SvSTASH_set(io, MUTABLE_HV(SvREFCNT_inc(GvHV(iogv))));
              ^

"/pro/3gl/CPAN/perl-current/sv_inline.h", line 468: warning #4276-D: relational operator ">" always evaluates to 'false'
              Zero(new_body, type_details->body_size, char);
              ^

c++: error: +Z: No such file or directory
c++: error: +O2: No such file or directory
c++: error: +Onolimit: No such file or directory
"../sv_inline.h", line 487: warning #4232-D: conversion from "XPVIO *" to a more strictly aligned type "XPVMG *" may cause misaligned access
              SvSTASH_set(io, MUTABLE_HV(SvREFCNT_inc(GvHV(iogv))));
              ^

"../sv_inline.h", line 468: warning #4276-D: relational operator ">" always evaluates to 'false'
              Zero(new_body, type_details->body_size, char);
              ^

cc: warning 983: The -lc library specified on the command line is also added automatically by the compiler driver.  
# Failed test 1701 - sprintf( "%.54g", 0.3 ) renders correctly at op/sprintf2.t line 1197
#      got "0.299999999999999988897769753748434596"
# expected eq "0.299999999999999988897769753748434595763683319091796875"
Subroutine Time::HiRes::constant redefined at (eval 37) line 1.
Subroutine Time::HiRes::usleep redefined at (eval 37) line 1.
Subroutine Time::HiRes::nanosleep redefined at (eval 37) line 1.
Subroutine Time::HiRes::sleep redefined at (eval 37) line 1.
Subroutine Time::HiRes::ualarm redefined at (eval 37) line 1.
Subroutine Time::HiRes::alarm redefined at (eval 37) line 1.
Subroutine Time::HiRes::gettimeofday redefined at (eval 37) line 1.
Subroutine Time::HiRes::time redefined at (eval 37) line 1.
Subroutine Time::HiRes::setitimer redefined at (eval 37) line 1.
Subroutine Time::HiRes::getitimer redefined at (eval 37) line 1.
Subroutine Time::HiRes::utime redefined at (eval 37) line 1.
Subroutine Time::HiRes::clock_gettime redefined at (eval 37) line 1.
Subroutine Time::HiRes::clock_getres redefined at (eval 37) line 1.
Subroutine Time::HiRes::clock_nanosleep redefined at (eval 37) line 1.
Subroutine Time::HiRes::clock redefined at (eval 37) line 1.
Subroutine Time::HiRes::lstat redefined at (eval 37) line 1.
Subroutine Time::HiRes::stat redefined at (eval 37) line 1.
# Connected to 127.0.0.1
# Connected to 127.0.0.1
Integer overflow in hexadecimal number at t/broken_univ_can.t line 13.
make: *** [test_harness] Error 1

error while running harness target 'test_harness': 2 at /pro/3gl/CPAN/smoke/lib/Test/Smoke/App/RunSmoke.pm line 118.
[2022-05-19 04:37:11+0200] 
[2022-05-19 04:37:11+0200] ../dist/Net-Ping/t/450_service.t............................PASSED
[2022-05-19 04:37:11+0200]     9, 18
[2022-05-19 04:37:11+0200] ../t/op/sprintf2.t..........................................FAILED
[2022-05-19 04:37:11+0200]     1701
[2022-05-19 04:37:11+0200] Archived results...
[2022-05-19 04:37:11+0200] Unskip tests from '/pro/3gl/CPAN/smoke/p59.skip'
[2022-05-19 04:37:11+0200] 
[2022-05-19 04:37:11+0200] Configuration: -Dusedevel -Duseithreads -DDEBUGGING
[2022-05-19 04:37:11+0200] ------------------------------------------------------------------------------
[2022-05-19 04:37:11+0200] make distclean ...
[2022-05-19 04:37:54+0200] 
[2022-05-19 04:37:54+0200] Copy Policy.sh ...
[2022-05-19 04:37:54+0200] 
[2022-05-19 04:37:54+0200] Configure ...
[2022-05-19 04:39:34+0200] 
[2022-05-19 04:39:34+0200] make ...
[2022-05-19 05:02:07+0200] Skip tests from '/pro/3gl/CPAN/smoke/p59.skip'
[2022-05-19 05:02:07+0200] 	cpan/Sys-Syslog/t/syslog.t
[2022-05-19 05:02:07+0200] 
[2022-05-19 05:02:07+0200]  Tests start here:
[2022-05-19 05:02:07+0200] TSTENV = stdio	
No saved state, selection will be empty
Cannot figure out an encoding to use at t/use-Encode-Alias.t line 5.
"../../../../sv_inline.h", line 487: warning #4232-D: conversion from "XPVIO *" to a more strictly aligned type "XPVMG *" may cause misaligned access
              SvSTASH_set(io, MUTABLE_HV(SvREFCNT_inc(GvHV(iogv))));
              ^

"../../../../sv_inline.h", line 468: warning #4276-D: relational operator ">" always evaluates to 'false'
              Zero(new_body, type_details->body_size, char);
              ^

"../../../../sv_inline.h", line 487: warning #4232-D: conversion from "XPVIO *" to a more strictly aligned type "XPVMG *" may cause misaligned access
              SvSTASH_set(io, MUTABLE_HV(SvREFCNT_inc(GvHV(iogv))));
              ^

"../../../../sv_inline.h", line 468: warning #4276-D: relational operator ">" always evaluates to 'false'
              Zero(new_body, type_details->body_size, char);
              ^

"../../../../sv_inline.h", line 487: warning #4232-D: conversion from "XPVIO *" to a more strictly aligned type "XPVMG *" may cause misaligned access
              SvSTASH_set(io, MUTABLE_HV(SvREFCNT_inc(GvHV(iogv))));
              ^

"../../../../sv_inline.h", line 468: warning #4276-D: relational operator ">" always evaluates to 'false'
              Zero(new_body, type_details->body_size, char);
              ^

"../../../../sv_inline.h", line 487: warning #4232-D: conversion from "XPVIO *" to a more strictly aligned type "XPVMG *" may cause misaligned access
              SvSTASH_set(io, MUTABLE_HV(SvREFCNT_inc(GvHV(iogv))));
              ^

"../../../../sv_inline.h", line 468: warning #4276-D: relational operator ">" always evaluates to 'false'
              Zero(new_body, type_details->body_size, char);
              ^

"../../../../sv_inline.h", line 487: warning #4232-D: conversion from "XPVIO *" to a more strictly aligned type "XPVMG *" may cause misaligned access
              SvSTASH_set(io, MUTABLE_HV(SvREFCNT_inc(GvHV(iogv))));
              ^

"../../../../sv_inline.h", line 468: warning #4276-D: relational operator ">" always evaluates to 'false'
              Zero(new_body, type_details->body_size, char);
              ^

"../../../../sv_inline.h", line 487: warning #4232-D: conversion from "XPVIO *" to a more strictly aligned type "XPVMG *" may cause misaligned access
              SvSTASH_set(io, MUTABLE_HV(SvREFCNT_inc(GvHV(iogv))));
              ^

"../../../../sv_inline.h", line 468: warning #4276-D: relational operator ">" always evaluates to 'false'
              Zero(new_body, type_details->body_size, char);
              ^

"../../../../sv_inline.h", line 487: warning #4232-D: conversion from "XPVIO *" to a more strictly aligned type "XPVMG *" may cause misaligned access
              SvSTASH_set(io, MUTABLE_HV(SvREFCNT_inc(GvHV(iogv))));
              ^

"../../../../sv_inline.h", line 468: warning #4276-D: relational operator ">" always evaluates to 'false'
              Zero(new_body, type_details->body_size, char);
              ^

# Connected to 127.0.0.1
# Connected to 127.0.0.1
Integer overflow in hexadecimal number at t/broken_univ_can.t line 13.
Redefining sub xChild::foo at xChild--14961 line 2.
Redefining sub Data::ok at -e line 1.
"/pro/3gl/CPAN/perl-current/sv_inline.h", line 487: warning #4232-D: conversion from "XPVIO *" to a more strictly aligned type "XPVMG *" may cause misaligned access
              SvSTASH_set(io, MUTABLE_HV(SvREFCNT_inc(GvHV(iogv))));
              ^

"XSTest.c", line 249: warning #2111-D: statement is unreachable
  	PUTBACK;
  	^

"/pro/3gl/CPAN/perl-current/sv_inline.h", line 468: warning #4276-D: relational operator ">" always evaluates to 'false'
              Zero(new_body, type_details->body_size, char);
              ^

c++: error: +Z: No such file or directory
c++: error: +O2: No such file or directory
c++: error: +Onolimit: No such file or directory
"/pro/3gl/CPAN/perl-current/sv_inline.h", line 487: warning #4232-D: conversion from "XPVIO *" to a more strictly aligned type "XPVMG *" may cause misaligned access
              SvSTASH_set(io, MUTABLE_HV(SvREFCNT_inc(GvHV(iogv))));
              ^

"/pro/3gl/CPAN/perl-current/sv_inline.h", line 468: warning #4276-D: relational operator ">" always evaluates to 'false'
              Zero(new_body, type_details->body_size, char);
              ^

"XSMore.xs", line 48: warning #4276-D: relational operator ">" always evaluates to 'false'
     Newx(*c, lenc+1, char);
     ^

"XSMore.xs", line 63: warning #4276-D: relational operator ">" always evaluates to 'false'
     Newx(*c, lenc+1, char);
     ^

"/pro/3gl/CPAN/perl-current/sv_inline.h", line 487: warning #4232-D: conversion from "XPVIO *" to a more strictly aligned type "XPVMG *" may cause misaligned access
              SvSTASH_set(io, MUTABLE_HV(SvREFCNT_inc(GvHV(iogv))));
              ^

"/pro/3gl/CPAN/perl-current/sv_inline.h", line 468: warning #4276-D: relational operator ">" always evaluates to 'false'
              Zero(new_body, type_details->body_size, char);
              ^

Subroutine Time::HiRes::constant redefined at (eval 37) line 1.
Subroutine Time::HiRes::usleep redefined at (eval 37) line 1.
Subroutine Time::HiRes::nanosleep redefined at (eval 37) line 1.
Subroutine Time::HiRes::sleep redefined at (eval 37) line 1.
Subroutine Time::HiRes::ualarm redefined at (eval 37) line 1.
Subroutine Time::HiRes::alarm redefined at (eval 37) line 1.
Subroutine Time::HiRes::gettimeofday redefined at (eval 37) line 1.
Subroutine Time::HiRes::time redefined at (eval 37) line 1.
Subroutine Time::HiRes::setitimer redefined at (eval 37) line 1.
Subroutine Time::HiRes::getitimer redefined at (eval 37) line 1.
Subroutine Time::HiRes::utime redefined at (eval 37) line 1.
Subroutine Time::HiRes::clock_gettime redefined at (eval 37) line 1.
Subroutine Time::HiRes::clock_getres redefined at (eval 37) line 1.
Subroutine Time::HiRes::clock_nanosleep redefined at (eval 37) line 1.
Subroutine Time::HiRes::clock redefined at (eval 37) line 1.
Subroutine Time::HiRes::lstat redefined at (eval 37) line 1.
Subroutine Time::HiRes::stat redefined at (eval 37) line 1.
"../sv_inline.h", line 487: warning #4232-D: conversion from "XPVIO *" to a more strictly aligned type "XPVMG *" may cause misaligned access
              SvSTASH_set(io, MUTABLE_HV(SvREFCNT_inc(GvHV(iogv))));
              ^

"../sv_inline.h", line 468: warning #4276-D: relational operator ">" always evaluates to 'false'
              Zero(new_body, type_details->body_size, char);
              ^

cc: warning 983: The -lc library specified on the command line is also added automatically by the compiler driver.  
# Failed test 1701 - sprintf( "%.54g", 0.3 ) renders correctly at op/sprintf2.t line 1197
#      got "0.299999999999999988897769753748434596"
# expected eq "0.299999999999999988897769753748434595763683319091796875"
make: *** [test_harness] Error 1

error while running harness target 'test_harness': 2 at /pro/3gl/CPAN/smoke/lib/Test/Smoke/App/RunSmoke.pm line 118.
[2022-05-19 05:23:11+0200] 
[2022-05-19 05:23:11+0200] ../dist/Net-Ping/t/450_service.t............................PASSED
[2022-05-19 05:23:11+0200]     9, 18
[2022-05-19 05:23:11+0200] ../t/op/sprintf2.t..........................................FAILED
[2022-05-19 05:23:11+0200]     1701
[2022-05-19 05:23:11+0200] Archived results...
[2022-05-19 05:23:11+0200] TSTENV = perlio	
"../../../../sv_inline.h", line 487: warning #4232-D: conversion from "XPVIO *" to a more strictly aligned type "XPVMG *" may cause misaligned access
              SvSTASH_set(io, MUTABLE_HV(SvREFCNT_inc(GvHV(iogv))));
              ^

"../../../../sv_inline.h", line 468: warning #4276-D: relational operator ">" always evaluates to 'false'
              Zero(new_body, type_details->body_size, char);
              ^

"../../../../sv_inline.h", line 487: warning #4232-D: conversion from "XPVIO *" to a more strictly aligned type "XPVMG *" may cause misaligned access
              SvSTASH_set(io, MUTABLE_HV(SvREFCNT_inc(GvHV(iogv))));
              ^

"../../../../sv_inline.h", line 468: warning #4276-D: relational operator ">" always evaluates to 'false'
              Zero(new_body, type_details->body_size, char);
              ^

"../../../../sv_inline.h", line 487: warning #4232-D: conversion from "XPVIO *" to a more strictly aligned type "XPVMG *" may cause misaligned access
              SvSTASH_set(io, MUTABLE_HV(SvREFCNT_inc(GvHV(iogv))));
              ^

"../../../../sv_inline.h", line 468: warning #4276-D: relational operator ">" always evaluates to 'false'
              Zero(new_body, type_details->body_size, char);
              ^

"../../../../sv_inline.h", line 487: warning #4232-D: conversion from "XPVIO *" to a more strictly aligned type "XPVMG *" may cause misaligned access
              SvSTASH_set(io, MUTABLE_HV(SvREFCNT_inc(GvHV(iogv))));
              ^

"../../../../sv_inline.h", line 468: warning #4276-D: relational operator ">" always evaluates to 'false'
              Zero(new_body, type_details->body_size, char);
              ^

"../../../../sv_inline.h", line 487: warning #4232-D: conversion from "XPVIO *" to a more strictly aligned type "XPVMG *" may cause misaligned access
              SvSTASH_set(io, MUTABLE_HV(SvREFCNT_inc(GvHV(iogv))));
              ^

"../../../../sv_inline.h", line 468: warning #4276-D: relational operator ">" always evaluates to 'false'
              Zero(new_body, type_details->body_size, char);
              ^

"../../../../sv_inline.h", line 487: warning #4232-D: conversion from "XPVIO *" to a more strictly aligned type "XPVMG *" may cause misaligned access
              SvSTASH_set(io, MUTABLE_HV(SvREFCNT_inc(GvHV(iogv))));
              ^

"../../../../sv_inline.h", line 468: warning #4276-D: relational operator ">" always evaluates to 'false'
              Zero(new_body, type_details->body_size, char);
              ^

"../../../../sv_inline.h", line 487: warning #4232-D: conversion from "XPVIO *" to a more strictly aligned type "XPVMG *" may cause misaligned access
              SvSTASH_set(io, MUTABLE_HV(SvREFCNT_inc(GvHV(iogv))));
              ^

"../../../../sv_inline.h", line 468: warning #4276-D: relational operator ">" always evaluates to 'false'
              Zero(new_body, type_details->body_size, char);
              ^

"/pro/3gl/CPAN/perl-current/sv_inline.h", line 487: warning #4232-D: conversion from "XPVIO *" to a more strictly aligned type "XPVMG *" may cause misaligned access
              SvSTASH_set(io, MUTABLE_HV(SvREFCNT_inc(GvHV(iogv))));
              ^

"XSTest.c", line 249: warning #2111-D: statement is unreachable
  	PUTBACK;
  	^

"/pro/3gl/CPAN/perl-current/sv_inline.h", line 468: warning #4276-D: relational operator ">" always evaluates to 'false'
              Zero(new_body, type_details->body_size, char);
              ^

"/pro/3gl/CPAN/perl-current/sv_inline.h", line 487: warning #4232-D: conversion from "XPVIO *" to a more strictly aligned type "XPVMG *" may cause misaligned access
              SvSTASH_set(io, MUTABLE_HV(SvREFCNT_inc(GvHV(iogv))));
              ^

"/pro/3gl/CPAN/perl-current/sv_inline.h", line 468: warning #4276-D: relational operator ">" always evaluates to 'false'
              Zero(new_body, type_details->body_size, char);
              ^

"XSMore.xs", line 48: warning #4276-D: relational operator ">" always evaluates to 'false'
     Newx(*c, lenc+1, char);
     ^

"XSMore.xs", line 63: warning #4276-D: relational operator ">" always evaluates to 'false'
     Newx(*c, lenc+1, char);
     ^

"/pro/3gl/CPAN/perl-current/sv_inline.h", line 487: warning #4232-D: conversion from "XPVIO *" to a more strictly aligned type "XPVMG *" may cause misaligned access
              SvSTASH_set(io, MUTABLE_HV(SvREFCNT_inc(GvHV(iogv))));
              ^

"/pro/3gl/CPAN/perl-current/sv_inline.h", line 468: warning #4276-D: relational operator ">" always evaluates to 'false'
              Zero(new_body, type_details->body_size, char);
              ^

c++: error: +Z: No such file or directory
c++: error: +O2: No such file or directory
c++: error: +Onolimit: No such file or directory
"../sv_inline.h", line 487: warning #4232-D: conversion from "XPVIO *" to a more strictly aligned type "XPVMG *" may cause misaligned access
              SvSTASH_set(io, MUTABLE_HV(SvREFCNT_inc(GvHV(iogv))));
              ^

"../sv_inline.h", line 468: warning #4276-D: relational operator ">" always evaluates to 'false'
              Zero(new_body, type_details->body_size, char);
              ^

cc: warning 983: The -lc library specified on the command line is also added automatically by the compiler driver.  
# Failed test 1701 - sprintf( "%.54g", 0.3 ) renders correctly at op/sprintf2.t line 1197
#      got "0.299999999999999988897769753748434596"
# expected eq "0.299999999999999988897769753748434595763683319091796875"
# Connected to 127.0.0.1
# Connected to 127.0.0.1
Subroutine Time::HiRes::constant redefined at (eval 37) line 1.
Subroutine Time::HiRes::usleep redefined at (eval 37) line 1.
Subroutine Time::HiRes::nanosleep redefined at (eval 37) line 1.
Subroutine Time::HiRes::sleep redefined at (eval 37) line 1.
Subroutine Time::HiRes::ualarm redefined at (eval 37) line 1.
Subroutine Time::HiRes::alarm redefined at (eval 37) line 1.
Subroutine Time::HiRes::gettimeofday redefined at (eval 37) line 1.
Subroutine Time::HiRes::time redefined at (eval 37) line 1.
Subroutine Time::HiRes::setitimer redefined at (eval 37) line 1.
Subroutine Time::HiRes::getitimer redefined at (eval 37) line 1.
Subroutine Time::HiRes::utime redefined at (eval 37) line 1.
Subroutine Time::HiRes::clock_gettime redefined at (eval 37) line 1.
Subroutine Time::HiRes::clock_getres redefined at (eval 37) line 1.
Subroutine Time::HiRes::clock_nanosleep redefined at (eval 37) line 1.
Subroutine Time::HiRes::clock redefined at (eval 37) line 1.
Subroutine Time::HiRes::lstat redefined at (eval 37) line 1.
Subroutine Time::HiRes::stat redefined at (eval 37) line 1.
Cannot figure out an encoding to use at t/use-Encode-Alias.t line 5.
Integer overflow in hexadecimal number at t/broken_univ_can.t line 13.
make: *** [test_harness] Error 1

error while running harness target 'test_harness': 2 at /pro/3gl/CPAN/smoke/lib/Test/Smoke/App/RunSmoke.pm line 118.
[2022-05-19 05:41:37+0200] 
[2022-05-19 05:41:37+0200] ../dist/Net-Ping/t/450_service.t............................PASSED
[2022-05-19 05:41:37+0200]     9, 18
[2022-05-19 05:41:37+0200] ../t/op/sprintf2.t..........................................FAILED
[2022-05-19 05:41:37+0200]     1701
[2022-05-19 05:41:37+0200] Archived results...
[2022-05-19 05:41:37+0200] TSTENV = locale:en_US.utf8	
"../../../../sv_inline.h", line 487: warning #4232-D: conversion from "XPVIO *" to a more strictly aligned type "XPVMG *" may cause misaligned access
              SvSTASH_set(io, MUTABLE_HV(SvREFCNT_inc(GvHV(iogv))));
              ^

"../../../../sv_inline.h", line 468: warning #4276-D: relational operator ">" always evaluates to 'false'
              Zero(new_body, type_details->body_size, char);
              ^

"../../../../sv_inline.h", line 487: warning #4232-D: conversion from "XPVIO *" to a more strictly aligned type "XPVMG *" may cause misaligned access
              SvSTASH_set(io, MUTABLE_HV(SvREFCNT_inc(GvHV(iogv))));
              ^

"../../../../sv_inline.h", line 468: warning #4276-D: relational operator ">" always evaluates to 'false'
              Zero(new_body, type_details->body_size, char);
              ^

"../../../../sv_inline.h", line 487: warning #4232-D: conversion from "XPVIO *" to a more strictly aligned type "XPVMG *" may cause misaligned access
              SvSTASH_set(io, MUTABLE_HV(SvREFCNT_inc(GvHV(iogv))));
              ^

"../../../../sv_inline.h", line 468: warning #4276-D: relational operator ">" always evaluates to 'false'
              Zero(new_body, type_details->body_size, char);
              ^

"../../../../sv_inline.h", line 487: warning #4232-D: conversion from "XPVIO *" to a more strictly aligned type "XPVMG *" may cause misaligned access
              SvSTASH_set(io, MUTABLE_HV(SvREFCNT_inc(GvHV(iogv))));
              ^

"../../../../sv_inline.h", line 468: warning #4276-D: relational operator ">" always evaluates to 'false'
              Zero(new_body, type_details->body_size, char);
              ^

"../../../../sv_inline.h", line 487: warning #4232-D: conversion from "XPVIO *" to a more strictly aligned type "XPVMG *" may cause misaligned access
              SvSTASH_set(io, MUTABLE_HV(SvREFCNT_inc(GvHV(iogv))));
              ^

"../../../../sv_inline.h", line 468: warning #4276-D: relational operator ">" always evaluates to 'false'
              Zero(new_body, type_details->body_size, char);
              ^

"../../../../sv_inline.h", line 487: warning #4232-D: conversion from "XPVIO *" to a more strictly aligned type "XPVMG *" may cause misaligned access
              SvSTASH_set(io, MUTABLE_HV(SvREFCNT_inc(GvHV(iogv))));
              ^

"../../../../sv_inline.h", line 468: warning #4276-D: relational operator ">" always evaluates to 'false'
              Zero(new_body, type_details->body_size, char);
              ^

"../../../../sv_inline.h", line 487: warning #4232-D: conversion from "XPVIO *" to a more strictly aligned type "XPVMG *" may cause misaligned access
              SvSTASH_set(io, MUTABLE_HV(SvREFCNT_inc(GvHV(iogv))));
              ^

"../../../../sv_inline.h", line 468: warning #4276-D: relational operator ">" always evaluates to 'false'
              Zero(new_body, type_details->body_size, char);
              ^

"/pro/3gl/CPAN/perl-current/sv_inline.h", line 487: warning #4232-D: conversion from "XPVIO *" to a more strictly aligned type "XPVMG *" may cause misaligned access
              SvSTASH_set(io, MUTABLE_HV(SvREFCNT_inc(GvHV(iogv))));
              ^

"XSTest.c", line 249: warning #2111-D: statement is unreachable
  	PUTBACK;
  	^

"/pro/3gl/CPAN/perl-current/sv_inline.h", line 468: warning #4276-D: relational operator ">" always evaluates to 'false'
              Zero(new_body, type_details->body_size, char);
              ^

"/pro/3gl/CPAN/perl-current/sv_inline.h", line 487: warning #4232-D: conversion from "XPVIO *" to a more strictly aligned type "XPVMG *" may cause misaligned access
              SvSTASH_set(io, MUTABLE_HV(SvREFCNT_inc(GvHV(iogv))));
              ^

"/pro/3gl/CPAN/perl-current/sv_inline.h", line 468: warning #4276-D: relational operator ">" always evaluates to 'false'
              Zero(new_body, type_details->body_size, char);
              ^

"XSMore.xs", line 48: warning #4276-D: relational operator ">" always evaluates to 'false'
     Newx(*c, lenc+1, char);
     ^

"XSMore.xs", line 63: warning #4276-D: relational operator ">" always evaluates to 'false'
     Newx(*c, lenc+1, char);
     ^

"/pro/3gl/CPAN/perl-current/sv_inline.h", line 487: warning #4232-D: conversion from "XPVIO *" to a more strictly aligned type "XPVMG *" may cause misaligned access
              SvSTASH_set(io, MUTABLE_HV(SvREFCNT_inc(GvHV(iogv))));
              ^

"/pro/3gl/CPAN/perl-current/sv_inline.h", line 468: warning #4276-D: relational operator ">" always evaluates to 'false'
              Zero(new_body, type_details->body_size, char);
              ^

c++: error: +Z: No such file or directory
c++: error: +O2: No such file or directory
c++: error: +Onolimit: No such file or directory
"../sv_inline.h", line 487: warning #4232-D: conversion from "XPVIO *" to a more strictly aligned type "XPVMG *" may cause misaligned access
              SvSTASH_set(io, MUTABLE_HV(SvREFCNT_inc(GvHV(iogv))));
              ^

"../sv_inline.h", line 468: warning #4276-D: relational operator ">" always evaluates to 'false'
              Zero(new_body, type_details->body_size, char);
              ^

cc: warning 983: The -lc library specified on the command line is also added automatically by the compiler driver.  
# Failed test 1701 - sprintf( "%.54g", 0.3 ) renders correctly at op/sprintf2.t line 1197
#      got "0.299999999999999988897769753748434596"
# expected eq "0.299999999999999988897769753748434595763683319091796875"
Subroutine Time::HiRes::constant redefined at (eval 37) line 1.
Subroutine Time::HiRes::usleep redefined at (eval 37) line 1.
Subroutine Time::HiRes::nanosleep redefined at (eval 37) line 1.
Subroutine Time::HiRes::sleep redefined at (eval 37) line 1.
Subroutine Time::HiRes::ualarm redefined at (eval 37) line 1.
Subroutine Time::HiRes::alarm redefined at (eval 37) line 1.
Subroutine Time::HiRes::gettimeofday redefined at (eval 37) line 1.
Subroutine Time::HiRes::time redefined at (eval 37) line 1.
Subroutine Time::HiRes::setitimer redefined at (eval 37) line 1.
Subroutine Time::HiRes::getitimer redefined at (eval 37) line 1.
Subroutine Time::HiRes::utime redefined at (eval 37) line 1.
Subroutine Time::HiRes::clock_gettime redefined at (eval 37) line 1.
Subroutine Time::HiRes::clock_getres redefined at (eval 37) line 1.
Subroutine Time::HiRes::clock_nanosleep redefined at (eval 37) line 1.
Subroutine Time::HiRes::clock redefined at (eval 37) line 1.
Subroutine Time::HiRes::lstat redefined at (eval 37) line 1.
Subroutine Time::HiRes::stat redefined at (eval 37) line 1.
# Connected to 127.0.0.1
# Connected to 127.0.0.1
Integer overflow in hexadecimal number at t/broken_univ_can.t line 13.
make: *** [test_harness] Error 1

error while running harness target 'test_harness': 2 at /pro/3gl/CPAN/smoke/lib/Test/Smoke/App/RunSmoke.pm line 118.
[2022-05-19 06:00:18+0200] 
[2022-05-19 06:00:18+0200] ../dist/Net-Ping/t/450_service.t............................PASSED
[2022-05-19 06:00:18+0200]     9, 18
[2022-05-19 06:00:18+0200] ../t/op/sprintf2.t..........................................FAILED
[2022-05-19 06:00:18+0200]     1701
[2022-05-19 06:00:18+0200] Archived results...
[2022-05-19 06:00:18+0200] Unskip tests from '/pro/3gl/CPAN/smoke/p59.skip'
[2022-05-19 06:00:18+0200] 
[2022-05-19 06:00:18+0200] Configuration: -Dusedevel -Duseithreads -Duse64bitall
[2022-05-19 06:00:18+0200] ------------------------------------------------------------------------------
[2022-05-19 06:00:18+0200] make distclean ...
[2022-05-19 06:01:05+0200] 
[2022-05-19 06:01:05+0200] Copy Policy.sh ...
[2022-05-19 06:01:05+0200] 
[2022-05-19 06:01:05+0200] Configure ...
[2022-05-19 06:02:42+0200] 
[2022-05-19 06:02:42+0200] make ...
[2022-05-19 06:20:54+0200] Skip tests from '/pro/3gl/CPAN/smoke/p59.skip'
[2022-05-19 06:20:54+0200] 	cpan/Sys-Syslog/t/syslog.t
[2022-05-19 06:20:54+0200] 
[2022-05-19 06:20:54+0200]  Tests start here:
[2022-05-19 06:20:54+0200] TSTENV = stdio	
No saved state, selection will be empty
Cannot figure out an encoding to use at t/use-Encode-Alias.t line 5.
"../../../../sv_inline.h", line 468: warning #4276-D: relational operator ">" always evaluates to 'false'
              Zero(new_body, type_details->body_size, char);
              ^

"../../../../sv_inline.h", line 468: warning #4276-D: relational operator ">" always evaluates to 'false'
              Zero(new_body, type_details->body_size, char);
              ^

"../../../../sv_inline.h", line 468: warning #4276-D: relational operator ">" always evaluates to 'false'
              Zero(new_body, type_details->body_size, char);
              ^

"../../../../sv_inline.h", line 468: warning #4276-D: relational operator ">" always evaluates to 'false'
              Zero(new_body, type_details->body_size, char);
              ^

"../../../../sv_inline.h", line 468: warning #4276-D: relational operator ">" always evaluates to 'false'
              Zero(new_body, type_details->body_size, char);
              ^

"../../../../sv_inline.h", line 468: warning #4276-D: relational operator ">" always evaluates to 'false'
              Zero(new_body, type_details->body_size, char);
              ^

"../../../../sv_inline.h", line 468: warning #4276-D: relational operator ">" always evaluates to 'false'
              Zero(new_body, type_details->body_size, char);
              ^

# Connected to 127.0.0.1
# Connected to 127.0.0.1
Redefining sub xChild::foo at xChild--24941 line 2.
Redefining sub Data::ok at -e line 1.
"XSTest.c", line 249: warning #2111-D: statement is unreachable
  	PUTBACK;
  	^

"/pro/3gl/CPAN/perl-current/sv_inline.h", line 468: warning #4276-D: relational operator ">" always evaluates to 'false'
              Zero(new_body, type_details->body_size, char);
              ^

c++: error: +Z: No such file or directory
c++: error: +O2: No such file or directory
c++: error: +Onolimit: No such file or directory
"/pro/3gl/CPAN/perl-current/sv_inline.h", line 468: warning #4276-D: relational operator ">" always evaluates to 'false'
              Zero(new_body, type_details->body_size, char);
              ^

"XSMore.xs", line 48: warning #4276-D: relational operator ">" always evaluates to 'false'
     Newx(*c, lenc+1, char);
     ^

"XSMore.xs", line 63: warning #4276-D: relational operator ">" always evaluates to 'false'
     Newx(*c, lenc+1, char);
     ^

"/pro/3gl/CPAN/perl-current/sv_inline.h", line 468: warning #4276-D: relational operator ">" always evaluates to 'false'
              Zero(new_body, type_details->body_size, char);
              ^

Subroutine Time::HiRes::constant redefined at (eval 37) line 1.
Subroutine Time::HiRes::usleep redefined at (eval 37) line 1.
Subroutine Time::HiRes::nanosleep redefined at (eval 37) line 1.
Subroutine Time::HiRes::sleep redefined at (eval 37) line 1.
Subroutine Time::HiRes::ualarm redefined at (eval 37) line 1.
Subroutine Time::HiRes::alarm redefined at (eval 37) line 1.
Subroutine Time::HiRes::gettimeofday redefined at (eval 37) line 1.
Subroutine Time::HiRes::time redefined at (eval 37) line 1.
Subroutine Time::HiRes::setitimer redefined at (eval 37) line 1.
Subroutine Time::HiRes::getitimer redefined at (eval 37) line 1.
Subroutine Time::HiRes::utime redefined at (eval 37) line 1.
Subroutine Time::HiRes::clock_gettime redefined at (eval 37) line 1.
Subroutine Time::HiRes::clock_getres redefined at (eval 37) line 1.
Subroutine Time::HiRes::clock_nanosleep redefined at (eval 37) line 1.
Subroutine Time::HiRes::clock redefined at (eval 37) line 1.
Subroutine Time::HiRes::lstat redefined at (eval 37) line 1.
Subroutine Time::HiRes::stat redefined at (eval 37) line 1.
"../sv_inline.h", line 468: warning #4276-D: relational operator ">" always evaluates to 'false'
              Zero(new_body, type_details->body_size, char);
              ^

cc: warning 983: The -lc library specified on the command line is also added automatically by the compiler driver.  
# Failed test 1704 - sprintf( "%.54g", 0.3 ) renders correctly at op/sprintf2.t line 1197
#      got "0.299999999999999988897769753748434596"
# expected eq "0.299999999999999988897769753748434595763683319091796875"
make: *** [test_harness] Error 1

error while running harness target 'test_harness': 2 at /pro/3gl/CPAN/smoke/lib/Test/Smoke/App/RunSmoke.pm line 118.
[2022-05-19 06:40:23+0200] 
[2022-05-19 06:40:23+0200] ../dist/Net-Ping/t/450_service.t............................PASSED
[2022-05-19 06:40:23+0200]     9, 18
[2022-05-19 06:40:23+0200] ../t/op/sprintf2.t..........................................FAILED
[2022-05-19 06:40:23+0200]     1704
[2022-05-19 06:40:23+0200] ../t/re/reg_mesg.t..........................................FAILED
[2022-05-19 06:40:23+0200]     No plan found in TAP output
[2022-05-19 06:40:23+0200] ../t/re/regex_sets.t........................................FAILED
[2022-05-19 06:40:23+0200]     No plan found in TAP output
[2022-05-19 06:40:23+0200] Archived results...
[2022-05-19 06:40:23+0200] TSTENV = perlio	
"../../../../sv_inline.h", line 468: warning #4276-D: relational operator ">" always evaluates to 'false'
              Zero(new_body, type_details->body_size, char);
              ^

"../../../../sv_inline.h", line 468: warning #4276-D: relational operator ">" always evaluates to 'false'
              Zero(new_body, type_details->body_size, char);
              ^

"../../../../sv_inline.h", line 468: warning #4276-D: relational operator ">" always evaluates to 'false'
              Zero(new_body, type_details->body_size, char);
              ^

"../../../../sv_inline.h", line 468: warning #4276-D: relational operator ">" always evaluates to 'false'
              Zero(new_body, type_details->body_size, char);
              ^

"../../../../sv_inline.h", line 468: warning #4276-D: relational operator ">" always evaluates to 'false'
              Zero(new_body, type_details->body_size, char);
              ^

"../../../../sv_inline.h", line 468: warning #4276-D: relational operator ">" always evaluates to 'false'
              Zero(new_body, type_details->body_size, char);
              ^

"../../../../sv_inline.h", line 468: warning #4276-D: relational operator ">" always evaluates to 'false'
              Zero(new_body, type_details->body_size, char);
              ^

"XSTest.c", line 249: warning #2111-D: statement is unreachable
  	PUTBACK;
  	^

"/pro/3gl/CPAN/perl-current/sv_inline.h", line 468: warning #4276-D: relational operator ">" always evaluates to 'false'
              Zero(new_body, type_details->body_size, char);
              ^

"/pro/3gl/CPAN/perl-current/sv_inline.h", line 468: warning #4276-D: relational operator ">" always evaluates to 'false'
              Zero(new_body, type_details->body_size, char);
              ^

"XSMore.xs", line 48: warning #4276-D: relational operator ">" always evaluates to 'false'
     Newx(*c, lenc+1, char);
     ^

"XSMore.xs", line 63: warning #4276-D: relational operator ">" always evaluates to 'false'
     Newx(*c, lenc+1, char);
     ^

"/pro/3gl/CPAN/perl-current/sv_inline.h", line 468: warning #4276-D: relational operator ">" always evaluates to 'false'
              Zero(new_body, type_details->body_size, char);
              ^

c++: error: +Z: No such file or directory
c++: error: +O2: No such file or directory
c++: error: +Onolimit: No such file or directory
"../sv_inline.h", line 468: warning #4276-D: relational operator ">" always evaluates to 'false'
              Zero(new_body, type_details->body_size, char);
              ^

cc: warning 983: The -lc library specified on the command line is also added automatically by the compiler driver.  
# Failed test 1704 - sprintf( "%.54g", 0.3 ) renders correctly at op/sprintf2.t line 1197
#      got "0.299999999999999988897769753748434596"
# expected eq "0.299999999999999988897769753748434595763683319091796875"
# Connected to 127.0.0.1
# Connected to 127.0.0.1
Subroutine Time::HiRes::constant redefined at (eval 37) line 1.
Subroutine Time::HiRes::usleep redefined at (eval 37) line 1.
Subroutine Time::HiRes::nanosleep redefined at (eval 37) line 1.
Subroutine Time::HiRes::sleep redefined at (eval 37) line 1.
Subroutine Time::HiRes::ualarm redefined at (eval 37) line 1.
Subroutine Time::HiRes::alarm redefined at (eval 37) line 1.
Subroutine Time::HiRes::gettimeofday redefined at (eval 37) line 1.
Subroutine Time::HiRes::time redefined at (eval 37) line 1.
Subroutine Time::HiRes::setitimer redefined at (eval 37) line 1.
Subroutine Time::HiRes::getitimer redefined at (eval 37) line 1.
Subroutine Time::HiRes::utime redefined at (eval 37) line 1.
Subroutine Time::HiRes::clock_gettime redefined at (eval 37) line 1.
Subroutine Time::HiRes::clock_getres redefined at (eval 37) line 1.
Subroutine Time::HiRes::clock_nanosleep redefined at (eval 37) line 1.
Subroutine Time::HiRes::clock redefined at (eval 37) line 1.
Subroutine Time::HiRes::lstat redefined at (eval 37) line 1.
Subroutine Time::HiRes::stat redefined at (eval 37) line 1.
Cannot figure out an encoding to use at t/use-Encode-Alias.t line 5.
make: *** [test_harness] Error 1

error while running harness target 'test_harness': 2 at /pro/3gl/CPAN/smoke/lib/Test/Smoke/App/RunSmoke.pm line 118.
[2022-05-19 06:57:16+0200] 
[2022-05-19 06:57:16+0200] ../dist/Net-Ping/t/450_service.t............................PASSED
[2022-05-19 06:57:16+0200]     9, 18
[2022-05-19 06:57:16+0200] ../t/op/sprintf2.t..........................................FAILED
[2022-05-19 06:57:16+0200]     1704
[2022-05-19 06:57:16+0200] ../t/re/reg_mesg.t..........................................FAILED
[2022-05-19 06:57:16+0200]     No plan found in TAP output
[2022-05-19 06:57:16+0200] ../t/re/regex_sets.t........................................FAILED
[2022-05-19 06:57:16+0200]     No plan found in TAP output
[2022-05-19 06:57:16+0200] Archived results...
[2022-05-19 06:57:16+0200] TSTENV = locale:en_US.utf8	
"../../../../sv_inline.h", line 468: warning #4276-D: relational operator ">" always evaluates to 'false'
              Zero(new_body, type_details->body_size, char);
              ^

"../../../../sv_inline.h", line 468: warning #4276-D: relational operator ">" always evaluates to 'false'
              Zero(new_body, type_details->body_size, char);
              ^

"../../../../sv_inline.h", line 468: warning #4276-D: relational operator ">" always evaluates to 'false'
              Zero(new_body, type_details->body_size, char);
              ^

"../../../../sv_inline.h", line 468: warning #4276-D: relational operator ">" always evaluates to 'false'
              Zero(new_body, type_details->body_size, char);
              ^

"../../../../sv_inline.h", line 468: warning #4276-D: relational operator ">" always evaluates to 'false'
              Zero(new_body, type_details->body_size, char);
              ^

"../../../../sv_inline.h", line 468: warning #4276-D: relational operator ">" always evaluates to 'false'
              Zero(new_body, type_details->body_size, char);
              ^

"../../../../sv_inline.h", line 468: warning #4276-D: relational operator ">" always evaluates to 'false'
              Zero(new_body, type_details->body_size, char);
              ^

"XSTest.c", line 249: warning #2111-D: statement is unreachable
  	PUTBACK;
  	^

"/pro/3gl/CPAN/perl-current/sv_inline.h", line 468: warning #4276-D: relational operator ">" always evaluates to 'false'
              Zero(new_body, type_details->body_size, char);
              ^

"/pro/3gl/CPAN/perl-current/sv_inline.h", line 468: warning #4276-D: relational operator ">" always evaluates to 'false'
              Zero(new_body, type_details->body_size, char);
              ^

"XSMore.xs", line 48: warning #4276-D: relational operator ">" always evaluates to 'false'
     Newx(*c, lenc+1, char);
     ^

"XSMore.xs", line 63: warning #4276-D: relational operator ">" always evaluates to 'false'
     Newx(*c, lenc+1, char);
     ^

"/pro/3gl/CPAN/perl-current/sv_inline.h", line 468: warning #4276-D: relational operator ">" always evaluates to 'false'
              Zero(new_body, type_details->body_size, char);
              ^

c++: error: +Z: No such file or directory
c++: error: +O2: No such file or directory
c++: error: +Onolimit: No such file or directory
"../sv_inline.h", line 468: warning #4276-D: relational operator ">" always evaluates to 'false'
              Zero(new_body, type_details->body_size, char);
              ^

cc: warning 983: The -lc library specified on the command line is also added automatically by the compiler driver.  
# Failed test 1704 - sprintf( "%.54g", 0.3 ) renders correctly at op/sprintf2.t line 1197
#      got "0.299999999999999988897769753748434596"
# expected eq "0.299999999999999988897769753748434595763683319091796875"
Subroutine Time::HiRes::constant redefined at (eval 37) line 1.
Subroutine Time::HiRes::usleep redefined at (eval 37) line 1.
Subroutine Time::HiRes::nanosleep redefined at (eval 37) line 1.
Subroutine Time::HiRes::sleep redefined at (eval 37) line 1.
Subroutine Time::HiRes::ualarm redefined at (eval 37) line 1.
Subroutine Time::HiRes::alarm redefined at (eval 37) line 1.
Subroutine Time::HiRes::gettimeofday redefined at (eval 37) line 1.
Subroutine Time::HiRes::time redefined at (eval 37) line 1.
Subroutine Time::HiRes::setitimer redefined at (eval 37) line 1.
Subroutine Time::HiRes::getitimer redefined at (eval 37) line 1.
Subroutine Time::HiRes::utime redefined at (eval 37) line 1.
Subroutine Time::HiRes::clock_gettime redefined at (eval 37) line 1.
Subroutine Time::HiRes::clock_getres redefined at (eval 37) line 1.
Subroutine Time::HiRes::clock_nanosleep redefined at (eval 37) line 1.
Subroutine Time::HiRes::clock redefined at (eval 37) line 1.
Subroutine Time::HiRes::lstat redefined at (eval 37) line 1.
Subroutine Time::HiRes::stat redefined at (eval 37) line 1.
# Connected to 127.0.0.1
# Connected to 127.0.0.1
make: *** [test_harness] Error 1

error while running harness target 'test_harness': 2 at /pro/3gl/CPAN/smoke/lib/Test/Smoke/App/RunSmoke.pm line 118.
[2022-05-19 07:14:15+0200] 
[2022-05-19 07:14:15+0200] ../dist/Net-Ping/t/450_service.t............................PASSED
[2022-05-19 07:14:15+0200]     9, 18
[2022-05-19 07:14:15+0200] ../t/op/sprintf2.t..........................................FAILED
[2022-05-19 07:14:15+0200]     1704
[2022-05-19 07:14:15+0200] ../t/re/reg_mesg.t..........................................FAILED
[2022-05-19 07:14:15+0200]     No plan found in TAP output
[2022-05-19 07:14:15+0200] ../t/re/regex_sets.t........................................FAILED
[2022-05-19 07:14:15+0200]     No plan found in TAP output
[2022-05-19 07:14:15+0200] Archived results...
[2022-05-19 07:14:15+0200] Unskip tests from '/pro/3gl/CPAN/smoke/p59.skip'
[2022-05-19 07:14:15+0200] 
[2022-05-19 07:14:15+0200] Configuration: -Dusedevel -Duseithreads -Duse64bitall -DDEBUGGING
[2022-05-19 07:14:15+0200] ------------------------------------------------------------------------------
[2022-05-19 07:14:15+0200] make distclean ...
[2022-05-19 07:14:58+0200] 
[2022-05-19 07:14:58+0200] Copy Policy.sh ...
[2022-05-19 07:14:58+0200] 
[2022-05-19 07:14:58+0200] Configure ...
[2022-05-19 07:16:38+0200] 
[2022-05-19 07:16:38+0200] make ...
[2022-05-19 07:39:27+0200] Skip tests from '/pro/3gl/CPAN/smoke/p59.skip'
[2022-05-19 07:39:27+0200] 	cpan/Sys-Syslog/t/syslog.t
[2022-05-19 07:39:27+0200] 
[2022-05-19 07:39:27+0200]  Tests start here:
[2022-05-19 07:39:27+0200] TSTENV = stdio	
No saved state, selection will be empty
Cannot figure out an encoding to use at t/use-Encode-Alias.t line 5.
"../../../../sv_inline.h", line 468: warning #4276-D: relational operator ">" always evaluates to 'false'
              Zero(new_body, type_details->body_size, char);
              ^

"../../../../sv_inline.h", line 468: warning #4276-D: relational operator ">" always evaluates to 'false'
              Zero(new_body, type_details->body_size, char);
              ^

"../../../../sv_inline.h", line 468: warning #4276-D: relational operator ">" always evaluates to 'false'
              Zero(new_body, type_details->body_size, char);
              ^

"../../../../sv_inline.h", line 468: warning #4276-D: relational operator ">" always evaluates to 'false'
              Zero(new_body, type_details->body_size, char);
              ^

"../../../../sv_inline.h", line 468: warning #4276-D: relational operator ">" always evaluates to 'false'
              Zero(new_body, type_details->body_size, char);
              ^

"../../../../sv_inline.h", line 468: warning #4276-D: relational operator ">" always evaluates to 'false'
              Zero(new_body, type_details->body_size, char);
              ^

"../../../../sv_inline.h", line 468: warning #4276-D: relational operator ">" always evaluates to 'false'
              Zero(new_body, type_details->body_size, char);
              ^

# Connected to 127.0.0.1
# Connected to 127.0.0.1
Redefining sub xChild::foo at xChild--5301 line 2.
Redefining sub Data::ok at -e line 1.
"XSTest.c", line 249: warning #2111-D: statement is unreachable
  	PUTBACK;
  	^

"/pro/3gl/CPAN/perl-current/sv_inline.h", line 468: warning #4276-D: relational operator ">" always evaluates to 'false'
              Zero(new_body, type_details->body_size, char);
              ^

c++: error: +Z: No such file or directory
c++: error: +O2: No such file or directory
c++: error: +Onolimit: No such file or directory
"/pro/3gl/CPAN/perl-current/sv_inline.h", line 468: warning #4276-D: relational operator ">" always evaluates to 'false'
              Zero(new_body, type_details->body_size, char);
              ^

"XSMore.xs", line 48: warning #4276-D: relational operator ">" always evaluates to 'false'
     Newx(*c, lenc+1, char);
     ^

"XSMore.xs", line 63: warning #4276-D: relational operator ">" always evaluates to 'false'
     Newx(*c, lenc+1, char);
     ^

"/pro/3gl/CPAN/perl-current/sv_inline.h", line 468: warning #4276-D: relational operator ">" always evaluates to 'false'
              Zero(new_body, type_details->body_size, char);
              ^

Subroutine Time::HiRes::constant redefined at (eval 37) line 1.
Subroutine Time::HiRes::usleep redefined at (eval 37) line 1.
Subroutine Time::HiRes::nanosleep redefined at (eval 37) line 1.
Subroutine Time::HiRes::sleep redefined at (eval 37) line 1.
Subroutine Time::HiRes::ualarm redefined at (eval 37) line 1.
Subroutine Time::HiRes::alarm redefined at (eval 37) line 1.
Subroutine Time::HiRes::gettimeofday redefined at (eval 37) line 1.
Subroutine Time::HiRes::time redefined at (eval 37) line 1.
Subroutine Time::HiRes::setitimer redefined at (eval 37) line 1.
Subroutine Time::HiRes::getitimer redefined at (eval 37) line 1.
Subroutine Time::HiRes::utime redefined at (eval 37) line 1.
Subroutine Time::HiRes::clock_gettime redefined at (eval 37) line 1.
Subroutine Time::HiRes::clock_getres redefined at (eval 37) line 1.
Subroutine Time::HiRes::clock_nanosleep redefined at (eval 37) line 1.
Subroutine Time::HiRes::clock redefined at (eval 37) line 1.
Subroutine Time::HiRes::lstat redefined at (eval 37) line 1.
Subroutine Time::HiRes::stat redefined at (eval 37) line 1.
"../sv_inline.h", line 468: warning #4276-D: relational operator ">" always evaluates to 'false'
              Zero(new_body, type_details->body_size, char);
              ^

cc: warning 983: The -lc library specified on the command line is also added automatically by the compiler driver.  
# Failed test 1704 - sprintf( "%.54g", 0.3 ) renders correctly at op/sprintf2.t line 1197
#      got "0.299999999999999988897769753748434596"
# expected eq "0.299999999999999988897769753748434595763683319091796875"
make: *** [test_harness] Error 1

error while running harness target 'test_harness': 2 at /pro/3gl/CPAN/smoke/lib/Test/Smoke/App/RunSmoke.pm line 118.
[2022-05-19 08:01:43+0200] 
[2022-05-19 08:01:43+0200] ../dist/Net-Ping/t/450_service.t............................PASSED
[2022-05-19 08:01:43+0200]     9, 18
[2022-05-19 08:01:43+0200] ../t/op/sprintf2.t..........................................FAILED
[2022-05-19 08:01:43+0200]     1704
[2022-05-19 08:01:43+0200] ../t/re/reg_mesg.t..........................................FAILED
[2022-05-19 08:01:43+0200]     No plan found in TAP output
[2022-05-19 08:01:43+0200] ../t/re/regex_sets.t........................................FAILED
[2022-05-19 08:01:43+0200]     No plan found in TAP output
[2022-05-19 08:01:43+0200] Archived results...
[2022-05-19 08:01:43+0200] TSTENV = perlio	
"../../../../sv_inline.h", line 468: warning #4276-D: relational operator ">" always evaluates to 'false'
              Zero(new_body, type_details->body_size, char);
              ^

"../../../../sv_inline.h", line 468: warning #4276-D: relational operator ">" always evaluates to 'false'
              Zero(new_body, type_details->body_size, char);
              ^

"../../../../sv_inline.h", line 468: warning #4276-D: relational operator ">" always evaluates to 'false'
              Zero(new_body, type_details->body_size, char);
              ^

"../../../../sv_inline.h", line 468: warning #4276-D: relational operator ">" always evaluates to 'false'
              Zero(new_body, type_details->body_size, char);
              ^

"../../../../sv_inline.h", line 468: warning #4276-D: relational operator ">" always evaluates to 'false'
              Zero(new_body, type_details->body_size, char);
              ^

"../../../../sv_inline.h", line 468: warning #4276-D: relational operator ">" always evaluates to 'false'
              Zero(new_body, type_details->body_size, char);
              ^

"../../../../sv_inline.h", line 468: warning #4276-D: relational operator ">" always evaluates to 'false'
              Zero(new_body, type_details->body_size, char);
              ^

"XSTest.c", line 249: warning #2111-D: statement is unreachable
  	PUTBACK;
  	^

"/pro/3gl/CPAN/perl-current/sv_inline.h", line 468: warning #4276-D: relational operator ">" always evaluates to 'false'
              Zero(new_body, type_details->body_size, char);
              ^

"/pro/3gl/CPAN/perl-current/sv_inline.h", line 468: warning #4276-D: relational operator ">" always evaluates to 'false'
              Zero(new_body, type_details->body_size, char);
              ^

"XSMore.xs", line 48: warning #4276-D: relational operator ">" always evaluates to 'false'
     Newx(*c, lenc+1, char);
     ^

"XSMore.xs", line 63: warning #4276-D: relational operator ">" always evaluates to 'false'
     Newx(*c, lenc+1, char);
     ^

"/pro/3gl/CPAN/perl-current/sv_inline.h", line 468: warning #4276-D: relational operator ">" always evaluates to 'false'
              Zero(new_body, type_details->body_size, char);
              ^

c++: error: +Z: No such file or directory
c++: error: +O2: No such file or directory
c++: error: +Onolimit: No such file or directory
"../sv_inline.h", line 468: warning #4276-D: relational operator ">" always evaluates to 'false'
              Zero(new_body, type_details->body_size, char);
              ^

cc: warning 983: The -lc library specified on the command line is also added automatically by the compiler driver.  
# Failed test 1704 - sprintf( "%.54g", 0.3 ) renders correctly at op/sprintf2.t line 1197
#      got "0.299999999999999988897769753748434596"
# expected eq "0.299999999999999988897769753748434595763683319091796875"
# Connected to 127.0.0.1
# Connected to 127.0.0.1
Subroutine Time::HiRes::constant redefined at (eval 37) line 1.
Subroutine Time::HiRes::usleep redefined at (eval 37) line 1.
Subroutine Time::HiRes::nanosleep redefined at (eval 37) line 1.
Subroutine Time::HiRes::sleep redefined at (eval 37) line 1.
Subroutine Time::HiRes::ualarm redefined at (eval 37) line 1.
Subroutine Time::HiRes::alarm redefined at (eval 37) line 1.
Subroutine Time::HiRes::gettimeofday redefined at (eval 37) line 1.
Subroutine Time::HiRes::time redefined at (eval 37) line 1.
Subroutine Time::HiRes::setitimer redefined at (eval 37) line 1.
Subroutine Time::HiRes::getitimer redefined at (eval 37) line 1.
Subroutine Time::HiRes::utime redefined at (eval 37) line 1.
Subroutine Time::HiRes::clock_gettime redefined at (eval 37) line 1.
Subroutine Time::HiRes::clock_getres redefined at (eval 37) line 1.
Subroutine Time::HiRes::clock_nanosleep redefined at (eval 37) line 1.
Subroutine Time::HiRes::clock redefined at (eval 37) line 1.
Subroutine Time::HiRes::lstat redefined at (eval 37) line 1.
Subroutine Time::HiRes::stat redefined at (eval 37) line 1.
Cannot figure out an encoding to use at t/use-Encode-Alias.t line 5.
make: *** [test_harness] Error 1

error while running harness target 'test_harness': 2 at /pro/3gl/CPAN/smoke/lib/Test/Smoke/App/RunSmoke.pm line 118.
[2022-05-19 08:21:16+0200] 
[2022-05-19 08:21:16+0200] ../dist/Net-Ping/t/450_service.t............................PASSED
[2022-05-19 08:21:16+0200]     9, 18
[2022-05-19 08:21:16+0200] ../t/op/sprintf2.t..........................................FAILED
[2022-05-19 08:21:16+0200]     1704
[2022-05-19 08:21:16+0200] ../t/re/reg_mesg.t..........................................FAILED
[2022-05-19 08:21:16+0200]     No plan found in TAP output
[2022-05-19 08:21:16+0200] ../t/re/regex_sets.t........................................FAILED
[2022-05-19 08:21:16+0200]     No plan found in TAP output
[2022-05-19 08:21:16+0200] Archived results...
[2022-05-19 08:21:16+0200] TSTENV = locale:en_US.utf8	
"../../../../sv_inline.h", line 468: warning #4276-D: relational operator ">" always evaluates to 'false'
              Zero(new_body, type_details->body_size, char);
              ^

"../../../../sv_inline.h", line 468: warning #4276-D: relational operator ">" always evaluates to 'false'
              Zero(new_body, type_details->body_size, char);
              ^

"../../../../sv_inline.h", line 468: warning #4276-D: relational operator ">" always evaluates to 'false'
              Zero(new_body, type_details->body_size, char);
              ^

"../../../../sv_inline.h", line 468: warning #4276-D: relational operator ">" always evaluates to 'false'
              Zero(new_body, type_details->body_size, char);
              ^

"../../../../sv_inline.h", line 468: warning #4276-D: relational operator ">" always evaluates to 'false'
              Zero(new_body, type_details->body_size, char);
              ^

"../../../../sv_inline.h", line 468: warning #4276-D: relational operator ">" always evaluates to 'false'
              Zero(new_body, type_details->body_size, char);
              ^

"../../../../sv_inline.h", line 468: warning #4276-D: relational operator ">" always evaluates to 'false'
              Zero(new_body, type_details->body_size, char);
              ^

"XSTest.c", line 249: warning #2111-D: statement is unreachable
  	PUTBACK;
  	^

"/pro/3gl/CPAN/perl-current/sv_inline.h", line 468: warning #4276-D: relational operator ">" always evaluates to 'false'
              Zero(new_body, type_details->body_size, char);
              ^

"/pro/3gl/CPAN/perl-current/sv_inline.h", line 468: warning #4276-D: relational operator ">" always evaluates to 'false'
              Zero(new_body, type_details->body_size, char);
              ^

"XSMore.xs", line 48: warning #4276-D: relational operator ">" always evaluates to 'false'
     Newx(*c, lenc+1, char);
     ^

"XSMore.xs", line 63: warning #4276-D: relational operator ">" always evaluates to 'false'
     Newx(*c, lenc+1, char);
     ^

"/pro/3gl/CPAN/perl-current/sv_inline.h", line 468: warning #4276-D: relational operator ">" always evaluates to 'false'
              Zero(new_body, type_details->body_size, char);
              ^

c++: error: +Z: No such file or directory
c++: error: +O2: No such file or directory
c++: error: +Onolimit: No such file or directory
"../sv_inline.h", line 468: warning #4276-D: relational operator ">" always evaluates to 'false'
              Zero(new_body, type_details->body_size, char);
              ^

cc: warning 983: The -lc library specified on the command line is also added automatically by the compiler driver.  
# Failed test 1704 - sprintf( "%.54g", 0.3 ) renders correctly at op/sprintf2.t line 1197
#      got "0.299999999999999988897769753748434596"
# expected eq "0.299999999999999988897769753748434595763683319091796875"
Subroutine Time::HiRes::constant redefined at (eval 37) line 1.
Subroutine Time::HiRes::usleep redefined at (eval 37) line 1.
Subroutine Time::HiRes::nanosleep redefined at (eval 37) line 1.
Subroutine Time::HiRes::sleep redefined at (eval 37) line 1.
Subroutine Time::HiRes::ualarm redefined at (eval 37) line 1.
Subroutine Time::HiRes::alarm redefined at (eval 37) line 1.
Subroutine Time::HiRes::gettimeofday redefined at (eval 37) line 1.
Subroutine Time::HiRes::time redefined at (eval 37) line 1.
Subroutine Time::HiRes::setitimer redefined at (eval 37) line 1.
Subroutine Time::HiRes::getitimer redefined at (eval 37) line 1.
Subroutine Time::HiRes::utime redefined at (eval 37) line 1.
Subroutine Time::HiRes::clock_gettime redefined at (eval 37) line 1.
Subroutine Time::HiRes::clock_getres redefined at (eval 37) line 1.
Subroutine Time::HiRes::clock_nanosleep redefined at (eval 37) line 1.
Subroutine Time::HiRes::clock redefined at (eval 37) line 1.
Subroutine Time::HiRes::lstat redefined at (eval 37) line 1.
Subroutine Time::HiRes::stat redefined at (eval 37) line 1.
# Connected to 127.0.0.1
# Connected to 127.0.0.1
make: *** [test_harness] Error 1

error while running harness target 'test_harness': 2 at /pro/3gl/CPAN/smoke/lib/Test/Smoke/App/RunSmoke.pm line 118.
[2022-05-19 08:40:57+0200] 
[2022-05-19 08:40:57+0200] ../dist/Net-Ping/t/450_service.t............................PASSED
[2022-05-19 08:40:57+0200]     9, 18
[2022-05-19 08:40:57+0200] ../t/op/sprintf2.t..........................................FAILED
[2022-05-19 08:40:57+0200]     1704
[2022-05-19 08:40:57+0200] ../t/re/reg_mesg.t..........................................FAILED
[2022-05-19 08:40:57+0200]     No plan found in TAP output
[2022-05-19 08:40:57+0200] ../t/re/regex_sets.t........................................FAILED
[2022-05-19 08:40:57+0200]     No plan found in TAP output
[2022-05-19 08:40:57+0200] Archived results...
[2022-05-19 08:40:57+0200] Unskip tests from '/pro/3gl/CPAN/smoke/p59.skip'
[2022-05-19 08:40:57+0200] Finished smoking 06d31977c06ed237a3bb5b1bf22fc9cedd14134b v5.35.11-229-g06d3197 blead
[2022-05-19 08:40:57+0200] Reading smokeresult from /pro/3gl/CPAN/perl-current/mktest.out
[2022-05-19 08:41:06+0200] Processing []
[2022-05-19 08:41:06+0200] Processing [-DDEBUGGING]
[2022-05-19 08:41:06+0200] Processing [-Duse64bitall]
[2022-05-19 08:41:06+0200] Processing [-DDEBUGGING -Duse64bitall]
[2022-05-19 08:41:06+0200] Processing [-Duseithreads]
[2022-05-19 08:41:06+0200] Processing [-DDEBUGGING -Duseithreads]
[2022-05-19 08:41:06+0200] Processing [-Duseithreads -Duse64bitall]
[2022-05-19 08:41:06+0200] Processing [-DDEBUGGING -Duseithreads -Duse64bitall]
[2022-05-19 08:41:06+0200] ==> Starting reporter
[2022-05-19 08:41:06+0200] Writing report to '/pro/3gl/CPAN/perl-current/mktest.rpt'
[2022-05-19 08:41:06+0200] Locally applied patches from '/pro/3gl/CPAN/perl-current/patchlevel.h'
[2022-05-19 08:41:06+0200] Patches: 'uncommitted-changes'
[2022-05-19 08:41:06+0200] Looking for cc messages: 'hpux'
-- 
Report generated by Test::Smoke::Gateway v0.12