Show report
[2022-05-08 16:56:51-0400] ==> Starting synctree
[2022-05-08 16:56:51-0400] qx[/usr/local/bin/git clone file:///home/core/smoke/git /home/core/smoke/git-perl 2>&1]
[2022-05-08 17:01:37-0400] qx[/usr/local/bin/git remote update --prune 2>&1]
[2022-05-08 17:01:37-0400] qx[/usr/local/bin/git checkout blead
[2022-05-08 17:01:37-0400]  2>&1]
Already on 'blead'
[2022-05-08 17:01:38-0400] qx[/usr/local/bin/git reset --hard origin/blead
[2022-05-08 17:01:38-0400]  2>&1]
[2022-05-08 17:01:38-0400] qx[/usr/local/bin/git clone /home/core/smoke/git-perl /home/core/smoke/perl-current 2>&1]
[2022-05-08 17:01:44-0400] qx[/usr/local/bin/git clean -dfx 2>&1]
[2022-05-08 17:01:44-0400] qx[/usr/local/bin/git fetch origin 2>&1]
[2022-05-08 17:01:44-0400] qx[/usr/local/bin/git checkout blead
[2022-05-08 17:01:44-0400]  2>&1]
Already on 'blead'
[2022-05-08 17:01:44-0400] qx[/usr/local/bin/git reset --hard origin/blead
[2022-05-08 17:01:44-0400]  2>&1]
[2022-05-08 17:01:44-0400] qx[/home/core/bin/perl-5.30.2/bin/perl5.30.2 Porting/make_dot_patch.pl > .patch]
[2022-05-08 17:01:44-0400] /home/core/smoke/perl-current is now up to patchlevel 300ff263fbad8007ca52d84a8be8b98fba791a3c
[2022-05-08 17:01:44-0400] ==> Starting runsmoke
[2022-05-08 17:01:44-0400] [./tssmokeperl.pl] chdir(/home/core/smoke/perl-current)
[2022-05-08 17:01:44-0400] qx[/home/core/bin/perl-5.30.2/bin/perl5.30.2 -e "require q[/home/core/smoke/perl-current/cpan/Test-Harness/lib/Test/Harness.pm];print Test::Harness->VERSION" 2>&1]
[2022-05-08 17:01:45-0400] Found: Test::Harness version 3.44.
[2022-05-08 17:01:45-0400] Reading build configurations from /home/core/smoke/TestSmoke/perlcurrent.cfg
[2022-05-08 17:01:45-0400] Reading 'Policy.sh' from default content (v=1)
[2022-05-08 17:01:45-0400] Running smoke tests without $ENV{PERLIO}
[2022-05-08 17:01:45-0400] Running test suite only with 'harness'
[2022-05-08 17:01:45-0400] make distclean ...
[2022-05-08 17:01:45-0400] Smoking patch 300ff263fbad8007ca52d84a8be8b98fba791a3c v5.35.11-140-g300ff263fb
[2022-05-08 17:01:45-0400] Smoking branch blead
[2022-05-08 17:01:45-0400] Locally applied patches from '/home/core/smoke/perl-current/patchlevel.h'
[2022-05-08 17:01:45-0400] Patches: 'uncommitted-changes'
[2022-05-08 17:01:45-0400] Adding 'SMOKE300ff263fbad8007ca52d84a8be8b98fba791a3c' to the registered patches.
[2022-05-08 17:01:45-0400] 
[2022-05-08 17:01:45-0400] Configuration: -Dusedevel -Dcc=clang
[2022-05-08 17:01:45-0400] ------------------------------------------------------------------------------
[2022-05-08 17:01:45-0400] make distclean ...
[2022-05-08 17:01:45-0400] 
[2022-05-08 17:01:45-0400] Copy Policy.sh ...
[2022-05-08 17:01:45-0400] 
[2022-05-08 17:01:45-0400] Configure ...
[2022-05-08 17:03:12-0400] 
[2022-05-08 17:03:12-0400] make ...
Bzip2.xs:376:17: warning: variable 'flags' set but not used [-Wunused-but-set-variable]
            int flags = 0 ;
                ^
1 warning generated.
blocksort.c:765:11: warning: variable 'numQSorted' set but not used [-Wunused-but-set-variable]
   Int32  numQSorted;
          ^
1 warning generated.
compress.c:241:30: warning: variable 'totc' set but not used [-Wunused-but-set-variable]
   Int32 v, t, i, j, gs, ge, totc, bt, bc, iter;
                             ^
1 warning generated.
Warning (mostly harmless): No library found for -lndbm
Warning (mostly harmless): No library found for -ldbm
Warning (mostly harmless): No library found for -lucb
Warning (mostly harmless): No library found for -lposix
Warning (mostly harmless): No library found for -lcposix
Socket.c:1703:7: warning: variable 'interface' set but not used [-Wunused-but-set-variable]
        SV *    interface;
                ^
1 warning generated.
In file included from HiRes.xs:860:
./const-c.inc:351:42: warning: unused parameter 'iv_return' [-Wunused-parameter]
constant_19 (pTHX_ const char *name, IV *iv_return) {
                                         ^
1 warning generated.
Typemap.c:1775:6: warning: variable 'dummy' set but not used [-Wunused-but-set-variable]
        int     dummy = 0;
                ^
1 warning generated.
[2022-05-08 17:12:12-0400] Skip tests from '/home/core/smoke/TestSmoke/smokecurrent.skiptests'
[2022-05-08 17:12:12-0400] 
[2022-05-08 17:12:12-0400]  Tests start here:
[2022-05-08 17:12:12-0400] TSTENV = stdio	
'pod/perlguts.pod-new' and 'pod/perlguts.pod' differ
/home/core/smoke/perl-current/perl -I. regen/mg_vtable.pl --tap failed: 65280 at regen.pl line 20, <DATA> line 8.
    Hint:  A failure in this file can often be corrected by running:
     ./perl -Ilib regen.pl
Subroutine Time::HiRes::constant redefined at (eval 37) line 1.
Subroutine Time::HiRes::usleep redefined at (eval 37) line 1.
Subroutine Time::HiRes::nanosleep redefined at (eval 37) line 1.
Subroutine Time::HiRes::sleep redefined at (eval 37) line 1.
Subroutine Time::HiRes::ualarm redefined at (eval 37) line 1.
Subroutine Time::HiRes::alarm redefined at (eval 37) line 1.
Subroutine Time::HiRes::gettimeofday redefined at (eval 37) line 1.
Subroutine Time::HiRes::time redefined at (eval 37) line 1.
Subroutine Time::HiRes::setitimer redefined at (eval 37) line 1.
Subroutine Time::HiRes::getitimer redefined at (eval 37) line 1.
Subroutine Time::HiRes::utime redefined at (eval 37) line 1.
Subroutine Time::HiRes::clock_gettime redefined at (eval 37) line 1.
Subroutine Time::HiRes::clock_getres redefined at (eval 37) line 1.
Subroutine Time::HiRes::clock_nanosleep redefined at (eval 37) line 1.
Subroutine Time::HiRes::clock redefined at (eval 37) line 1.
Subroutine Time::HiRes::lstat redefined at (eval 37) line 1.
Subroutine Time::HiRes::stat redefined at (eval 37) line 1.
*** Error 1 in /home/core/smoke/perl-current (makefile:842 'test_harness')

error while running harness target 'test_harness': 2 at /home/core/smoke/TestSmoke/Test/Smoke/App/RunSmoke.pm line 118.
[2022-05-08 17:51:01-0400] 
[2022-05-08 17:51:01-0400] ../t/porting/regen.t........................................FAILED
[2022-05-08 17:51:01-0400]     22
[2022-05-08 17:51:01-0400] ../t/porting/regen.t........................................FAILED
[2022-05-08 17:51:01-0400]     Non-zero exit status: 255
[2022-05-08 17:51:01-0400] ../t/porting/regen.t........................................FAILED
[2022-05-08 17:51:01-0400]     Bad plan.  You planned 42 tests but ran 22.
[2022-05-08 17:51:01-0400] Archived results...
[2022-05-08 17:51:01-0400] Unskip tests from '/home/core/smoke/TestSmoke/smokecurrent.skiptests'
[2022-05-08 17:51:01-0400] 
[2022-05-08 17:51:01-0400] Configuration: -Dusedevel -Dcc=clang -DDEBUGGING
[2022-05-08 17:51:01-0400] ------------------------------------------------------------------------------
[2022-05-08 17:51:01-0400] make distclean ...
[2022-05-08 17:51:37-0400] 
[2022-05-08 17:51:37-0400] Copy Policy.sh ...
[2022-05-08 17:51:37-0400] 
[2022-05-08 17:51:37-0400] Configure ...
[2022-05-08 17:53:00-0400] 
[2022-05-08 17:53:00-0400] make ...
Bzip2.xs:376:17: warning: variable 'flags' set but not used [-Wunused-but-set-variable]
            int flags = 0 ;
                ^
1 warning generated.
blocksort.c:765:11: warning: variable 'numQSorted' set but not used [-Wunused-but-set-variable]
   Int32  numQSorted;
          ^
1 warning generated.
compress.c:241:30: warning: variable 'totc' set but not used [-Wunused-but-set-variable]
   Int32 v, t, i, j, gs, ge, totc, bt, bc, iter;
                             ^
1 warning generated.
Warning (mostly harmless): No library found for -lndbm
Warning (mostly harmless): No library found for -ldbm
Warning (mostly harmless): No library found for -lucb
Warning (mostly harmless): No library found for -lposix
Warning (mostly harmless): No library found for -lcposix
Socket.c:1703:7: warning: variable 'interface' set but not used [-Wunused-but-set-variable]
        SV *    interface;
                ^
1 warning generated.
In file included from HiRes.xs:860:
./const-c.inc:351:42: warning: unused parameter 'iv_return' [-Wunused-parameter]
constant_19 (pTHX_ const char *name, IV *iv_return) {
                                         ^
1 warning generated.
Typemap.c:1775:6: warning: variable 'dummy' set but not used [-Wunused-but-set-variable]
        int     dummy = 0;
                ^
1 warning generated.
[2022-05-08 18:04:51-0400] Skip tests from '/home/core/smoke/TestSmoke/smokecurrent.skiptests'
[2022-05-08 18:04:51-0400] 
[2022-05-08 18:04:51-0400]  Tests start here:
[2022-05-08 18:04:51-0400] TSTENV = stdio	
#   "Pod NAME already used" 
#     'pod/perlguts.pod-new' also has NAME 'perlguts' near line ??? of pod/perlguts.pod
# See end of this test output for your options on silencing this
#   "? Should you be using L<...> instead of" 
#     C<av_shift> near line 475 of pod/perlguts.pod-new
#   "Pod NAME already used" 
#     'pod/perlguts.pod' also has NAME 'perlguts' near line ??? of pod/perlguts.pod-new
# See end of this test output for your options on silencing this
# 
# HOW TO GET porting/podcheck.t TO PASS
# 
# There were 2 files that had new potential problems identified.
# Some of them may be real, and some of them may be false positives because
# this program isn't as smart as it likes to think it is.  You can teach this
# program to ignore the issues it has identified, and hence pass, by doing the
# following:
# 
# 1) If a problem is about a link to an unknown module or man page that
#    you know exists, re-run the command something like:
#       ./perl -I../lib porting/podcheck.t --add-link MODULE man_page ...
#    (MODULEs should look like Foo::Bar, and man_pages should look like
#    bar(3c); don't do this for a module or man page that you aren't sure
#    about; instead treat as another type of issue and follow the
#    instructions below.)
# 
# 2) For other issues, decide if each should be fixed now or not.  Fix the
#    ones you decided to, and rerun this test to verify that the fixes
#    worked.
# 
# 3) If there remain false positive or problems that you don't plan to fix right
#    now,
#    run this test script by hand, using the following formula (on
#    Un*x-like machines):
#         cd t
#         ./perl -I../lib porting/podcheck.t --regen
# 
#    That should cause all current potential problems to be accepted by
#    the program, so that the next time it runs, they won't be flagged.
#    For a few files, such as perltoc, certain issues will always be
#    expected, and more of the same will be added over time.  For those,
#    before you do the regen, you can edit
#    /home/core/smoke/perl-current/t/porting/known_pod_issues.dat
#    and find the entry for the module's file and specific error message,
#    and change the count of known potential problems to -1.
'pod/perlguts.pod-new' and 'pod/perlguts.pod' differ
/home/core/smoke/perl-current/perl -I. regen/mg_vtable.pl --tap failed: 65280 at regen.pl line 20, <DATA> line 8.
    Hint:  A failure in this file can often be corrected by running:
     ./perl -Ilib regen.pl
Subroutine Time::HiRes::constant redefined at (eval 37) line 1.
Subroutine Time::HiRes::usleep redefined at (eval 37) line 1.
Subroutine Time::HiRes::nanosleep redefined at (eval 37) line 1.
Subroutine Time::HiRes::sleep redefined at (eval 37) line 1.
Subroutine Time::HiRes::ualarm redefined at (eval 37) line 1.
Subroutine Time::HiRes::alarm redefined at (eval 37) line 1.
Subroutine Time::HiRes::gettimeofday redefined at (eval 37) line 1.
Subroutine Time::HiRes::time redefined at (eval 37) line 1.
Subroutine Time::HiRes::setitimer redefined at (eval 37) line 1.
Subroutine Time::HiRes::getitimer redefined at (eval 37) line 1.
Subroutine Time::HiRes::utime redefined at (eval 37) line 1.
Subroutine Time::HiRes::clock_gettime redefined at (eval 37) line 1.
Subroutine Time::HiRes::clock_getres redefined at (eval 37) line 1.
Subroutine Time::HiRes::clock_nanosleep redefined at (eval 37) line 1.
Subroutine Time::HiRes::clock redefined at (eval 37) line 1.
Subroutine Time::HiRes::lstat redefined at (eval 37) line 1.
Subroutine Time::HiRes::stat redefined at (eval 37) line 1.
*** Error 3 in /home/core/smoke/perl-current (makefile:842 'test_harness')

error while running harness target 'test_harness': 2 at /home/core/smoke/TestSmoke/Test/Smoke/App/RunSmoke.pm line 118.
[2022-05-08 18:49:15-0400] 
[2022-05-08 18:49:15-0400] ../t/porting/podcheck.t.....................................FAILED
[2022-05-08 18:49:15-0400]     193-194
[2022-05-08 18:49:15-0400] ../t/porting/regen.t........................................FAILED
[2022-05-08 18:49:15-0400]     22
[2022-05-08 18:49:15-0400] ../t/porting/regen.t........................................FAILED
[2022-05-08 18:49:15-0400]     Non-zero exit status: 255
[2022-05-08 18:49:15-0400] ../t/porting/regen.t........................................FAILED
[2022-05-08 18:49:15-0400]     Bad plan.  You planned 42 tests but ran 22.
[2022-05-08 18:49:15-0400] Archived results...
[2022-05-08 18:49:15-0400] Unskip tests from '/home/core/smoke/TestSmoke/smokecurrent.skiptests'
[2022-05-08 18:49:15-0400] 
[2022-05-08 18:49:15-0400] Configuration: -Dusedevel -Dcc=clang -Duse64bitall
[2022-05-08 18:49:15-0400] ------------------------------------------------------------------------------
[2022-05-08 18:49:15-0400] make distclean ...
[2022-05-08 18:49:56-0400] 
[2022-05-08 18:49:56-0400] Copy Policy.sh ...
[2022-05-08 18:49:56-0400] 
[2022-05-08 18:49:56-0400] Configure ...
[2022-05-08 18:51:17-0400] 
[2022-05-08 18:51:17-0400] make ...
Bzip2.xs:376:17: warning: variable 'flags' set but not used [-Wunused-but-set-variable]
            int flags = 0 ;
                ^
1 warning generated.
blocksort.c:765:11: warning: variable 'numQSorted' set but not used [-Wunused-but-set-variable]
   Int32  numQSorted;
          ^
1 warning generated.
compress.c:241:30: warning: variable 'totc' set but not used [-Wunused-but-set-variable]
   Int32 v, t, i, j, gs, ge, totc, bt, bc, iter;
                             ^
1 warning generated.
Warning (mostly harmless): No library found for -lndbm
Warning (mostly harmless): No library found for -ldbm
Warning (mostly harmless): No library found for -lucb
Warning (mostly harmless): No library found for -lposix
Warning (mostly harmless): No library found for -lcposix
Socket.c:1703:7: warning: variable 'interface' set but not used [-Wunused-but-set-variable]
        SV *    interface;
                ^
1 warning generated.
In file included from HiRes.xs:860:
./const-c.inc:351:42: warning: unused parameter 'iv_return' [-Wunused-parameter]
constant_19 (pTHX_ const char *name, IV *iv_return) {
                                         ^
1 warning generated.
Typemap.c:1775:6: warning: variable 'dummy' set but not used [-Wunused-but-set-variable]
        int     dummy = 0;
                ^
1 warning generated.
[2022-05-08 19:00:24-0400] Skip tests from '/home/core/smoke/TestSmoke/smokecurrent.skiptests'
[2022-05-08 19:00:24-0400] 
[2022-05-08 19:00:24-0400]  Tests start here:
[2022-05-08 19:00:24-0400] TSTENV = stdio	
#   "Pod NAME already used" 
#     'pod/perlguts.pod-new' also has NAME 'perlguts' near line ??? of pod/perlguts.pod
# See end of this test output for your options on silencing this
#   "? Should you be using L<...> instead of" 
#     C<av_shift> near line 475 of pod/perlguts.pod-new
#   "Pod NAME already used" 
#     'pod/perlguts.pod' also has NAME 'perlguts' near line ??? of pod/perlguts.pod-new
# See end of this test output for your options on silencing this
# 
# HOW TO GET porting/podcheck.t TO PASS
# 
# There were 2 files that had new potential problems identified.
# Some of them may be real, and some of them may be false positives because
# this program isn't as smart as it likes to think it is.  You can teach this
# program to ignore the issues it has identified, and hence pass, by doing the
# following:
# 
# 1) If a problem is about a link to an unknown module or man page that
#    you know exists, re-run the command something like:
#       ./perl -I../lib porting/podcheck.t --add-link MODULE man_page ...
#    (MODULEs should look like Foo::Bar, and man_pages should look like
#    bar(3c); don't do this for a module or man page that you aren't sure
#    about; instead treat as another type of issue and follow the
#    instructions below.)
# 
# 2) For other issues, decide if each should be fixed now or not.  Fix the
#    ones you decided to, and rerun this test to verify that the fixes
#    worked.
# 
# 3) If there remain false positive or problems that you don't plan to fix right
#    now,
#    run this test script by hand, using the following formula (on
#    Un*x-like machines):
#         cd t
#         ./perl -I../lib porting/podcheck.t --regen
# 
#    That should cause all current potential problems to be accepted by
#    the program, so that the next time it runs, they won't be flagged.
#    For a few files, such as perltoc, certain issues will always be
#    expected, and more of the same will be added over time.  For those,
#    before you do the regen, you can edit
#    /home/core/smoke/perl-current/t/porting/known_pod_issues.dat
#    and find the entry for the module's file and specific error message,
#    and change the count of known potential problems to -1.
'pod/perlguts.pod-new' and 'pod/perlguts.pod' differ
/home/core/smoke/perl-current/perl -I. regen/mg_vtable.pl --tap failed: 65280 at regen.pl line 20, <DATA> line 8.
    Hint:  A failure in this file can often be corrected by running:
     ./perl -Ilib regen.pl
Subroutine Time::HiRes::constant redefined at (eval 37) line 1.
Subroutine Time::HiRes::usleep redefined at (eval 37) line 1.
Subroutine Time::HiRes::nanosleep redefined at (eval 37) line 1.
Subroutine Time::HiRes::sleep redefined at (eval 37) line 1.
Subroutine Time::HiRes::ualarm redefined at (eval 37) line 1.
Subroutine Time::HiRes::alarm redefined at (eval 37) line 1.
Subroutine Time::HiRes::gettimeofday redefined at (eval 37) line 1.
Subroutine Time::HiRes::time redefined at (eval 37) line 1.
Subroutine Time::HiRes::setitimer redefined at (eval 37) line 1.
Subroutine Time::HiRes::getitimer redefined at (eval 37) line 1.
Subroutine Time::HiRes::utime redefined at (eval 37) line 1.
Subroutine Time::HiRes::clock_gettime redefined at (eval 37) line 1.
Subroutine Time::HiRes::clock_getres redefined at (eval 37) line 1.
Subroutine Time::HiRes::clock_nanosleep redefined at (eval 37) line 1.
Subroutine Time::HiRes::clock redefined at (eval 37) line 1.
Subroutine Time::HiRes::lstat redefined at (eval 37) line 1.
Subroutine Time::HiRes::stat redefined at (eval 37) line 1.
*** Error 3 in /home/core/smoke/perl-current (makefile:842 'test_harness')

error while running harness target 'test_harness': 2 at /home/core/smoke/TestSmoke/Test/Smoke/App/RunSmoke.pm line 118.
[2022-05-08 19:39:07-0400] 
[2022-05-08 19:39:07-0400] ../t/porting/podcheck.t.....................................FAILED
[2022-05-08 19:39:07-0400]     193-194
[2022-05-08 19:39:07-0400] ../t/porting/regen.t........................................FAILED
[2022-05-08 19:39:07-0400]     22
[2022-05-08 19:39:07-0400] ../t/porting/regen.t........................................FAILED
[2022-05-08 19:39:07-0400]     Non-zero exit status: 255
[2022-05-08 19:39:07-0400] ../t/porting/regen.t........................................FAILED
[2022-05-08 19:39:07-0400]     Bad plan.  You planned 42 tests but ran 22.
[2022-05-08 19:39:07-0400] Archived results...
[2022-05-08 19:39:07-0400] Unskip tests from '/home/core/smoke/TestSmoke/smokecurrent.skiptests'
[2022-05-08 19:39:07-0400] 
[2022-05-08 19:39:07-0400] Configuration: -Dusedevel -Dcc=clang -Duse64bitall -DDEBUGGING
[2022-05-08 19:39:07-0400] ------------------------------------------------------------------------------
[2022-05-08 19:39:07-0400] make distclean ...
[2022-05-08 19:39:44-0400] 
[2022-05-08 19:39:44-0400] Copy Policy.sh ...
[2022-05-08 19:39:44-0400] 
[2022-05-08 19:39:44-0400] Configure ...
[2022-05-08 19:41:07-0400] 
[2022-05-08 19:41:07-0400] make ...
Bzip2.xs:376:17: warning: variable 'flags' set but not used [-Wunused-but-set-variable]
            int flags = 0 ;
                ^
1 warning generated.
blocksort.c:765:11: warning: variable 'numQSorted' set but not used [-Wunused-but-set-variable]
   Int32  numQSorted;
          ^
1 warning generated.
compress.c:241:30: warning: variable 'totc' set but not used [-Wunused-but-set-variable]
   Int32 v, t, i, j, gs, ge, totc, bt, bc, iter;
                             ^
1 warning generated.
Warning (mostly harmless): No library found for -lndbm
Warning (mostly harmless): No library found for -ldbm
Warning (mostly harmless): No library found for -lucb
Warning (mostly harmless): No library found for -lposix
Warning (mostly harmless): No library found for -lcposix
Socket.c:1703:7: warning: variable 'interface' set but not used [-Wunused-but-set-variable]
        SV *    interface;
                ^
1 warning generated.
In file included from HiRes.xs:860:
./const-c.inc:351:42: warning: unused parameter 'iv_return' [-Wunused-parameter]
constant_19 (pTHX_ const char *name, IV *iv_return) {
                                         ^
1 warning generated.
Typemap.c:1775:6: warning: variable 'dummy' set but not used [-Wunused-but-set-variable]
        int     dummy = 0;
                ^
1 warning generated.
[2022-05-08 19:52:54-0400] Skip tests from '/home/core/smoke/TestSmoke/smokecurrent.skiptests'
[2022-05-08 19:52:54-0400] 
[2022-05-08 19:52:54-0400]  Tests start here:
[2022-05-08 19:52:54-0400] TSTENV = stdio	
#   "Pod NAME already used" 
#     'pod/perlguts.pod-new' also has NAME 'perlguts' near line ??? of pod/perlguts.pod
# See end of this test output for your options on silencing this
#   "? Should you be using L<...> instead of" 
#     C<av_shift> near line 475 of pod/perlguts.pod-new
#   "Pod NAME already used" 
#     'pod/perlguts.pod' also has NAME 'perlguts' near line ??? of pod/perlguts.pod-new
# See end of this test output for your options on silencing this
# 
# HOW TO GET porting/podcheck.t TO PASS
# 
# There were 2 files that had new potential problems identified.
# Some of them may be real, and some of them may be false positives because
# this program isn't as smart as it likes to think it is.  You can teach this
# program to ignore the issues it has identified, and hence pass, by doing the
# following:
# 
# 1) If a problem is about a link to an unknown module or man page that
#    you know exists, re-run the command something like:
#       ./perl -I../lib porting/podcheck.t --add-link MODULE man_page ...
#    (MODULEs should look like Foo::Bar, and man_pages should look like
#    bar(3c); don't do this for a module or man page that you aren't sure
#    about; instead treat as another type of issue and follow the
#    instructions below.)
# 
# 2) For other issues, decide if each should be fixed now or not.  Fix the
#    ones you decided to, and rerun this test to verify that the fixes
#    worked.
# 
# 3) If there remain false positive or problems that you don't plan to fix right
#    now,
#    run this test script by hand, using the following formula (on
#    Un*x-like machines):
#         cd t
#         ./perl -I../lib porting/podcheck.t --regen
# 
#    That should cause all current potential problems to be accepted by
#    the program, so that the next time it runs, they won't be flagged.
#    For a few files, such as perltoc, certain issues will always be
#    expected, and more of the same will be added over time.  For those,
#    before you do the regen, you can edit
#    /home/core/smoke/perl-current/t/porting/known_pod_issues.dat
#    and find the entry for the module's file and specific error message,
#    and change the count of known potential problems to -1.
'pod/perlguts.pod-new' and 'pod/perlguts.pod' differ
/home/core/smoke/perl-current/perl -I. regen/mg_vtable.pl --tap failed: 65280 at regen.pl line 20, <DATA> line 8.
    Hint:  A failure in this file can often be corrected by running:
     ./perl -Ilib regen.pl
Subroutine Time::HiRes::constant redefined at (eval 37) line 1.
Subroutine Time::HiRes::usleep redefined at (eval 37) line 1.
Subroutine Time::HiRes::nanosleep redefined at (eval 37) line 1.
Subroutine Time::HiRes::sleep redefined at (eval 37) line 1.
Subroutine Time::HiRes::ualarm redefined at (eval 37) line 1.
Subroutine Time::HiRes::alarm redefined at (eval 37) line 1.
Subroutine Time::HiRes::gettimeofday redefined at (eval 37) line 1.
Subroutine Time::HiRes::time redefined at (eval 37) line 1.
Subroutine Time::HiRes::setitimer redefined at (eval 37) line 1.
Subroutine Time::HiRes::getitimer redefined at (eval 37) line 1.
Subroutine Time::HiRes::utime redefined at (eval 37) line 1.
Subroutine Time::HiRes::clock_gettime redefined at (eval 37) line 1.
Subroutine Time::HiRes::clock_getres redefined at (eval 37) line 1.
Subroutine Time::HiRes::clock_nanosleep redefined at (eval 37) line 1.
Subroutine Time::HiRes::clock redefined at (eval 37) line 1.
Subroutine Time::HiRes::lstat redefined at (eval 37) line 1.
Subroutine Time::HiRes::stat redefined at (eval 37) line 1.
*** Error 3 in /home/core/smoke/perl-current (makefile:842 'test_harness')

error while running harness target 'test_harness': 2 at /home/core/smoke/TestSmoke/Test/Smoke/App/RunSmoke.pm line 118.
[2022-05-08 20:37:04-0400] 
[2022-05-08 20:37:04-0400] ../t/porting/podcheck.t.....................................FAILED
[2022-05-08 20:37:04-0400]     193-194
[2022-05-08 20:37:04-0400] ../t/porting/regen.t........................................FAILED
[2022-05-08 20:37:04-0400]     22
[2022-05-08 20:37:04-0400] ../t/porting/regen.t........................................FAILED
[2022-05-08 20:37:04-0400]     Non-zero exit status: 255
[2022-05-08 20:37:04-0400] ../t/porting/regen.t........................................FAILED
[2022-05-08 20:37:04-0400]     Bad plan.  You planned 42 tests but ran 22.
[2022-05-08 20:37:04-0400] Archived results...
[2022-05-08 20:37:04-0400] Unskip tests from '/home/core/smoke/TestSmoke/smokecurrent.skiptests'
[2022-05-08 20:37:04-0400] 
[2022-05-08 20:37:04-0400] Configuration: -Dusedevel -Dcc=clang -Duselongdouble
[2022-05-08 20:37:04-0400] ------------------------------------------------------------------------------
[2022-05-08 20:37:04-0400] make distclean ...
[2022-05-08 20:37:42-0400] 
[2022-05-08 20:37:42-0400] Copy Policy.sh ...
[2022-05-08 20:37:42-0400] 
[2022-05-08 20:37:42-0400] Configure ...
[2022-05-08 20:39:04-0400] 
[2022-05-08 20:39:04-0400] make ...
Bzip2.xs:376:17: warning: variable 'flags' set but not used [-Wunused-but-set-variable]
            int flags = 0 ;
                ^
1 warning generated.
blocksort.c:765:11: warning: variable 'numQSorted' set but not used [-Wunused-but-set-variable]
   Int32  numQSorted;
          ^
1 warning generated.
compress.c:241:30: warning: variable 'totc' set but not used [-Wunused-but-set-variable]
   Int32 v, t, i, j, gs, ge, totc, bt, bc, iter;
                             ^
1 warning generated.
Warning (mostly harmless): No library found for -lndbm
Warning (mostly harmless): No library found for -ldbm
Warning (mostly harmless): No library found for -lucb
Warning (mostly harmless): No library found for -lposix
Warning (mostly harmless): No library found for -lcposix
Socket.c:1703:7: warning: variable 'interface' set but not used [-Wunused-but-set-variable]
        SV *    interface;
                ^
1 warning generated.
In file included from HiRes.xs:860:
./const-c.inc:351:42: warning: unused parameter 'iv_return' [-Wunused-parameter]
constant_19 (pTHX_ const char *name, IV *iv_return) {
                                         ^
1 warning generated.
Typemap.c:1775:6: warning: variable 'dummy' set but not used [-Wunused-but-set-variable]
        int     dummy = 0;
                ^
1 warning generated.
[2022-05-08 20:48:07-0400] Skip tests from '/home/core/smoke/TestSmoke/smokecurrent.skiptests'
[2022-05-08 20:48:07-0400] 
[2022-05-08 20:48:07-0400]  Tests start here:
[2022-05-08 20:48:07-0400] TSTENV = stdio	
#   "Pod NAME already used" 
#     'pod/perlguts.pod-new' also has NAME 'perlguts' near line ??? of pod/perlguts.pod
# See end of this test output for your options on silencing this
#   "? Should you be using L<...> instead of" 
#     C<av_shift> near line 475 of pod/perlguts.pod-new
#   "Pod NAME already used" 
#     'pod/perlguts.pod' also has NAME 'perlguts' near line ??? of pod/perlguts.pod-new
# See end of this test output for your options on silencing this
# 
# HOW TO GET porting/podcheck.t TO PASS
# 
# There were 2 files that had new potential problems identified.
# Some of them may be real, and some of them may be false positives because
# this program isn't as smart as it likes to think it is.  You can teach this
# program to ignore the issues it has identified, and hence pass, by doing the
# following:
# 
# 1) If a problem is about a link to an unknown module or man page that
#    you know exists, re-run the command something like:
#       ./perl -I../lib porting/podcheck.t --add-link MODULE man_page ...
#    (MODULEs should look like Foo::Bar, and man_pages should look like
#    bar(3c); don't do this for a module or man page that you aren't sure
#    about; instead treat as another type of issue and follow the
#    instructions below.)
# 
# 2) For other issues, decide if each should be fixed now or not.  Fix the
#    ones you decided to, and rerun this test to verify that the fixes
#    worked.
# 
# 3) If there remain false positive or problems that you don't plan to fix right
#    now,
#    run this test script by hand, using the following formula (on
#    Un*x-like machines):
#         cd t
#         ./perl -I../lib porting/podcheck.t --regen
# 
#    That should cause all current potential problems to be accepted by
#    the program, so that the next time it runs, they won't be flagged.
#    For a few files, such as perltoc, certain issues will always be
#    expected, and more of the same will be added over time.  For those,
#    before you do the regen, you can edit
#    /home/core/smoke/perl-current/t/porting/known_pod_issues.dat
#    and find the entry for the module's file and specific error message,
#    and change the count of known potential problems to -1.
'pod/perlguts.pod-new' and 'pod/perlguts.pod' differ
/home/core/smoke/perl-current/perl -I. regen/mg_vtable.pl --tap failed: 65280 at regen.pl line 20, <DATA> line 8.
    Hint:  A failure in this file can often be corrected by running:
     ./perl -Ilib regen.pl
Subroutine Time::HiRes::constant redefined at (eval 37) line 1.
Subroutine Time::HiRes::usleep redefined at (eval 37) line 1.
Subroutine Time::HiRes::nanosleep redefined at (eval 37) line 1.
Subroutine Time::HiRes::sleep redefined at (eval 37) line 1.
Subroutine Time::HiRes::ualarm redefined at (eval 37) line 1.
Subroutine Time::HiRes::alarm redefined at (eval 37) line 1.
Subroutine Time::HiRes::gettimeofday redefined at (eval 37) line 1.
Subroutine Time::HiRes::time redefined at (eval 37) line 1.
Subroutine Time::HiRes::setitimer redefined at (eval 37) line 1.
Subroutine Time::HiRes::getitimer redefined at (eval 37) line 1.
Subroutine Time::HiRes::utime redefined at (eval 37) line 1.
Subroutine Time::HiRes::clock_gettime redefined at (eval 37) line 1.
Subroutine Time::HiRes::clock_getres redefined at (eval 37) line 1.
Subroutine Time::HiRes::clock_nanosleep redefined at (eval 37) line 1.
Subroutine Time::HiRes::clock redefined at (eval 37) line 1.
Subroutine Time::HiRes::lstat redefined at (eval 37) line 1.
Subroutine Time::HiRes::stat redefined at (eval 37) line 1.
*** Error 3 in /home/core/smoke/perl-current (makefile:842 'test_harness')

error while running harness target 'test_harness': 2 at /home/core/smoke/TestSmoke/Test/Smoke/App/RunSmoke.pm line 118.
[2022-05-08 21:26:45-0400] 
[2022-05-08 21:26:45-0400] ../t/porting/podcheck.t.....................................FAILED
[2022-05-08 21:26:45-0400]     193-194
[2022-05-08 21:26:45-0400] ../t/porting/regen.t........................................FAILED
[2022-05-08 21:26:45-0400]     22
[2022-05-08 21:26:45-0400] ../t/porting/regen.t........................................FAILED
[2022-05-08 21:26:45-0400]     Non-zero exit status: 255
[2022-05-08 21:26:45-0400] ../t/porting/regen.t........................................FAILED
[2022-05-08 21:26:45-0400]     Bad plan.  You planned 42 tests but ran 22.
[2022-05-08 21:26:45-0400] Archived results...
[2022-05-08 21:26:45-0400] Unskip tests from '/home/core/smoke/TestSmoke/smokecurrent.skiptests'
[2022-05-08 21:26:45-0400] 
[2022-05-08 21:26:45-0400] Configuration: -Dusedevel -Dcc=clang -Duselongdouble -DDEBUGGING
[2022-05-08 21:26:45-0400] ------------------------------------------------------------------------------
[2022-05-08 21:26:45-0400] make distclean ...
[2022-05-08 21:27:20-0400] 
[2022-05-08 21:27:20-0400] Copy Policy.sh ...
[2022-05-08 21:27:20-0400] 
[2022-05-08 21:27:20-0400] Configure ...
[2022-05-08 21:28:42-0400] 
[2022-05-08 21:28:42-0400] make ...
Bzip2.xs:376:17: warning: variable 'flags' set but not used [-Wunused-but-set-variable]
            int flags = 0 ;
                ^
1 warning generated.
blocksort.c:765:11: warning: variable 'numQSorted' set but not used [-Wunused-but-set-variable]
   Int32  numQSorted;
          ^
1 warning generated.
compress.c:241:30: warning: variable 'totc' set but not used [-Wunused-but-set-variable]
   Int32 v, t, i, j, gs, ge, totc, bt, bc, iter;
                             ^
1 warning generated.
Warning (mostly harmless): No library found for -lndbm
Warning (mostly harmless): No library found for -ldbm
Warning (mostly harmless): No library found for -lucb
Warning (mostly harmless): No library found for -lposix
Warning (mostly harmless): No library found for -lcposix
Socket.c:1703:7: warning: variable 'interface' set but not used [-Wunused-but-set-variable]
        SV *    interface;
                ^
1 warning generated.
In file included from HiRes.xs:860:
./const-c.inc:351:42: warning: unused parameter 'iv_return' [-Wunused-parameter]
constant_19 (pTHX_ const char *name, IV *iv_return) {
                                         ^
1 warning generated.
Typemap.c:1775:6: warning: variable 'dummy' set but not used [-Wunused-but-set-variable]
        int     dummy = 0;
                ^
1 warning generated.
[2022-05-08 21:40:25-0400] Skip tests from '/home/core/smoke/TestSmoke/smokecurrent.skiptests'
[2022-05-08 21:40:25-0400] 
[2022-05-08 21:40:25-0400]  Tests start here:
[2022-05-08 21:40:25-0400] TSTENV = stdio	
#   "Pod NAME already used" 
#     'pod/perlguts.pod-new' also has NAME 'perlguts' near line ??? of pod/perlguts.pod
# See end of this test output for your options on silencing this
#   "? Should you be using L<...> instead of" 
#     C<av_shift> near line 475 of pod/perlguts.pod-new
#   "Pod NAME already used" 
#     'pod/perlguts.pod' also has NAME 'perlguts' near line ??? of pod/perlguts.pod-new
# See end of this test output for your options on silencing this
# 
# HOW TO GET porting/podcheck.t TO PASS
# 
# There were 2 files that had new potential problems identified.
# Some of them may be real, and some of them may be false positives because
# this program isn't as smart as it likes to think it is.  You can teach this
# program to ignore the issues it has identified, and hence pass, by doing the
# following:
# 
# 1) If a problem is about a link to an unknown module or man page that
#    you know exists, re-run the command something like:
#       ./perl -I../lib porting/podcheck.t --add-link MODULE man_page ...
#    (MODULEs should look like Foo::Bar, and man_pages should look like
#    bar(3c); don't do this for a module or man page that you aren't sure
#    about; instead treat as another type of issue and follow the
#    instructions below.)
# 
# 2) For other issues, decide if each should be fixed now or not.  Fix the
#    ones you decided to, and rerun this test to verify that the fixes
#    worked.
# 
# 3) If there remain false positive or problems that you don't plan to fix right
#    now,
#    run this test script by hand, using the following formula (on
#    Un*x-like machines):
#         cd t
#         ./perl -I../lib porting/podcheck.t --regen
# 
#    That should cause all current potential problems to be accepted by
#    the program, so that the next time it runs, they won't be flagged.
#    For a few files, such as perltoc, certain issues will always be
#    expected, and more of the same will be added over time.  For those,
#    before you do the regen, you can edit
#    /home/core/smoke/perl-current/t/porting/known_pod_issues.dat
#    and find the entry for the module's file and specific error message,
#    and change the count of known potential problems to -1.
'pod/perlguts.pod-new' and 'pod/perlguts.pod' differ
/home/core/smoke/perl-current/perl -I. regen/mg_vtable.pl --tap failed: 65280 at regen.pl line 20, <DATA> line 8.
    Hint:  A failure in this file can often be corrected by running:
     ./perl -Ilib regen.pl
Subroutine Time::HiRes::constant redefined at (eval 37) line 1.
Subroutine Time::HiRes::usleep redefined at (eval 37) line 1.
Subroutine Time::HiRes::nanosleep redefined at (eval 37) line 1.
Subroutine Time::HiRes::sleep redefined at (eval 37) line 1.
Subroutine Time::HiRes::ualarm redefined at (eval 37) line 1.
Subroutine Time::HiRes::alarm redefined at (eval 37) line 1.
Subroutine Time::HiRes::gettimeofday redefined at (eval 37) line 1.
Subroutine Time::HiRes::time redefined at (eval 37) line 1.
Subroutine Time::HiRes::setitimer redefined at (eval 37) line 1.
Subroutine Time::HiRes::getitimer redefined at (eval 37) line 1.
Subroutine Time::HiRes::utime redefined at (eval 37) line 1.
Subroutine Time::HiRes::clock_gettime redefined at (eval 37) line 1.
Subroutine Time::HiRes::clock_getres redefined at (eval 37) line 1.
Subroutine Time::HiRes::clock_nanosleep redefined at (eval 37) line 1.
Subroutine Time::HiRes::clock redefined at (eval 37) line 1.
Subroutine Time::HiRes::lstat redefined at (eval 37) line 1.
Subroutine Time::HiRes::stat redefined at (eval 37) line 1.
*** Error 3 in /home/core/smoke/perl-current (makefile:842 'test_harness')

error while running harness target 'test_harness': 2 at /home/core/smoke/TestSmoke/Test/Smoke/App/RunSmoke.pm line 118.
[2022-05-08 22:25:00-0400] 
[2022-05-08 22:25:00-0400] ../t/porting/podcheck.t.....................................FAILED
[2022-05-08 22:25:00-0400]     193-194
[2022-05-08 22:25:00-0400] ../t/porting/regen.t........................................FAILED
[2022-05-08 22:25:00-0400]     22
[2022-05-08 22:25:00-0400] ../t/porting/regen.t........................................FAILED
[2022-05-08 22:25:00-0400]     Non-zero exit status: 255
[2022-05-08 22:25:00-0400] ../t/porting/regen.t........................................FAILED
[2022-05-08 22:25:00-0400]     Bad plan.  You planned 42 tests but ran 22.
[2022-05-08 22:25:00-0400] Archived results...
[2022-05-08 22:25:00-0400] Unskip tests from '/home/core/smoke/TestSmoke/smokecurrent.skiptests'
[2022-05-08 22:25:00-0400] 
[2022-05-08 22:25:00-0400] Configuration: -Dusedevel -Dcc=clang -Duseithreads
[2022-05-08 22:25:00-0400] ------------------------------------------------------------------------------
[2022-05-08 22:25:00-0400] make distclean ...
[2022-05-08 22:25:39-0400] 
[2022-05-08 22:25:39-0400] Copy Policy.sh ...
[2022-05-08 22:25:39-0400] 
[2022-05-08 22:25:39-0400] Configure ...
[2022-05-08 22:27:08-0400] 
[2022-05-08 22:27:08-0400] make ...
Bzip2.xs:376:17: warning: variable 'flags' set but not used [-Wunused-but-set-variable]
            int flags = 0 ;
                ^
1 warning generated.
blocksort.c:765:11: warning: variable 'numQSorted' set but not used [-Wunused-but-set-variable]
   Int32  numQSorted;
          ^
1 warning generated.
compress.c:241:30: warning: variable 'totc' set but not used [-Wunused-but-set-variable]
   Int32 v, t, i, j, gs, ge, totc, bt, bc, iter;
                             ^
1 warning generated.
Warning (mostly harmless): No library found for -lndbm
Warning (mostly harmless): No library found for -ldbm
Warning (mostly harmless): No library found for -lucb
Warning (mostly harmless): No library found for -lposix
Warning (mostly harmless): No library found for -lcposix
Socket.c:1703:7: warning: variable 'interface' set but not used [-Wunused-but-set-variable]
        SV *    interface;
                ^
1 warning generated.
In file included from HiRes.xs:860:
./const-c.inc:351:42: warning: unused parameter 'iv_return' [-Wunused-parameter]
constant_19 (pTHX_ const char *name, IV *iv_return) {
                                         ^
1 warning generated.
Typemap.c:1775:6: warning: variable 'dummy' set but not used [-Wunused-but-set-variable]
        int     dummy = 0;
                ^
1 warning generated.
[2022-05-08 22:36:25-0400] Skip tests from '/home/core/smoke/TestSmoke/smokecurrent.skiptests'
[2022-05-08 22:36:25-0400] 
[2022-05-08 22:36:25-0400]  Tests start here:
[2022-05-08 22:36:25-0400] TSTENV = stdio	
#   "Pod NAME already used" 
#     'pod/perlguts.pod-new' also has NAME 'perlguts' near line ??? of pod/perlguts.pod
# See end of this test output for your options on silencing this
#   "? Should you be using L<...> instead of" 
#     C<av_shift> near line 475 of pod/perlguts.pod-new
#   "Pod NAME already used" 
#     'pod/perlguts.pod' also has NAME 'perlguts' near line ??? of pod/perlguts.pod-new
# See end of this test output for your options on silencing this
# 
# HOW TO GET porting/podcheck.t TO PASS
# 
# There were 2 files that had new potential problems identified.
# Some of them may be real, and some of them may be false positives because
# this program isn't as smart as it likes to think it is.  You can teach this
# program to ignore the issues it has identified, and hence pass, by doing the
# following:
# 
# 1) If a problem is about a link to an unknown module or man page that
#    you know exists, re-run the command something like:
#       ./perl -I../lib porting/podcheck.t --add-link MODULE man_page ...
#    (MODULEs should look like Foo::Bar, and man_pages should look like
#    bar(3c); don't do this for a module or man page that you aren't sure
#    about; instead treat as another type of issue and follow the
#    instructions below.)
# 
# 2) For other issues, decide if each should be fixed now or not.  Fix the
#    ones you decided to, and rerun this test to verify that the fixes
#    worked.
# 
# 3) If there remain false positive or problems that you don't plan to fix right
#    now,
#    run this test script by hand, using the following formula (on
#    Un*x-like machines):
#         cd t
#         ./perl -I../lib porting/podcheck.t --regen
# 
#    That should cause all current potential problems to be accepted by
#    the program, so that the next time it runs, they won't be flagged.
#    For a few files, such as perltoc, certain issues will always be
#    expected, and more of the same will be added over time.  For those,
#    before you do the regen, you can edit
#    /home/core/smoke/perl-current/t/porting/known_pod_issues.dat
#    and find the entry for the module's file and specific error message,
#    and change the count of known potential problems to -1.
'pod/perlguts.pod-new' and 'pod/perlguts.pod' differ
/home/core/smoke/perl-current/perl -I. regen/mg_vtable.pl --tap failed: 65280 at regen.pl line 20, <DATA> line 8.
    Hint:  A failure in this file can often be corrected by running:
     ./perl -Ilib regen.pl
Subroutine Time::HiRes::constant redefined at (eval 37) line 1.
Subroutine Time::HiRes::usleep redefined at (eval 37) line 1.
Subroutine Time::HiRes::nanosleep redefined at (eval 37) line 1.
Subroutine Time::HiRes::sleep redefined at (eval 37) line 1.
Subroutine Time::HiRes::ualarm redefined at (eval 37) line 1.
Subroutine Time::HiRes::alarm redefined at (eval 37) line 1.
Subroutine Time::HiRes::gettimeofday redefined at (eval 37) line 1.
Subroutine Time::HiRes::time redefined at (eval 37) line 1.
Subroutine Time::HiRes::setitimer redefined at (eval 37) line 1.
Subroutine Time::HiRes::getitimer redefined at (eval 37) line 1.
Subroutine Time::HiRes::utime redefined at (eval 37) line 1.
Subroutine Time::HiRes::clock_gettime redefined at (eval 37) line 1.
Subroutine Time::HiRes::clock_getres redefined at (eval 37) line 1.
Subroutine Time::HiRes::clock_nanosleep redefined at (eval 37) line 1.
Subroutine Time::HiRes::clock redefined at (eval 37) line 1.
Subroutine Time::HiRes::lstat redefined at (eval 37) line 1.
Subroutine Time::HiRes::stat redefined at (eval 37) line 1.
*** Error 3 in /home/core/smoke/perl-current (makefile:842 'test_harness')

error while running harness target 'test_harness': 2 at /home/core/smoke/TestSmoke/Test/Smoke/App/RunSmoke.pm line 118.
[2022-05-08 23:21:26-0400] 
[2022-05-08 23:21:26-0400] ../t/porting/podcheck.t.....................................FAILED
[2022-05-08 23:21:26-0400]     193-194
[2022-05-08 23:21:26-0400] ../t/porting/regen.t........................................FAILED
[2022-05-08 23:21:26-0400]     22
[2022-05-08 23:21:26-0400] ../t/porting/regen.t........................................FAILED
[2022-05-08 23:21:26-0400]     Non-zero exit status: 255
[2022-05-08 23:21:26-0400] ../t/porting/regen.t........................................FAILED
[2022-05-08 23:21:26-0400]     Bad plan.  You planned 42 tests but ran 22.
[2022-05-08 23:21:26-0400] Archived results...
[2022-05-08 23:21:26-0400] Unskip tests from '/home/core/smoke/TestSmoke/smokecurrent.skiptests'
[2022-05-08 23:21:26-0400] 
[2022-05-08 23:21:26-0400] Configuration: -Dusedevel -Dcc=clang -Duseithreads -DDEBUGGING
[2022-05-08 23:21:26-0400] ------------------------------------------------------------------------------
[2022-05-08 23:21:26-0400] make distclean ...
[2022-05-08 23:22:04-0400] 
[2022-05-08 23:22:04-0400] Copy Policy.sh ...
[2022-05-08 23:22:04-0400] 
[2022-05-08 23:22:04-0400] Configure ...
[2022-05-08 23:23:35-0400] 
[2022-05-08 23:23:35-0400] make ...
Bzip2.xs:376:17: warning: variable 'flags' set but not used [-Wunused-but-set-variable]
            int flags = 0 ;
                ^
1 warning generated.
blocksort.c:765:11: warning: variable 'numQSorted' set but not used [-Wunused-but-set-variable]
   Int32  numQSorted;
          ^
1 warning generated.
compress.c:241:30: warning: variable 'totc' set but not used [-Wunused-but-set-variable]
   Int32 v, t, i, j, gs, ge, totc, bt, bc, iter;
                             ^
1 warning generated.
Warning (mostly harmless): No library found for -lndbm
Warning (mostly harmless): No library found for -ldbm
Warning (mostly harmless): No library found for -lucb
Warning (mostly harmless): No library found for -lposix
Warning (mostly harmless): No library found for -lcposix
Socket.c:1703:7: warning: variable 'interface' set but not used [-Wunused-but-set-variable]
        SV *    interface;
                ^
1 warning generated.
In file included from HiRes.xs:860:
./const-c.inc:351:42: warning: unused parameter 'iv_return' [-Wunused-parameter]
constant_19 (pTHX_ const char *name, IV *iv_return) {
                                         ^
1 warning generated.
Typemap.c:1775:6: warning: variable 'dummy' set but not used [-Wunused-but-set-variable]
        int     dummy = 0;
                ^
1 warning generated.
[2022-05-08 23:36:27-0400] Skip tests from '/home/core/smoke/TestSmoke/smokecurrent.skiptests'
[2022-05-08 23:36:27-0400] 
[2022-05-08 23:36:27-0400]  Tests start here:
[2022-05-08 23:36:27-0400] TSTENV = stdio	
#   "Pod NAME already used" 
#     'pod/perlguts.pod-new' also has NAME 'perlguts' near line ??? of pod/perlguts.pod
# See end of this test output for your options on silencing this
#   "? Should you be using L<...> instead of" 
#     C<av_shift> near line 475 of pod/perlguts.pod-new
#   "Pod NAME already used" 
#     'pod/perlguts.pod' also has NAME 'perlguts' near line ??? of pod/perlguts.pod-new
# See end of this test output for your options on silencing this
# 
# HOW TO GET porting/podcheck.t TO PASS
# 
# There were 2 files that had new potential problems identified.
# Some of them may be real, and some of them may be false positives because
# this program isn't as smart as it likes to think it is.  You can teach this
# program to ignore the issues it has identified, and hence pass, by doing the
# following:
# 
# 1) If a problem is about a link to an unknown module or man page that
#    you know exists, re-run the command something like:
#       ./perl -I../lib porting/podcheck.t --add-link MODULE man_page ...
#    (MODULEs should look like Foo::Bar, and man_pages should look like
#    bar(3c); don't do this for a module or man page that you aren't sure
#    about; instead treat as another type of issue and follow the
#    instructions below.)
# 
# 2) For other issues, decide if each should be fixed now or not.  Fix the
#    ones you decided to, and rerun this test to verify that the fixes
#    worked.
# 
# 3) If there remain false positive or problems that you don't plan to fix right
#    now,
#    run this test script by hand, using the following formula (on
#    Un*x-like machines):
#         cd t
#         ./perl -I../lib porting/podcheck.t --regen
# 
#    That should cause all current potential problems to be accepted by
#    the program, so that the next time it runs, they won't be flagged.
#    For a few files, such as perltoc, certain issues will always be
#    expected, and more of the same will be added over time.  For those,
#    before you do the regen, you can edit
#    /home/core/smoke/perl-current/t/porting/known_pod_issues.dat
#    and find the entry for the module's file and specific error message,
#    and change the count of known potential problems to -1.
'pod/perlguts.pod-new' and 'pod/perlguts.pod' differ
/home/core/smoke/perl-current/perl -I. regen/mg_vtable.pl --tap failed: 65280 at regen.pl line 20, <DATA> line 8.
    Hint:  A failure in this file can often be corrected by running:
     ./perl -Ilib regen.pl
Subroutine Time::HiRes::constant redefined at (eval 37) line 1.
Subroutine Time::HiRes::usleep redefined at (eval 37) line 1.
Subroutine Time::HiRes::nanosleep redefined at (eval 37) line 1.
Subroutine Time::HiRes::sleep redefined at (eval 37) line 1.
Subroutine Time::HiRes::ualarm redefined at (eval 37) line 1.
Subroutine Time::HiRes::alarm redefined at (eval 37) line 1.
Subroutine Time::HiRes::gettimeofday redefined at (eval 37) line 1.
Subroutine Time::HiRes::time redefined at (eval 37) line 1.
Subroutine Time::HiRes::setitimer redefined at (eval 37) line 1.
Subroutine Time::HiRes::getitimer redefined at (eval 37) line 1.
Subroutine Time::HiRes::utime redefined at (eval 37) line 1.
Subroutine Time::HiRes::clock_gettime redefined at (eval 37) line 1.
Subroutine Time::HiRes::clock_getres redefined at (eval 37) line 1.
Subroutine Time::HiRes::clock_nanosleep redefined at (eval 37) line 1.
Subroutine Time::HiRes::clock redefined at (eval 37) line 1.
Subroutine Time::HiRes::lstat redefined at (eval 37) line 1.
Subroutine Time::HiRes::stat redefined at (eval 37) line 1.
*** Error 3 in /home/core/smoke/perl-current (makefile:842 'test_harness')

error while running harness target 'test_harness': 2 at /home/core/smoke/TestSmoke/Test/Smoke/App/RunSmoke.pm line 118.
[2022-05-09 00:32:36-0400] 
[2022-05-09 00:32:36-0400] ../t/porting/podcheck.t.....................................FAILED
[2022-05-09 00:32:36-0400]     193-194
[2022-05-09 00:32:36-0400] ../t/porting/regen.t........................................FAILED
[2022-05-09 00:32:36-0400]     22
[2022-05-09 00:32:36-0400] ../t/porting/regen.t........................................FAILED
[2022-05-09 00:32:36-0400]     Non-zero exit status: 255
[2022-05-09 00:32:36-0400] ../t/porting/regen.t........................................FAILED
[2022-05-09 00:32:36-0400]     Bad plan.  You planned 42 tests but ran 22.
[2022-05-09 00:32:36-0400] Archived results...
[2022-05-09 00:32:36-0400] Unskip tests from '/home/core/smoke/TestSmoke/smokecurrent.skiptests'
[2022-05-09 00:32:36-0400] 
[2022-05-09 00:32:36-0400] Configuration: -Dusedevel -Dcc=clang -Duseithreads -Duse64bitall
[2022-05-09 00:32:36-0400] ------------------------------------------------------------------------------
[2022-05-09 00:32:36-0400] make distclean ...
[2022-05-09 00:33:22-0400] 
[2022-05-09 00:33:22-0400] Copy Policy.sh ...
[2022-05-09 00:33:22-0400] 
[2022-05-09 00:33:22-0400] Configure ...
[2022-05-09 00:34:51-0400] 
[2022-05-09 00:34:51-0400] make ...
Bzip2.xs:376:17: warning: variable 'flags' set but not used [-Wunused-but-set-variable]
            int flags = 0 ;
                ^
1 warning generated.
blocksort.c:765:11: warning: variable 'numQSorted' set but not used [-Wunused-but-set-variable]
   Int32  numQSorted;
          ^
1 warning generated.
compress.c:241:30: warning: variable 'totc' set but not used [-Wunused-but-set-variable]
   Int32 v, t, i, j, gs, ge, totc, bt, bc, iter;
                             ^
1 warning generated.
Warning (mostly harmless): No library found for -lndbm
Warning (mostly harmless): No library found for -ldbm
Warning (mostly harmless): No library found for -lucb
Warning (mostly harmless): No library found for -lposix
Warning (mostly harmless): No library found for -lcposix
Socket.c:1703:7: warning: variable 'interface' set but not used [-Wunused-but-set-variable]
        SV *    interface;
                ^
1 warning generated.
In file included from HiRes.xs:860:
./const-c.inc:351:42: warning: unused parameter 'iv_return' [-Wunused-parameter]
constant_19 (pTHX_ const char *name, IV *iv_return) {
                                         ^
1 warning generated.
Typemap.c:1775:6: warning: variable 'dummy' set but not used [-Wunused-but-set-variable]
        int     dummy = 0;
                ^
1 warning generated.
[2022-05-09 00:44:13-0400] Skip tests from '/home/core/smoke/TestSmoke/smokecurrent.skiptests'
[2022-05-09 00:44:13-0400] 
[2022-05-09 00:44:13-0400]  Tests start here:
[2022-05-09 00:44:13-0400] TSTENV = stdio	
#   "Pod NAME already used" 
#     'pod/perlguts.pod-new' also has NAME 'perlguts' near line ??? of pod/perlguts.pod
# See end of this test output for your options on silencing this
#   "? Should you be using L<...> instead of" 
#     C<av_shift> near line 475 of pod/perlguts.pod-new
#   "Pod NAME already used" 
#     'pod/perlguts.pod' also has NAME 'perlguts' near line ??? of pod/perlguts.pod-new
# See end of this test output for your options on silencing this
# 
# HOW TO GET porting/podcheck.t TO PASS
# 
# There were 2 files that had new potential problems identified.
# Some of them may be real, and some of them may be false positives because
# this program isn't as smart as it likes to think it is.  You can teach this
# program to ignore the issues it has identified, and hence pass, by doing the
# following:
# 
# 1) If a problem is about a link to an unknown module or man page that
#    you know exists, re-run the command something like:
#       ./perl -I../lib porting/podcheck.t --add-link MODULE man_page ...
#    (MODULEs should look like Foo::Bar, and man_pages should look like
#    bar(3c); don't do this for a module or man page that you aren't sure
#    about; instead treat as another type of issue and follow the
#    instructions below.)
# 
# 2) For other issues, decide if each should be fixed now or not.  Fix the
#    ones you decided to, and rerun this test to verify that the fixes
#    worked.
# 
# 3) If there remain false positive or problems that you don't plan to fix right
#    now,
#    run this test script by hand, using the following formula (on
#    Un*x-like machines):
#         cd t
#         ./perl -I../lib porting/podcheck.t --regen
# 
#    That should cause all current potential problems to be accepted by
#    the program, so that the next time it runs, they won't be flagged.
#    For a few files, such as perltoc, certain issues will always be
#    expected, and more of the same will be added over time.  For those,
#    before you do the regen, you can edit
#    /home/core/smoke/perl-current/t/porting/known_pod_issues.dat
#    and find the entry for the module's file and specific error message,
#    and change the count of known potential problems to -1.
'pod/perlguts.pod-new' and 'pod/perlguts.pod' differ
/home/core/smoke/perl-current/perl -I. regen/mg_vtable.pl --tap failed: 65280 at regen.pl line 20, <DATA> line 8.
    Hint:  A failure in this file can often be corrected by running:
     ./perl -Ilib regen.pl
Subroutine Time::HiRes::constant redefined at (eval 37) line 1.
Subroutine Time::HiRes::usleep redefined at (eval 37) line 1.
Subroutine Time::HiRes::nanosleep redefined at (eval 37) line 1.
Subroutine Time::HiRes::sleep redefined at (eval 37) line 1.
Subroutine Time::HiRes::ualarm redefined at (eval 37) line 1.
Subroutine Time::HiRes::alarm redefined at (eval 37) line 1.
Subroutine Time::HiRes::gettimeofday redefined at (eval 37) line 1.
Subroutine Time::HiRes::time redefined at (eval 37) line 1.
Subroutine Time::HiRes::setitimer redefined at (eval 37) line 1.
Subroutine Time::HiRes::getitimer redefined at (eval 37) line 1.
Subroutine Time::HiRes::utime redefined at (eval 37) line 1.
Subroutine Time::HiRes::clock_gettime redefined at (eval 37) line 1.
Subroutine Time::HiRes::clock_getres redefined at (eval 37) line 1.
Subroutine Time::HiRes::clock_nanosleep redefined at (eval 37) line 1.
Subroutine Time::HiRes::clock redefined at (eval 37) line 1.
Subroutine Time::HiRes::lstat redefined at (eval 37) line 1.
Subroutine Time::HiRes::stat redefined at (eval 37) line 1.
*** Error 3 in /home/core/smoke/perl-current (makefile:842 'test_harness')

error while running harness target 'test_harness': 2 at /home/core/smoke/TestSmoke/Test/Smoke/App/RunSmoke.pm line 118.
[2022-05-09 01:29:08-0400] 
[2022-05-09 01:29:08-0400] ../t/porting/podcheck.t.....................................FAILED
[2022-05-09 01:29:08-0400]     193-194
[2022-05-09 01:29:08-0400] ../t/porting/regen.t........................................FAILED
[2022-05-09 01:29:08-0400]     22
[2022-05-09 01:29:08-0400] ../t/porting/regen.t........................................FAILED
[2022-05-09 01:29:08-0400]     Non-zero exit status: 255
[2022-05-09 01:29:08-0400] ../t/porting/regen.t........................................FAILED
[2022-05-09 01:29:08-0400]     Bad plan.  You planned 42 tests but ran 22.
[2022-05-09 01:29:08-0400] Archived results...
[2022-05-09 01:29:08-0400] Unskip tests from '/home/core/smoke/TestSmoke/smokecurrent.skiptests'
[2022-05-09 01:29:08-0400] 
[2022-05-09 01:29:08-0400] Configuration: -Dusedevel -Dcc=clang -Duseithreads -Duse64bitall -DDEBUGGING
[2022-05-09 01:29:08-0400] ------------------------------------------------------------------------------
[2022-05-09 01:29:08-0400] make distclean ...
[2022-05-09 01:29:47-0400] 
[2022-05-09 01:29:47-0400] Copy Policy.sh ...
[2022-05-09 01:29:47-0400] 
[2022-05-09 01:29:47-0400] Configure ...
[2022-05-09 01:31:32-0400] 
[2022-05-09 01:31:32-0400] make ...
Bzip2.xs:376:17: warning: variable 'flags' set but not used [-Wunused-but-set-variable]
            int flags = 0 ;
                ^
1 warning generated.
blocksort.c:765:11: warning: variable 'numQSorted' set but not used [-Wunused-but-set-variable]
   Int32  numQSorted;
          ^
1 warning generated.
compress.c:241:30: warning: variable 'totc' set but not used [-Wunused-but-set-variable]
   Int32 v, t, i, j, gs, ge, totc, bt, bc, iter;
                             ^
1 warning generated.
Warning (mostly harmless): No library found for -lndbm
Warning (mostly harmless): No library found for -ldbm
Warning (mostly harmless): No library found for -lucb
Warning (mostly harmless): No library found for -lposix
Warning (mostly harmless): No library found for -lcposix
Socket.c:1703:7: warning: variable 'interface' set but not used [-Wunused-but-set-variable]
        SV *    interface;
                ^
1 warning generated.
In file included from HiRes.xs:860:
./const-c.inc:351:42: warning: unused parameter 'iv_return' [-Wunused-parameter]
constant_19 (pTHX_ const char *name, IV *iv_return) {
                                         ^
1 warning generated.
Typemap.c:1775:6: warning: variable 'dummy' set but not used [-Wunused-but-set-variable]
        int     dummy = 0;
                ^
1 warning generated.
[2022-05-09 01:44:30-0400] Skip tests from '/home/core/smoke/TestSmoke/smokecurrent.skiptests'
[2022-05-09 01:44:30-0400] 
[2022-05-09 01:44:30-0400]  Tests start here:
[2022-05-09 01:44:30-0400] TSTENV = stdio	
#   "Pod NAME already used" 
#     'pod/perlguts.pod-new' also has NAME 'perlguts' near line ??? of pod/perlguts.pod
# See end of this test output for your options on silencing this
#   "? Should you be using L<...> instead of" 
#     C<av_shift> near line 475 of pod/perlguts.pod-new
#   "Pod NAME already used" 
#     'pod/perlguts.pod' also has NAME 'perlguts' near line ??? of pod/perlguts.pod-new
# See end of this test output for your options on silencing this
# 
# HOW TO GET porting/podcheck.t TO PASS
# 
# There were 2 files that had new potential problems identified.
# Some of them may be real, and some of them may be false positives because
# this program isn't as smart as it likes to think it is.  You can teach this
# program to ignore the issues it has identified, and hence pass, by doing the
# following:
# 
# 1) If a problem is about a link to an unknown module or man page that
#    you know exists, re-run the command something like:
#       ./perl -I../lib porting/podcheck.t --add-link MODULE man_page ...
#    (MODULEs should look like Foo::Bar, and man_pages should look like
#    bar(3c); don't do this for a module or man page that you aren't sure
#    about; instead treat as another type of issue and follow the
#    instructions below.)
# 
# 2) For other issues, decide if each should be fixed now or not.  Fix the
#    ones you decided to, and rerun this test to verify that the fixes
#    worked.
# 
# 3) If there remain false positive or problems that you don't plan to fix right
#    now,
#    run this test script by hand, using the following formula (on
#    Un*x-like machines):
#         cd t
#         ./perl -I../lib porting/podcheck.t --regen
# 
#    That should cause all current potential problems to be accepted by
#    the program, so that the next time it runs, they won't be flagged.
#    For a few files, such as perltoc, certain issues will always be
#    expected, and more of the same will be added over time.  For those,
#    before you do the regen, you can edit
#    /home/core/smoke/perl-current/t/porting/known_pod_issues.dat
#    and find the entry for the module's file and specific error message,
#    and change the count of known potential problems to -1.
'pod/perlguts.pod-new' and 'pod/perlguts.pod' differ
/home/core/smoke/perl-current/perl -I. regen/mg_vtable.pl --tap failed: 65280 at regen.pl line 20, <DATA> line 8.
    Hint:  A failure in this file can often be corrected by running:
     ./perl -Ilib regen.pl
Subroutine Time::HiRes::constant redefined at (eval 37) line 1.
Subroutine Time::HiRes::usleep redefined at (eval 37) line 1.
Subroutine Time::HiRes::nanosleep redefined at (eval 37) line 1.
Subroutine Time::HiRes::sleep redefined at (eval 37) line 1.
Subroutine Time::HiRes::ualarm redefined at (eval 37) line 1.
Subroutine Time::HiRes::alarm redefined at (eval 37) line 1.
Subroutine Time::HiRes::gettimeofday redefined at (eval 37) line 1.
Subroutine Time::HiRes::time redefined at (eval 37) line 1.
Subroutine Time::HiRes::setitimer redefined at (eval 37) line 1.
Subroutine Time::HiRes::getitimer redefined at (eval 37) line 1.
Subroutine Time::HiRes::utime redefined at (eval 37) line 1.
Subroutine Time::HiRes::clock_gettime redefined at (eval 37) line 1.
Subroutine Time::HiRes::clock_getres redefined at (eval 37) line 1.
Subroutine Time::HiRes::clock_nanosleep redefined at (eval 37) line 1.
Subroutine Time::HiRes::clock redefined at (eval 37) line 1.
Subroutine Time::HiRes::lstat redefined at (eval 37) line 1.
Subroutine Time::HiRes::stat redefined at (eval 37) line 1.
*** Error 3 in /home/core/smoke/perl-current (makefile:842 'test_harness')

error while running harness target 'test_harness': 2 at /home/core/smoke/TestSmoke/Test/Smoke/App/RunSmoke.pm line 118.
[2022-05-09 02:40:19-0400] 
[2022-05-09 02:40:19-0400] ../t/porting/podcheck.t.....................................FAILED
[2022-05-09 02:40:19-0400]     193-194
[2022-05-09 02:40:19-0400] ../t/porting/regen.t........................................FAILED
[2022-05-09 02:40:19-0400]     22
[2022-05-09 02:40:19-0400] ../t/porting/regen.t........................................FAILED
[2022-05-09 02:40:19-0400]     Non-zero exit status: 255
[2022-05-09 02:40:19-0400] ../t/porting/regen.t........................................FAILED
[2022-05-09 02:40:19-0400]     Bad plan.  You planned 42 tests but ran 22.
[2022-05-09 02:40:19-0400] Archived results...
[2022-05-09 02:40:19-0400] Unskip tests from '/home/core/smoke/TestSmoke/smokecurrent.skiptests'
[2022-05-09 02:40:19-0400] 
[2022-05-09 02:40:19-0400] Configuration: -Dusedevel -Dcc=clang -Duseithreads -Duselongdouble
[2022-05-09 02:40:19-0400] ------------------------------------------------------------------------------
[2022-05-09 02:40:19-0400] make distclean ...
[2022-05-09 02:41:05-0400] 
[2022-05-09 02:41:05-0400] Copy Policy.sh ...
[2022-05-09 02:41:05-0400] 
[2022-05-09 02:41:05-0400] Configure ...
[2022-05-09 02:42:33-0400] 
[2022-05-09 02:42:33-0400] make ...
Bzip2.xs:376:17: warning: variable 'flags' set but not used [-Wunused-but-set-variable]
            int flags = 0 ;
                ^
1 warning generated.
blocksort.c:765:11: warning: variable 'numQSorted' set but not used [-Wunused-but-set-variable]
   Int32  numQSorted;
          ^
1 warning generated.
compress.c:241:30: warning: variable 'totc' set but not used [-Wunused-but-set-variable]
   Int32 v, t, i, j, gs, ge, totc, bt, bc, iter;
                             ^
1 warning generated.
Warning (mostly harmless): No library found for -lndbm
Warning (mostly harmless): No library found for -ldbm
Warning (mostly harmless): No library found for -lucb
Warning (mostly harmless): No library found for -lposix
Warning (mostly harmless): No library found for -lcposix
Socket.c:1703:7: warning: variable 'interface' set but not used [-Wunused-but-set-variable]
        SV *    interface;
                ^
1 warning generated.
In file included from HiRes.xs:860:
./const-c.inc:351:42: warning: unused parameter 'iv_return' [-Wunused-parameter]
constant_19 (pTHX_ const char *name, IV *iv_return) {
                                         ^
1 warning generated.
Typemap.c:1775:6: warning: variable 'dummy' set but not used [-Wunused-but-set-variable]
        int     dummy = 0;
                ^
1 warning generated.
[2022-05-09 02:51:55-0400] Skip tests from '/home/core/smoke/TestSmoke/smokecurrent.skiptests'
[2022-05-09 02:51:55-0400] 
[2022-05-09 02:51:55-0400]  Tests start here:
[2022-05-09 02:51:55-0400] TSTENV = stdio	
#   "Pod NAME already used" 
#     'pod/perlguts.pod-new' also has NAME 'perlguts' near line ??? of pod/perlguts.pod
# See end of this test output for your options on silencing this
#   "? Should you be using L<...> instead of" 
#     C<av_shift> near line 475 of pod/perlguts.pod-new
#   "Pod NAME already used" 
#     'pod/perlguts.pod' also has NAME 'perlguts' near line ??? of pod/perlguts.pod-new
# See end of this test output for your options on silencing this
# 
# HOW TO GET porting/podcheck.t TO PASS
# 
# There were 2 files that had new potential problems identified.
# Some of them may be real, and some of them may be false positives because
# this program isn't as smart as it likes to think it is.  You can teach this
# program to ignore the issues it has identified, and hence pass, by doing the
# following:
# 
# 1) If a problem is about a link to an unknown module or man page that
#    you know exists, re-run the command something like:
#       ./perl -I../lib porting/podcheck.t --add-link MODULE man_page ...
#    (MODULEs should look like Foo::Bar, and man_pages should look like
#    bar(3c); don't do this for a module or man page that you aren't sure
#    about; instead treat as another type of issue and follow the
#    instructions below.)
# 
# 2) For other issues, decide if each should be fixed now or not.  Fix the
#    ones you decided to, and rerun this test to verify that the fixes
#    worked.
# 
# 3) If there remain false positive or problems that you don't plan to fix right
#    now,
#    run this test script by hand, using the following formula (on
#    Un*x-like machines):
#         cd t
#         ./perl -I../lib porting/podcheck.t --regen
# 
#    That should cause all current potential problems to be accepted by
#    the program, so that the next time it runs, they won't be flagged.
#    For a few files, such as perltoc, certain issues will always be
#    expected, and more of the same will be added over time.  For those,
#    before you do the regen, you can edit
#    /home/core/smoke/perl-current/t/porting/known_pod_issues.dat
#    and find the entry for the module's file and specific error message,
#    and change the count of known potential problems to -1.
'pod/perlguts.pod-new' and 'pod/perlguts.pod' differ
/home/core/smoke/perl-current/perl -I. regen/mg_vtable.pl --tap failed: 65280 at regen.pl line 20, <DATA> line 8.
    Hint:  A failure in this file can often be corrected by running:
     ./perl -Ilib regen.pl
Subroutine Time::HiRes::constant redefined at (eval 37) line 1.
Subroutine Time::HiRes::usleep redefined at (eval 37) line 1.
Subroutine Time::HiRes::nanosleep redefined at (eval 37) line 1.
Subroutine Time::HiRes::sleep redefined at (eval 37) line 1.
Subroutine Time::HiRes::ualarm redefined at (eval 37) line 1.
Subroutine Time::HiRes::alarm redefined at (eval 37) line 1.
Subroutine Time::HiRes::gettimeofday redefined at (eval 37) line 1.
Subroutine Time::HiRes::time redefined at (eval 37) line 1.
Subroutine Time::HiRes::setitimer redefined at (eval 37) line 1.
Subroutine Time::HiRes::getitimer redefined at (eval 37) line 1.
Subroutine Time::HiRes::utime redefined at (eval 37) line 1.
Subroutine Time::HiRes::clock_gettime redefined at (eval 37) line 1.
Subroutine Time::HiRes::clock_getres redefined at (eval 37) line 1.
Subroutine Time::HiRes::clock_nanosleep redefined at (eval 37) line 1.
Subroutine Time::HiRes::clock redefined at (eval 37) line 1.
Subroutine Time::HiRes::lstat redefined at (eval 37) line 1.
Subroutine Time::HiRes::stat redefined at (eval 37) line 1.
*** Error 3 in /home/core/smoke/perl-current (makefile:842 'test_harness')

error while running harness target 'test_harness': 2 at /home/core/smoke/TestSmoke/Test/Smoke/App/RunSmoke.pm line 118.
[2022-05-09 03:37:05-0400] 
[2022-05-09 03:37:05-0400] ../t/porting/podcheck.t.....................................FAILED
[2022-05-09 03:37:05-0400]     193-194
[2022-05-09 03:37:05-0400] ../t/porting/regen.t........................................FAILED
[2022-05-09 03:37:05-0400]     22
[2022-05-09 03:37:05-0400] ../t/porting/regen.t........................................FAILED
[2022-05-09 03:37:05-0400]     Non-zero exit status: 255
[2022-05-09 03:37:05-0400] ../t/porting/regen.t........................................FAILED
[2022-05-09 03:37:05-0400]     Bad plan.  You planned 42 tests but ran 22.
[2022-05-09 03:37:05-0400] Archived results...
[2022-05-09 03:37:05-0400] Unskip tests from '/home/core/smoke/TestSmoke/smokecurrent.skiptests'
[2022-05-09 03:37:05-0400] 
[2022-05-09 03:37:05-0400] Configuration: -Dusedevel -Dcc=clang -Duseithreads -Duselongdouble -DDEBUGGING
[2022-05-09 03:37:05-0400] ------------------------------------------------------------------------------
[2022-05-09 03:37:05-0400] make distclean ...
[2022-05-09 03:37:43-0400] 
[2022-05-09 03:37:43-0400] Copy Policy.sh ...
[2022-05-09 03:37:43-0400] 
[2022-05-09 03:37:43-0400] Configure ...
[2022-05-09 03:39:14-0400] 
[2022-05-09 03:39:14-0400] make ...
Bzip2.xs:376:17: warning: variable 'flags' set but not used [-Wunused-but-set-variable]
            int flags = 0 ;
                ^
1 warning generated.
blocksort.c:765:11: warning: variable 'numQSorted' set but not used [-Wunused-but-set-variable]
   Int32  numQSorted;
          ^
1 warning generated.
compress.c:241:30: warning: variable 'totc' set but not used [-Wunused-but-set-variable]
   Int32 v, t, i, j, gs, ge, totc, bt, bc, iter;
                             ^
1 warning generated.
Warning (mostly harmless): No library found for -lndbm
Warning (mostly harmless): No library found for -ldbm
Warning (mostly harmless): No library found for -lucb
Warning (mostly harmless): No library found for -lposix
Warning (mostly harmless): No library found for -lcposix
Socket.c:1703:7: warning: variable 'interface' set but not used [-Wunused-but-set-variable]
        SV *    interface;
                ^
1 warning generated.
In file included from HiRes.xs:860:
./const-c.inc:351:42: warning: unused parameter 'iv_return' [-Wunused-parameter]
constant_19 (pTHX_ const char *name, IV *iv_return) {
                                         ^
1 warning generated.
Typemap.c:1775:6: warning: variable 'dummy' set but not used [-Wunused-but-set-variable]
        int     dummy = 0;
                ^
1 warning generated.
[2022-05-09 03:52:13-0400] Skip tests from '/home/core/smoke/TestSmoke/smokecurrent.skiptests'
[2022-05-09 03:52:13-0400] 
[2022-05-09 03:52:13-0400]  Tests start here:
[2022-05-09 03:52:13-0400] TSTENV = stdio	
#   "Pod NAME already used" 
#     'pod/perlguts.pod-new' also has NAME 'perlguts' near line ??? of pod/perlguts.pod
# See end of this test output for your options on silencing this
#   "? Should you be using L<...> instead of" 
#     C<av_shift> near line 475 of pod/perlguts.pod-new
#   "Pod NAME already used" 
#     'pod/perlguts.pod' also has NAME 'perlguts' near line ??? of pod/perlguts.pod-new
# See end of this test output for your options on silencing this
# 
# HOW TO GET porting/podcheck.t TO PASS
# 
# There were 2 files that had new potential problems identified.
# Some of them may be real, and some of them may be false positives because
# this program isn't as smart as it likes to think it is.  You can teach this
# program to ignore the issues it has identified, and hence pass, by doing the
# following:
# 
# 1) If a problem is about a link to an unknown module or man page that
#    you know exists, re-run the command something like:
#       ./perl -I../lib porting/podcheck.t --add-link MODULE man_page ...
#    (MODULEs should look like Foo::Bar, and man_pages should look like
#    bar(3c); don't do this for a module or man page that you aren't sure
#    about; instead treat as another type of issue and follow the
#    instructions below.)
# 
# 2) For other issues, decide if each should be fixed now or not.  Fix the
#    ones you decided to, and rerun this test to verify that the fixes
#    worked.
# 
# 3) If there remain false positive or problems that you don't plan to fix right
#    now,
#    run this test script by hand, using the following formula (on
#    Un*x-like machines):
#         cd t
#         ./perl -I../lib porting/podcheck.t --regen
# 
#    That should cause all current potential problems to be accepted by
#    the program, so that the next time it runs, they won't be flagged.
#    For a few files, such as perltoc, certain issues will always be
#    expected, and more of the same will be added over time.  For those,
#    before you do the regen, you can edit
#    /home/core/smoke/perl-current/t/porting/known_pod_issues.dat
#    and find the entry for the module's file and specific error message,
#    and change the count of known potential problems to -1.
'pod/perlguts.pod-new' and 'pod/perlguts.pod' differ
/home/core/smoke/perl-current/perl -I. regen/mg_vtable.pl --tap failed: 65280 at regen.pl line 20, <DATA> line 8.
    Hint:  A failure in this file can often be corrected by running:
     ./perl -Ilib regen.pl
Subroutine Time::HiRes::constant redefined at (eval 37) line 1.
Subroutine Time::HiRes::usleep redefined at (eval 37) line 1.
Subroutine Time::HiRes::nanosleep redefined at (eval 37) line 1.
Subroutine Time::HiRes::sleep redefined at (eval 37) line 1.
Subroutine Time::HiRes::ualarm redefined at (eval 37) line 1.
Subroutine Time::HiRes::alarm redefined at (eval 37) line 1.
Subroutine Time::HiRes::gettimeofday redefined at (eval 37) line 1.
Subroutine Time::HiRes::time redefined at (eval 37) line 1.
Subroutine Time::HiRes::setitimer redefined at (eval 37) line 1.
Subroutine Time::HiRes::getitimer redefined at (eval 37) line 1.
Subroutine Time::HiRes::utime redefined at (eval 37) line 1.
Subroutine Time::HiRes::clock_gettime redefined at (eval 37) line 1.
Subroutine Time::HiRes::clock_getres redefined at (eval 37) line 1.
Subroutine Time::HiRes::clock_nanosleep redefined at (eval 37) line 1.
Subroutine Time::HiRes::clock redefined at (eval 37) line 1.
Subroutine Time::HiRes::lstat redefined at (eval 37) line 1.
Subroutine Time::HiRes::stat redefined at (eval 37) line 1.
*** Error 3 in /home/core/smoke/perl-current (makefile:842 'test_harness')

error while running harness target 'test_harness': 2 at /home/core/smoke/TestSmoke/Test/Smoke/App/RunSmoke.pm line 118.
[2022-05-09 04:48:21-0400] 
[2022-05-09 04:48:21-0400] ../t/porting/podcheck.t.....................................FAILED
[2022-05-09 04:48:21-0400]     193-194
[2022-05-09 04:48:21-0400] ../t/porting/regen.t........................................FAILED
[2022-05-09 04:48:21-0400]     22
[2022-05-09 04:48:21-0400] ../t/porting/regen.t........................................FAILED
[2022-05-09 04:48:21-0400]     Non-zero exit status: 255
[2022-05-09 04:48:21-0400] ../t/porting/regen.t........................................FAILED
[2022-05-09 04:48:21-0400]     Bad plan.  You planned 42 tests but ran 22.
[2022-05-09 04:48:21-0400] Archived results...
[2022-05-09 04:48:21-0400] Unskip tests from '/home/core/smoke/TestSmoke/smokecurrent.skiptests'
[2022-05-09 04:48:21-0400] Finished smoking 300ff263fbad8007ca52d84a8be8b98fba791a3c v5.35.11-140-g300ff263fb blead
[2022-05-09 04:48:21-0400] Reading smokeresult from /home/core/smoke/perl-current/mktest.out
[2022-05-09 04:48:21-0400] Processing [-Dcc=clang]
[2022-05-09 04:48:21-0400] Processing [-DDEBUGGING -Dcc=clang]
[2022-05-09 04:48:21-0400] Processing [-Dcc=clang -Duse64bitall]
[2022-05-09 04:48:21-0400] Processing [-DDEBUGGING -Dcc=clang -Duse64bitall]
[2022-05-09 04:48:21-0400] Processing [-Dcc=clang -Duselongdouble]
[2022-05-09 04:48:21-0400] Processing [-DDEBUGGING -Dcc=clang -Duselongdouble]
[2022-05-09 04:48:21-0400] Processing [-Dcc=clang -Duseithreads]
[2022-05-09 04:48:21-0400] Processing [-DDEBUGGING -Dcc=clang -Duseithreads]
[2022-05-09 04:48:21-0400] Processing [-Dcc=clang -Duseithreads -Duse64bitall]
[2022-05-09 04:48:21-0400] Processing [-DDEBUGGING -Dcc=clang -Duseithreads -Duse64bitall]
[2022-05-09 04:48:21-0400] Processing [-Dcc=clang -Duseithreads -Duselongdouble]
[2022-05-09 04:48:21-0400] Processing [-DDEBUGGING -Dcc=clang -Duseithreads -Duselongdouble]
[2022-05-09 04:48:21-0400] ==> Starting reporter
[2022-05-09 04:48:21-0400] Writing report to '/home/core/smoke/perl-current/mktest.rpt'
-- 
Report generated by Test::Smoke::Gateway v0.12