Show report
[2022-05-08 22:20:07+0200] ==> Skipping synctree
[2022-05-08 22:20:07+0200] ==> Starting runsmoke
[2022-05-08 22:20:07+0200] [tssmokeperl.pl] chdir(/pro/3gl/CPAN/perl-current)
[2022-05-08 22:20:07+0200] qx[/pro/bin/perl -e "require q[/pro/3gl/CPAN/perl-current/cpan/Test-Harness/lib/Test/Harness.pm];print Test::Harness->VERSION" 2>&1]
[2022-05-08 22:20:07+0200] Found: Test::Harness version 3.44.
[2022-05-08 22:20:07+0200] Reading build configurations from /pro/3gl/CPAN/smoke/p59.cfg
[2022-05-08 22:20:07+0200] Reading 'Policy.sh' from ../Policy.sh (v=1)
[2022-05-08 22:20:07+0200] Running test suite only with 'harness'
[2022-05-08 22:20:07+0200] make distclean ...
[2022-05-08 22:20:07+0200] Smoking patch 300ff263fbad8007ca52d84a8be8b98fba791a3c v5.35.11-140-g300ff26
[2022-05-08 22:20:07+0200] Smoking branch blead
[2022-05-08 22:20:08+0200] Locally applied patches from '/pro/3gl/CPAN/perl-current/patchlevel.h'
[2022-05-08 22:20:08+0200] Patches: 'uncommitted-changes'
[2022-05-08 22:20:08+0200] Adding 'SMOKE300ff263fbad8007ca52d84a8be8b98fba791a3c' to the registered patches.
[2022-05-08 22:20:08+0200] 
[2022-05-08 22:20:08+0200] Configuration: -Dusedevel -Duselongdouble
[2022-05-08 22:20:08+0200] ------------------------------------------------------------------------------
[2022-05-08 22:20:08+0200] make distclean ...
[2022-05-08 22:20:08+0200] 
[2022-05-08 22:20:08+0200] Copy Policy.sh ...
[2022-05-08 22:20:08+0200] 
[2022-05-08 22:20:08+0200] Configure ...
[2022-05-08 22:21:19+0200] 
[2022-05-08 22:21:19+0200] make ...
Cannot open(/pro/3gl/CPAN/smoke/p59.skip): No such file or directory at /pro/3gl/CPAN/smoke/lib/Test/Smoke/App/RunSmoke.pm line 118.
[2022-05-08 22:22:28+0200] 
[2022-05-08 22:22:28+0200]  Tests start here:
[2022-05-08 22:22:28+0200] TSTENV = stdio	
No saved state, selection will be empty
Subroutine Time::HiRes::constant redefined at (eval 37) line 1.
Subroutine Time::HiRes::usleep redefined at (eval 37) line 1.
Subroutine Time::HiRes::nanosleep redefined at (eval 37) line 1.
Subroutine Time::HiRes::sleep redefined at (eval 37) line 1.
Subroutine Time::HiRes::ualarm redefined at (eval 37) line 1.
Subroutine Time::HiRes::alarm redefined at (eval 37) line 1.
Subroutine Time::HiRes::gettimeofday redefined at (eval 37) line 1.
Subroutine Time::HiRes::time redefined at (eval 37) line 1.
Subroutine Time::HiRes::setitimer redefined at (eval 37) line 1.
Subroutine Time::HiRes::getitimer redefined at (eval 37) line 1.
Subroutine Time::HiRes::utime redefined at (eval 37) line 1.
Subroutine Time::HiRes::clock_gettime redefined at (eval 37) line 1.
Subroutine Time::HiRes::clock_getres redefined at (eval 37) line 1.
Subroutine Time::HiRes::clock_nanosleep redefined at (eval 37) line 1.
Subroutine Time::HiRes::clock redefined at (eval 37) line 1.
Subroutine Time::HiRes::lstat redefined at (eval 37) line 1.
Subroutine Time::HiRes::stat redefined at (eval 37) line 1.
No such file or directory
No such file or directory
No such file or directory
No such file or directory
No such file or directory
No such file or directory
'pod/perlguts.pod-new' and 'pod/perlguts.pod' differ
/pro/3gl/CPAN/perl-current/perl -I. regen/mg_vtable.pl --tap failed: 512 at regen.pl line 20, <DATA> line 8.
    Hint:  A failure in this file can often be corrected by running:
     ./perl -Ilib regen.pl
No such file or directory
make: *** [makefile:856: test_harness] Error 1

error while running harness target 'test_harness': 2 at /pro/3gl/CPAN/smoke/lib/Test/Smoke/App/RunSmoke.pm line 118.
[2022-05-08 22:26:05+0200] 
[2022-05-08 22:26:05+0200] ../t/porting/regen.t........................................FAILED
[2022-05-08 22:26:05+0200]     22
[2022-05-08 22:26:05+0200] ../t/porting/regen.t........................................FAILED
[2022-05-08 22:26:05+0200]     Non-zero exit status: 22
[2022-05-08 22:26:05+0200] ../t/porting/regen.t........................................FAILED
[2022-05-08 22:26:05+0200]     Bad plan.  You planned 42 tests but ran 22.
[2022-05-08 22:26:05+0200] Archived results...
[2022-05-08 22:26:05+0200] TSTENV = perlio	
#   "Pod NAME already used" 
#     'pod/perlguts.pod-new' also has NAME 'perlguts' near line ??? of pod/perlguts.pod
# See end of this test output for your options on silencing this
#   "? Should you be using L<...> instead of" 
#     C<av_shift> near line 475 of pod/perlguts.pod-new
#   "Pod NAME already used" 
#     'pod/perlguts.pod' also has NAME 'perlguts' near line ??? of pod/perlguts.pod-new
# See end of this test output for your options on silencing this
# 
# HOW TO GET porting/podcheck.t TO PASS
# 
# There were 2 files that had new potential problems identified.
# Some of them may be real, and some of them may be false positives because
# this program isn't as smart as it likes to think it is.  You can teach this
# program to ignore the issues it has identified, and hence pass, by doing the
# following:
# 
# 1) If a problem is about a link to an unknown module or man page that
#    you know exists, re-run the command something like:
#       ./perl -I../lib porting/podcheck.t --add-link MODULE man_page ...
#    (MODULEs should look like Foo::Bar, and man_pages should look like
#    bar(3c); don't do this for a module or man page that you aren't sure
#    about; instead treat as another type of issue and follow the
#    instructions below.)
# 
# 2) For other issues, decide if each should be fixed now or not.  Fix the
#    ones you decided to, and rerun this test to verify that the fixes
#    worked.
# 
# 3) If there remain false positive or problems that you don't plan to fix right
#    now,
#    run this test script by hand, using the following formula (on
#    Un*x-like machines):
#         cd t
#         ./perl -I../lib porting/podcheck.t --regen
# 
#    That should cause all current potential problems to be accepted by
#    the program, so that the next time it runs, they won't be flagged.
#    For a few files, such as perltoc, certain issues will always be
#    expected, and more of the same will be added over time.  For those,
#    before you do the regen, you can edit
#    /pro/3gl/CPAN/perl-current/t/porting/known_pod_issues.dat
#    and find the entry for the module's file and specific error message,
#    and change the count of known potential problems to -1.
'pod/perlguts.pod-new' and 'pod/perlguts.pod' differ
/pro/3gl/CPAN/perl-current/perl -I. regen/mg_vtable.pl --tap failed: 65280 at regen.pl line 20, <DATA> line 8.
    Hint:  A failure in this file can often be corrected by running:
     ./perl -Ilib regen.pl
Subroutine Time::HiRes::constant redefined at (eval 37) line 1.
Subroutine Time::HiRes::usleep redefined at (eval 37) line 1.
Subroutine Time::HiRes::nanosleep redefined at (eval 37) line 1.
Subroutine Time::HiRes::sleep redefined at (eval 37) line 1.
Subroutine Time::HiRes::ualarm redefined at (eval 37) line 1.
Subroutine Time::HiRes::alarm redefined at (eval 37) line 1.
Subroutine Time::HiRes::gettimeofday redefined at (eval 37) line 1.
Subroutine Time::HiRes::time redefined at (eval 37) line 1.
Subroutine Time::HiRes::setitimer redefined at (eval 37) line 1.
Subroutine Time::HiRes::getitimer redefined at (eval 37) line 1.
Subroutine Time::HiRes::utime redefined at (eval 37) line 1.
Subroutine Time::HiRes::clock_gettime redefined at (eval 37) line 1.
Subroutine Time::HiRes::clock_getres redefined at (eval 37) line 1.
Subroutine Time::HiRes::clock_nanosleep redefined at (eval 37) line 1.
Subroutine Time::HiRes::clock redefined at (eval 37) line 1.
Subroutine Time::HiRes::lstat redefined at (eval 37) line 1.
Subroutine Time::HiRes::stat redefined at (eval 37) line 1.
make: *** [makefile:856: test_harness] Error 3

error while running harness target 'test_harness': 2 at /pro/3gl/CPAN/smoke/lib/Test/Smoke/App/RunSmoke.pm line 118.
[2022-05-08 22:29:29+0200] 
[2022-05-08 22:29:29+0200] ../t/porting/podcheck.t.....................................FAILED
[2022-05-08 22:29:29+0200]     193-194
[2022-05-08 22:29:29+0200] ../t/porting/regen.t........................................FAILED
[2022-05-08 22:29:29+0200]     22
[2022-05-08 22:29:29+0200] ../t/porting/regen.t........................................FAILED
[2022-05-08 22:29:29+0200]     Non-zero exit status: 255
[2022-05-08 22:29:29+0200] ../t/porting/regen.t........................................FAILED
[2022-05-08 22:29:29+0200]     Bad plan.  You planned 42 tests but ran 22.
[2022-05-08 22:29:29+0200] Archived results...
[2022-05-08 22:29:29+0200] TSTENV = locale:en_US.utf8	
#   "Pod NAME already used" 
#     'pod/perlguts.pod-new' also has NAME 'perlguts' near line ??? of pod/perlguts.pod
# See end of this test output for your options on silencing this
#   "? Should you be using L<...> instead of" 
#     C<av_shift> near line 475 of pod/perlguts.pod-new
#   "Pod NAME already used" 
#     'pod/perlguts.pod' also has NAME 'perlguts' near line ??? of pod/perlguts.pod-new
# See end of this test output for your options on silencing this
# 
# HOW TO GET porting/podcheck.t TO PASS
# 
# There were 2 files that had new potential problems identified.
# Some of them may be real, and some of them may be false positives because
# this program isn't as smart as it likes to think it is.  You can teach this
# program to ignore the issues it has identified, and hence pass, by doing the
# following:
# 
# 1) If a problem is about a link to an unknown module or man page that
#    you know exists, re-run the command something like:
#       ./perl -I../lib porting/podcheck.t --add-link MODULE man_page ...
#    (MODULEs should look like Foo::Bar, and man_pages should look like
#    bar(3c); don't do this for a module or man page that you aren't sure
#    about; instead treat as another type of issue and follow the
#    instructions below.)
# 
# 2) For other issues, decide if each should be fixed now or not.  Fix the
#    ones you decided to, and rerun this test to verify that the fixes
#    worked.
# 
# 3) If there remain false positive or problems that you don't plan to fix right
#    now,
#    run this test script by hand, using the following formula (on
#    Un*x-like machines):
#         cd t
#         ./perl -I../lib porting/podcheck.t --regen
# 
#    That should cause all current potential problems to be accepted by
#    the program, so that the next time it runs, they won't be flagged.
#    For a few files, such as perltoc, certain issues will always be
#    expected, and more of the same will be added over time.  For those,
#    before you do the regen, you can edit
#    /pro/3gl/CPAN/perl-current/t/porting/known_pod_issues.dat
#    and find the entry for the module's file and specific error message,
#    and change the count of known potential problems to -1.
'pod/perlguts.pod-new' and 'pod/perlguts.pod' differ
/pro/3gl/CPAN/perl-current/perl -I. regen/mg_vtable.pl --tap failed: 65280 at regen.pl line 20, <DATA> line 8.
    Hint:  A failure in this file can often be corrected by running:
     ./perl -Ilib regen.pl
Subroutine Time::HiRes::constant redefined at (eval 37) line 1.
Subroutine Time::HiRes::usleep redefined at (eval 37) line 1.
Subroutine Time::HiRes::nanosleep redefined at (eval 37) line 1.
Subroutine Time::HiRes::sleep redefined at (eval 37) line 1.
Subroutine Time::HiRes::ualarm redefined at (eval 37) line 1.
Subroutine Time::HiRes::alarm redefined at (eval 37) line 1.
Subroutine Time::HiRes::gettimeofday redefined at (eval 37) line 1.
Subroutine Time::HiRes::time redefined at (eval 37) line 1.
Subroutine Time::HiRes::setitimer redefined at (eval 37) line 1.
Subroutine Time::HiRes::getitimer redefined at (eval 37) line 1.
Subroutine Time::HiRes::utime redefined at (eval 37) line 1.
Subroutine Time::HiRes::clock_gettime redefined at (eval 37) line 1.
Subroutine Time::HiRes::clock_getres redefined at (eval 37) line 1.
Subroutine Time::HiRes::clock_nanosleep redefined at (eval 37) line 1.
Subroutine Time::HiRes::clock redefined at (eval 37) line 1.
Subroutine Time::HiRes::lstat redefined at (eval 37) line 1.
Subroutine Time::HiRes::stat redefined at (eval 37) line 1.
make: *** [makefile:856: test_harness] Error 3

error while running harness target 'test_harness': 2 at /pro/3gl/CPAN/smoke/lib/Test/Smoke/App/RunSmoke.pm line 118.
[2022-05-08 22:32:48+0200] 
[2022-05-08 22:32:48+0200] ../t/porting/podcheck.t.....................................FAILED
[2022-05-08 22:32:48+0200]     193-194
[2022-05-08 22:32:48+0200] ../t/porting/regen.t........................................FAILED
[2022-05-08 22:32:48+0200]     22
[2022-05-08 22:32:48+0200] ../t/porting/regen.t........................................FAILED
[2022-05-08 22:32:48+0200]     Non-zero exit status: 255
[2022-05-08 22:32:48+0200] ../t/porting/regen.t........................................FAILED
[2022-05-08 22:32:48+0200]     Bad plan.  You planned 42 tests but ran 22.
[2022-05-08 22:32:48+0200] Archived results...
Cannot open(/pro/3gl/CPAN/smoke/p59.skip): No such file or directory at /pro/3gl/CPAN/smoke/lib/Test/Smoke/App/RunSmoke.pm line 118.
[2022-05-08 22:32:48+0200] 
[2022-05-08 22:32:48+0200] Configuration: -Dusedevel -Duselongdouble -DDEBUGGING
[2022-05-08 22:32:48+0200] ------------------------------------------------------------------------------
[2022-05-08 22:32:48+0200] make distclean ...
[2022-05-08 22:33:05+0200] 
[2022-05-08 22:33:05+0200] Copy Policy.sh ...
[2022-05-08 22:33:05+0200] 
[2022-05-08 22:33:05+0200] Configure ...
[2022-05-08 22:34:19+0200] 
[2022-05-08 22:34:19+0200] make ...
Cannot open(/pro/3gl/CPAN/smoke/p59.skip): No such file or directory at /pro/3gl/CPAN/smoke/lib/Test/Smoke/App/RunSmoke.pm line 118.
[2022-05-08 22:35:55+0200] 
[2022-05-08 22:35:55+0200]  Tests start here:
[2022-05-08 22:35:55+0200] TSTENV = stdio	
No saved state, selection will be empty
Subroutine Time::HiRes::constant redefined at (eval 37) line 1.
Subroutine Time::HiRes::usleep redefined at (eval 37) line 1.
Subroutine Time::HiRes::nanosleep redefined at (eval 37) line 1.
Subroutine Time::HiRes::sleep redefined at (eval 37) line 1.
Subroutine Time::HiRes::ualarm redefined at (eval 37) line 1.
Subroutine Time::HiRes::alarm redefined at (eval 37) line 1.
Subroutine Time::HiRes::gettimeofday redefined at (eval 37) line 1.
Subroutine Time::HiRes::time redefined at (eval 37) line 1.
Subroutine Time::HiRes::setitimer redefined at (eval 37) line 1.
Subroutine Time::HiRes::getitimer redefined at (eval 37) line 1.
Subroutine Time::HiRes::utime redefined at (eval 37) line 1.
Subroutine Time::HiRes::clock_gettime redefined at (eval 37) line 1.
Subroutine Time::HiRes::clock_getres redefined at (eval 37) line 1.
Subroutine Time::HiRes::clock_nanosleep redefined at (eval 37) line 1.
Subroutine Time::HiRes::clock redefined at (eval 37) line 1.
Subroutine Time::HiRes::lstat redefined at (eval 37) line 1.
Subroutine Time::HiRes::stat redefined at (eval 37) line 1.
No such file or directory
No such file or directory
No such file or directory
No such file or directory
No such file or directory
No such file or directory
'pod/perlguts.pod-new' and 'pod/perlguts.pod' differ
/pro/3gl/CPAN/perl-current/perl -I. regen/mg_vtable.pl --tap failed: 512 at regen.pl line 20, <DATA> line 8.
    Hint:  A failure in this file can often be corrected by running:
     ./perl -Ilib regen.pl
No such file or directory
#   "Pod NAME already used" 
#     'pod/perlguts.pod-new' also has NAME 'perlguts' near line ??? of pod/perlguts.pod
# See end of this test output for your options on silencing this
#   "? Should you be using L<...> instead of" 
#     C<av_shift> near line 475 of pod/perlguts.pod-new
#   "Pod NAME already used" 
#     'pod/perlguts.pod' also has NAME 'perlguts' near line ??? of pod/perlguts.pod-new
# See end of this test output for your options on silencing this
# 
# HOW TO GET porting/podcheck.t TO PASS
# 
# There were 2 files that had new potential problems identified.
# Some of them may be real, and some of them may be false positives because
# this program isn't as smart as it likes to think it is.  You can teach this
# program to ignore the issues it has identified, and hence pass, by doing the
# following:
# 
# 1) If a problem is about a link to an unknown module or man page that
#    you know exists, re-run the command something like:
#       ./perl -I../lib porting/podcheck.t --add-link MODULE man_page ...
#    (MODULEs should look like Foo::Bar, and man_pages should look like
#    bar(3c); don't do this for a module or man page that you aren't sure
#    about; instead treat as another type of issue and follow the
#    instructions below.)
# 
# 2) For other issues, decide if each should be fixed now or not.  Fix the
#    ones you decided to, and rerun this test to verify that the fixes
#    worked.
# 
# 3) If there remain false positive or problems that you don't plan to fix right
#    now,
#    run this test script by hand, using the following formula (on
#    Un*x-like machines):
#         cd t
#         ./perl -I../lib porting/podcheck.t --regen
# 
#    That should cause all current potential problems to be accepted by
#    the program, so that the next time it runs, they won't be flagged.
#    For a few files, such as perltoc, certain issues will always be
#    expected, and more of the same will be added over time.  For those,
#    before you do the regen, you can edit
#    /pro/3gl/CPAN/perl-current/t/porting/known_pod_issues.dat
#    and find the entry for the module's file and specific error message,
#    and change the count of known potential problems to -1.
make: *** [makefile:856: test_harness] Error 3

error while running harness target 'test_harness': 2 at /pro/3gl/CPAN/smoke/lib/Test/Smoke/App/RunSmoke.pm line 118.
[2022-05-08 22:40:20+0200] 
[2022-05-08 22:40:20+0200] ../t/porting/regen.t........................................FAILED
[2022-05-08 22:40:20+0200]     22
[2022-05-08 22:40:20+0200] ../t/porting/regen.t........................................FAILED
[2022-05-08 22:40:20+0200]     Non-zero exit status: 22
[2022-05-08 22:40:20+0200] ../t/porting/regen.t........................................FAILED
[2022-05-08 22:40:20+0200]     Bad plan.  You planned 42 tests but ran 22.
[2022-05-08 22:40:20+0200] ../t/porting/podcheck.t.....................................FAILED
[2022-05-08 22:40:20+0200]     193-194
[2022-05-08 22:40:20+0200] Archived results...
[2022-05-08 22:40:20+0200] TSTENV = perlio	
#   "Pod NAME already used" 
#     'pod/perlguts.pod-new' also has NAME 'perlguts' near line ??? of pod/perlguts.pod
# See end of this test output for your options on silencing this
#   "? Should you be using L<...> instead of" 
#     C<av_shift> near line 475 of pod/perlguts.pod-new
#   "Pod NAME already used" 
#     'pod/perlguts.pod' also has NAME 'perlguts' near line ??? of pod/perlguts.pod-new
# See end of this test output for your options on silencing this
# 
# HOW TO GET porting/podcheck.t TO PASS
# 
# There were 2 files that had new potential problems identified.
# Some of them may be real, and some of them may be false positives because
# this program isn't as smart as it likes to think it is.  You can teach this
# program to ignore the issues it has identified, and hence pass, by doing the
# following:
# 
# 1) If a problem is about a link to an unknown module or man page that
#    you know exists, re-run the command something like:
#       ./perl -I../lib porting/podcheck.t --add-link MODULE man_page ...
#    (MODULEs should look like Foo::Bar, and man_pages should look like
#    bar(3c); don't do this for a module or man page that you aren't sure
#    about; instead treat as another type of issue and follow the
#    instructions below.)
# 
# 2) For other issues, decide if each should be fixed now or not.  Fix the
#    ones you decided to, and rerun this test to verify that the fixes
#    worked.
# 
# 3) If there remain false positive or problems that you don't plan to fix right
#    now,
#    run this test script by hand, using the following formula (on
#    Un*x-like machines):
#         cd t
#         ./perl -I../lib porting/podcheck.t --regen
# 
#    That should cause all current potential problems to be accepted by
#    the program, so that the next time it runs, they won't be flagged.
#    For a few files, such as perltoc, certain issues will always be
#    expected, and more of the same will be added over time.  For those,
#    before you do the regen, you can edit
#    /pro/3gl/CPAN/perl-current/t/porting/known_pod_issues.dat
#    and find the entry for the module's file and specific error message,
#    and change the count of known potential problems to -1.
'pod/perlguts.pod-new' and 'pod/perlguts.pod' differ
/pro/3gl/CPAN/perl-current/perl -I. regen/mg_vtable.pl --tap failed: 65280 at regen.pl line 20, <DATA> line 8.
    Hint:  A failure in this file can often be corrected by running:
     ./perl -Ilib regen.pl
Subroutine Time::HiRes::constant redefined at (eval 37) line 1.
Subroutine Time::HiRes::usleep redefined at (eval 37) line 1.
Subroutine Time::HiRes::nanosleep redefined at (eval 37) line 1.
Subroutine Time::HiRes::sleep redefined at (eval 37) line 1.
Subroutine Time::HiRes::ualarm redefined at (eval 37) line 1.
Subroutine Time::HiRes::alarm redefined at (eval 37) line 1.
Subroutine Time::HiRes::gettimeofday redefined at (eval 37) line 1.
Subroutine Time::HiRes::time redefined at (eval 37) line 1.
Subroutine Time::HiRes::setitimer redefined at (eval 37) line 1.
Subroutine Time::HiRes::getitimer redefined at (eval 37) line 1.
Subroutine Time::HiRes::utime redefined at (eval 37) line 1.
Subroutine Time::HiRes::clock_gettime redefined at (eval 37) line 1.
Subroutine Time::HiRes::clock_getres redefined at (eval 37) line 1.
Subroutine Time::HiRes::clock_nanosleep redefined at (eval 37) line 1.
Subroutine Time::HiRes::clock redefined at (eval 37) line 1.
Subroutine Time::HiRes::lstat redefined at (eval 37) line 1.
Subroutine Time::HiRes::stat redefined at (eval 37) line 1.
make: *** [makefile:856: test_harness] Error 3

error while running harness target 'test_harness': 2 at /pro/3gl/CPAN/smoke/lib/Test/Smoke/App/RunSmoke.pm line 118.
[2022-05-08 22:44:22+0200] 
[2022-05-08 22:44:22+0200] ../t/porting/podcheck.t.....................................FAILED
[2022-05-08 22:44:22+0200]     193-194
[2022-05-08 22:44:22+0200] ../t/porting/regen.t........................................FAILED
[2022-05-08 22:44:22+0200]     22
[2022-05-08 22:44:22+0200] ../t/porting/regen.t........................................FAILED
[2022-05-08 22:44:22+0200]     Non-zero exit status: 255
[2022-05-08 22:44:22+0200] ../t/porting/regen.t........................................FAILED
[2022-05-08 22:44:22+0200]     Bad plan.  You planned 42 tests but ran 22.
[2022-05-08 22:44:22+0200] Archived results...
[2022-05-08 22:44:22+0200] TSTENV = locale:en_US.utf8	
#   "Pod NAME already used" 
#     'pod/perlguts.pod-new' also has NAME 'perlguts' near line ??? of pod/perlguts.pod
# See end of this test output for your options on silencing this
#   "? Should you be using L<...> instead of" 
#     C<av_shift> near line 475 of pod/perlguts.pod-new
#   "Pod NAME already used" 
#     'pod/perlguts.pod' also has NAME 'perlguts' near line ??? of pod/perlguts.pod-new
# See end of this test output for your options on silencing this
# 
# HOW TO GET porting/podcheck.t TO PASS
# 
# There were 2 files that had new potential problems identified.
# Some of them may be real, and some of them may be false positives because
# this program isn't as smart as it likes to think it is.  You can teach this
# program to ignore the issues it has identified, and hence pass, by doing the
# following:
# 
# 1) If a problem is about a link to an unknown module or man page that
#    you know exists, re-run the command something like:
#       ./perl -I../lib porting/podcheck.t --add-link MODULE man_page ...
#    (MODULEs should look like Foo::Bar, and man_pages should look like
#    bar(3c); don't do this for a module or man page that you aren't sure
#    about; instead treat as another type of issue and follow the
#    instructions below.)
# 
# 2) For other issues, decide if each should be fixed now or not.  Fix the
#    ones you decided to, and rerun this test to verify that the fixes
#    worked.
# 
# 3) If there remain false positive or problems that you don't plan to fix right
#    now,
#    run this test script by hand, using the following formula (on
#    Un*x-like machines):
#         cd t
#         ./perl -I../lib porting/podcheck.t --regen
# 
#    That should cause all current potential problems to be accepted by
#    the program, so that the next time it runs, they won't be flagged.
#    For a few files, such as perltoc, certain issues will always be
#    expected, and more of the same will be added over time.  For those,
#    before you do the regen, you can edit
#    /pro/3gl/CPAN/perl-current/t/porting/known_pod_issues.dat
#    and find the entry for the module's file and specific error message,
#    and change the count of known potential problems to -1.
'pod/perlguts.pod-new' and 'pod/perlguts.pod' differ
/pro/3gl/CPAN/perl-current/perl -I. regen/mg_vtable.pl --tap failed: 65280 at regen.pl line 20, <DATA> line 8.
    Hint:  A failure in this file can often be corrected by running:
     ./perl -Ilib regen.pl
Subroutine Time::HiRes::constant redefined at (eval 37) line 1.
Subroutine Time::HiRes::usleep redefined at (eval 37) line 1.
Subroutine Time::HiRes::nanosleep redefined at (eval 37) line 1.
Subroutine Time::HiRes::sleep redefined at (eval 37) line 1.
Subroutine Time::HiRes::ualarm redefined at (eval 37) line 1.
Subroutine Time::HiRes::alarm redefined at (eval 37) line 1.
Subroutine Time::HiRes::gettimeofday redefined at (eval 37) line 1.
Subroutine Time::HiRes::time redefined at (eval 37) line 1.
Subroutine Time::HiRes::setitimer redefined at (eval 37) line 1.
Subroutine Time::HiRes::getitimer redefined at (eval 37) line 1.
Subroutine Time::HiRes::utime redefined at (eval 37) line 1.
Subroutine Time::HiRes::clock_gettime redefined at (eval 37) line 1.
Subroutine Time::HiRes::clock_getres redefined at (eval 37) line 1.
Subroutine Time::HiRes::clock_nanosleep redefined at (eval 37) line 1.
Subroutine Time::HiRes::clock redefined at (eval 37) line 1.
Subroutine Time::HiRes::lstat redefined at (eval 37) line 1.
Subroutine Time::HiRes::stat redefined at (eval 37) line 1.
make: *** [makefile:856: test_harness] Error 3

error while running harness target 'test_harness': 2 at /pro/3gl/CPAN/smoke/lib/Test/Smoke/App/RunSmoke.pm line 118.
[2022-05-08 22:48:14+0200] 
[2022-05-08 22:48:14+0200] ../t/porting/podcheck.t.....................................FAILED
[2022-05-08 22:48:14+0200]     193-194
[2022-05-08 22:48:14+0200] ../t/porting/regen.t........................................FAILED
[2022-05-08 22:48:14+0200]     22
[2022-05-08 22:48:14+0200] ../t/porting/regen.t........................................FAILED
[2022-05-08 22:48:14+0200]     Non-zero exit status: 255
[2022-05-08 22:48:14+0200] ../t/porting/regen.t........................................FAILED
[2022-05-08 22:48:14+0200]     Bad plan.  You planned 42 tests but ran 22.
[2022-05-08 22:48:14+0200] Archived results...
Cannot open(/pro/3gl/CPAN/smoke/p59.skip): No such file or directory at /pro/3gl/CPAN/smoke/lib/Test/Smoke/App/RunSmoke.pm line 118.
[2022-05-08 22:48:14+0200] 
[2022-05-08 22:48:14+0200] Configuration: -Dusedevel -Duse64bitall
[2022-05-08 22:48:14+0200] ------------------------------------------------------------------------------
[2022-05-08 22:48:14+0200] make distclean ...
[2022-05-08 22:48:34+0200] 
[2022-05-08 22:48:34+0200] Copy Policy.sh ...
[2022-05-08 22:48:34+0200] 
[2022-05-08 22:48:34+0200] Configure ...
[2022-05-08 22:49:45+0200] 
[2022-05-08 22:49:45+0200] make ...
Cannot open(/pro/3gl/CPAN/smoke/p59.skip): No such file or directory at /pro/3gl/CPAN/smoke/lib/Test/Smoke/App/RunSmoke.pm line 118.
[2022-05-08 22:50:52+0200] 
[2022-05-08 22:50:52+0200]  Tests start here:
[2022-05-08 22:50:52+0200] TSTENV = stdio	
No saved state, selection will be empty
Subroutine Time::HiRes::constant redefined at (eval 37) line 1.
Subroutine Time::HiRes::usleep redefined at (eval 37) line 1.
Subroutine Time::HiRes::nanosleep redefined at (eval 37) line 1.
Subroutine Time::HiRes::sleep redefined at (eval 37) line 1.
Subroutine Time::HiRes::ualarm redefined at (eval 37) line 1.
Subroutine Time::HiRes::alarm redefined at (eval 37) line 1.
Subroutine Time::HiRes::gettimeofday redefined at (eval 37) line 1.
Subroutine Time::HiRes::time redefined at (eval 37) line 1.
Subroutine Time::HiRes::setitimer redefined at (eval 37) line 1.
Subroutine Time::HiRes::getitimer redefined at (eval 37) line 1.
Subroutine Time::HiRes::utime redefined at (eval 37) line 1.
Subroutine Time::HiRes::clock_gettime redefined at (eval 37) line 1.
Subroutine Time::HiRes::clock_getres redefined at (eval 37) line 1.
Subroutine Time::HiRes::clock_nanosleep redefined at (eval 37) line 1.
Subroutine Time::HiRes::clock redefined at (eval 37) line 1.
Subroutine Time::HiRes::lstat redefined at (eval 37) line 1.
Subroutine Time::HiRes::stat redefined at (eval 37) line 1.
No such file or directory
No such file or directory
No such file or directory
No such file or directory
No such file or directory
'pod/perlguts.pod-new' and 'pod/perlguts.pod' differ
/pro/3gl/CPAN/perl-current/perl -I. regen/mg_vtable.pl --tap failed: 512 at regen.pl line 20, <DATA> line 8.
    Hint:  A failure in this file can often be corrected by running:
     ./perl -Ilib regen.pl
No such file or directory
No such file or directory
#   "Pod NAME already used" 
#     'pod/perlguts.pod-new' also has NAME 'perlguts' near line ??? of pod/perlguts.pod
# See end of this test output for your options on silencing this
#   "? Should you be using L<...> instead of" 
#     C<av_shift> near line 475 of pod/perlguts.pod-new
#   "Pod NAME already used" 
#     'pod/perlguts.pod' also has NAME 'perlguts' near line ??? of pod/perlguts.pod-new
# See end of this test output for your options on silencing this
# 
# HOW TO GET porting/podcheck.t TO PASS
# 
# There were 2 files that had new potential problems identified.
# Some of them may be real, and some of them may be false positives because
# this program isn't as smart as it likes to think it is.  You can teach this
# program to ignore the issues it has identified, and hence pass, by doing the
# following:
# 
# 1) If a problem is about a link to an unknown module or man page that
#    you know exists, re-run the command something like:
#       ./perl -I../lib porting/podcheck.t --add-link MODULE man_page ...
#    (MODULEs should look like Foo::Bar, and man_pages should look like
#    bar(3c); don't do this for a module or man page that you aren't sure
#    about; instead treat as another type of issue and follow the
#    instructions below.)
# 
# 2) For other issues, decide if each should be fixed now or not.  Fix the
#    ones you decided to, and rerun this test to verify that the fixes
#    worked.
# 
# 3) If there remain false positive or problems that you don't plan to fix right
#    now,
#    run this test script by hand, using the following formula (on
#    Un*x-like machines):
#         cd t
#         ./perl -I../lib porting/podcheck.t --regen
# 
#    That should cause all current potential problems to be accepted by
#    the program, so that the next time it runs, they won't be flagged.
#    For a few files, such as perltoc, certain issues will always be
#    expected, and more of the same will be added over time.  For those,
#    before you do the regen, you can edit
#    /pro/3gl/CPAN/perl-current/t/porting/known_pod_issues.dat
#    and find the entry for the module's file and specific error message,
#    and change the count of known potential problems to -1.
make: *** [makefile:856: test_harness] Error 3

error while running harness target 'test_harness': 2 at /pro/3gl/CPAN/smoke/lib/Test/Smoke/App/RunSmoke.pm line 118.
[2022-05-08 22:54:30+0200] 
[2022-05-08 22:54:30+0200] ../t/porting/regen.t........................................FAILED
[2022-05-08 22:54:30+0200]     22
[2022-05-08 22:54:30+0200] ../t/porting/regen.t........................................FAILED
[2022-05-08 22:54:30+0200]     Non-zero exit status: 22
[2022-05-08 22:54:30+0200] ../t/porting/regen.t........................................FAILED
[2022-05-08 22:54:30+0200]     Bad plan.  You planned 42 tests but ran 22.
[2022-05-08 22:54:30+0200] ../t/porting/podcheck.t.....................................FAILED
[2022-05-08 22:54:30+0200]     193-194
[2022-05-08 22:54:30+0200] Archived results...
[2022-05-08 22:54:30+0200] TSTENV = perlio	
#   "Pod NAME already used" 
#     'pod/perlguts.pod-new' also has NAME 'perlguts' near line ??? of pod/perlguts.pod
# See end of this test output for your options on silencing this
#   "? Should you be using L<...> instead of" 
#     C<av_shift> near line 475 of pod/perlguts.pod-new
#   "Pod NAME already used" 
#     'pod/perlguts.pod' also has NAME 'perlguts' near line ??? of pod/perlguts.pod-new
# See end of this test output for your options on silencing this
# 
# HOW TO GET porting/podcheck.t TO PASS
# 
# There were 2 files that had new potential problems identified.
# Some of them may be real, and some of them may be false positives because
# this program isn't as smart as it likes to think it is.  You can teach this
# program to ignore the issues it has identified, and hence pass, by doing the
# following:
# 
# 1) If a problem is about a link to an unknown module or man page that
#    you know exists, re-run the command something like:
#       ./perl -I../lib porting/podcheck.t --add-link MODULE man_page ...
#    (MODULEs should look like Foo::Bar, and man_pages should look like
#    bar(3c); don't do this for a module or man page that you aren't sure
#    about; instead treat as another type of issue and follow the
#    instructions below.)
# 
# 2) For other issues, decide if each should be fixed now or not.  Fix the
#    ones you decided to, and rerun this test to verify that the fixes
#    worked.
# 
# 3) If there remain false positive or problems that you don't plan to fix right
#    now,
#    run this test script by hand, using the following formula (on
#    Un*x-like machines):
#         cd t
#         ./perl -I../lib porting/podcheck.t --regen
# 
#    That should cause all current potential problems to be accepted by
#    the program, so that the next time it runs, they won't be flagged.
#    For a few files, such as perltoc, certain issues will always be
#    expected, and more of the same will be added over time.  For those,
#    before you do the regen, you can edit
#    /pro/3gl/CPAN/perl-current/t/porting/known_pod_issues.dat
#    and find the entry for the module's file and specific error message,
#    and change the count of known potential problems to -1.
'pod/perlguts.pod-new' and 'pod/perlguts.pod' differ
/pro/3gl/CPAN/perl-current/perl -I. regen/mg_vtable.pl --tap failed: 65280 at regen.pl line 20, <DATA> line 8.
    Hint:  A failure in this file can often be corrected by running:
     ./perl -Ilib regen.pl
Subroutine Time::HiRes::constant redefined at (eval 37) line 1.
Subroutine Time::HiRes::usleep redefined at (eval 37) line 1.
Subroutine Time::HiRes::nanosleep redefined at (eval 37) line 1.
Subroutine Time::HiRes::sleep redefined at (eval 37) line 1.
Subroutine Time::HiRes::ualarm redefined at (eval 37) line 1.
Subroutine Time::HiRes::alarm redefined at (eval 37) line 1.
Subroutine Time::HiRes::gettimeofday redefined at (eval 37) line 1.
Subroutine Time::HiRes::time redefined at (eval 37) line 1.
Subroutine Time::HiRes::setitimer redefined at (eval 37) line 1.
Subroutine Time::HiRes::getitimer redefined at (eval 37) line 1.
Subroutine Time::HiRes::utime redefined at (eval 37) line 1.
Subroutine Time::HiRes::clock_gettime redefined at (eval 37) line 1.
Subroutine Time::HiRes::clock_getres redefined at (eval 37) line 1.
Subroutine Time::HiRes::clock_nanosleep redefined at (eval 37) line 1.
Subroutine Time::HiRes::clock redefined at (eval 37) line 1.
Subroutine Time::HiRes::lstat redefined at (eval 37) line 1.
Subroutine Time::HiRes::stat redefined at (eval 37) line 1.
make: *** [makefile:856: test_harness] Error 3

error while running harness target 'test_harness': 2 at /pro/3gl/CPAN/smoke/lib/Test/Smoke/App/RunSmoke.pm line 118.
[2022-05-08 22:57:53+0200] 
[2022-05-08 22:57:53+0200] ../t/porting/podcheck.t.....................................FAILED
[2022-05-08 22:57:53+0200]     193-194
[2022-05-08 22:57:53+0200] ../t/porting/regen.t........................................FAILED
[2022-05-08 22:57:53+0200]     22
[2022-05-08 22:57:53+0200] ../t/porting/regen.t........................................FAILED
[2022-05-08 22:57:53+0200]     Non-zero exit status: 255
[2022-05-08 22:57:53+0200] ../t/porting/regen.t........................................FAILED
[2022-05-08 22:57:53+0200]     Bad plan.  You planned 42 tests but ran 22.
[2022-05-08 22:57:53+0200] Archived results...
[2022-05-08 22:57:53+0200] TSTENV = locale:en_US.utf8	
#   "Pod NAME already used" 
#     'pod/perlguts.pod-new' also has NAME 'perlguts' near line ??? of pod/perlguts.pod
# See end of this test output for your options on silencing this
#   "? Should you be using L<...> instead of" 
#     C<av_shift> near line 475 of pod/perlguts.pod-new
#   "Pod NAME already used" 
#     'pod/perlguts.pod' also has NAME 'perlguts' near line ??? of pod/perlguts.pod-new
# See end of this test output for your options on silencing this
# 
# HOW TO GET porting/podcheck.t TO PASS
# 
# There were 2 files that had new potential problems identified.
# Some of them may be real, and some of them may be false positives because
# this program isn't as smart as it likes to think it is.  You can teach this
# program to ignore the issues it has identified, and hence pass, by doing the
# following:
# 
# 1) If a problem is about a link to an unknown module or man page that
#    you know exists, re-run the command something like:
#       ./perl -I../lib porting/podcheck.t --add-link MODULE man_page ...
#    (MODULEs should look like Foo::Bar, and man_pages should look like
#    bar(3c); don't do this for a module or man page that you aren't sure
#    about; instead treat as another type of issue and follow the
#    instructions below.)
# 
# 2) For other issues, decide if each should be fixed now or not.  Fix the
#    ones you decided to, and rerun this test to verify that the fixes
#    worked.
# 
# 3) If there remain false positive or problems that you don't plan to fix right
#    now,
#    run this test script by hand, using the following formula (on
#    Un*x-like machines):
#         cd t
#         ./perl -I../lib porting/podcheck.t --regen
# 
#    That should cause all current potential problems to be accepted by
#    the program, so that the next time it runs, they won't be flagged.
#    For a few files, such as perltoc, certain issues will always be
#    expected, and more of the same will be added over time.  For those,
#    before you do the regen, you can edit
#    /pro/3gl/CPAN/perl-current/t/porting/known_pod_issues.dat
#    and find the entry for the module's file and specific error message,
#    and change the count of known potential problems to -1.
'pod/perlguts.pod-new' and 'pod/perlguts.pod' differ
/pro/3gl/CPAN/perl-current/perl -I. regen/mg_vtable.pl --tap failed: 65280 at regen.pl line 20, <DATA> line 8.
    Hint:  A failure in this file can often be corrected by running:
     ./perl -Ilib regen.pl
Subroutine Time::HiRes::constant redefined at (eval 37) line 1.
Subroutine Time::HiRes::usleep redefined at (eval 37) line 1.
Subroutine Time::HiRes::nanosleep redefined at (eval 37) line 1.
Subroutine Time::HiRes::sleep redefined at (eval 37) line 1.
Subroutine Time::HiRes::ualarm redefined at (eval 37) line 1.
Subroutine Time::HiRes::alarm redefined at (eval 37) line 1.
Subroutine Time::HiRes::gettimeofday redefined at (eval 37) line 1.
Subroutine Time::HiRes::time redefined at (eval 37) line 1.
Subroutine Time::HiRes::setitimer redefined at (eval 37) line 1.
Subroutine Time::HiRes::getitimer redefined at (eval 37) line 1.
Subroutine Time::HiRes::utime redefined at (eval 37) line 1.
Subroutine Time::HiRes::clock_gettime redefined at (eval 37) line 1.
Subroutine Time::HiRes::clock_getres redefined at (eval 37) line 1.
Subroutine Time::HiRes::clock_nanosleep redefined at (eval 37) line 1.
Subroutine Time::HiRes::clock redefined at (eval 37) line 1.
Subroutine Time::HiRes::lstat redefined at (eval 37) line 1.
Subroutine Time::HiRes::stat redefined at (eval 37) line 1.
make: *** [makefile:856: test_harness] Error 3

error while running harness target 'test_harness': 2 at /pro/3gl/CPAN/smoke/lib/Test/Smoke/App/RunSmoke.pm line 118.
[2022-05-08 23:01:13+0200] 
[2022-05-08 23:01:13+0200] ../t/porting/podcheck.t.....................................FAILED
[2022-05-08 23:01:13+0200]     193-194
[2022-05-08 23:01:13+0200] ../t/porting/regen.t........................................FAILED
[2022-05-08 23:01:13+0200]     22
[2022-05-08 23:01:13+0200] ../t/porting/regen.t........................................FAILED
[2022-05-08 23:01:13+0200]     Non-zero exit status: 255
[2022-05-08 23:01:13+0200] ../t/porting/regen.t........................................FAILED
[2022-05-08 23:01:13+0200]     Bad plan.  You planned 42 tests but ran 22.
[2022-05-08 23:01:13+0200] Archived results...
Cannot open(/pro/3gl/CPAN/smoke/p59.skip): No such file or directory at /pro/3gl/CPAN/smoke/lib/Test/Smoke/App/RunSmoke.pm line 118.
[2022-05-08 23:01:13+0200] 
[2022-05-08 23:01:13+0200] Configuration: -Dusedevel -Duse64bitall -DDEBUGGING
[2022-05-08 23:01:13+0200] ------------------------------------------------------------------------------
[2022-05-08 23:01:13+0200] make distclean ...
[2022-05-08 23:01:29+0200] 
[2022-05-08 23:01:29+0200] Copy Policy.sh ...
[2022-05-08 23:01:29+0200] 
[2022-05-08 23:01:29+0200] Configure ...
[2022-05-08 23:02:42+0200] 
[2022-05-08 23:02:42+0200] make ...
Cannot open(/pro/3gl/CPAN/smoke/p59.skip): No such file or directory at /pro/3gl/CPAN/smoke/lib/Test/Smoke/App/RunSmoke.pm line 118.
[2022-05-08 23:04:19+0200] 
[2022-05-08 23:04:19+0200]  Tests start here:
[2022-05-08 23:04:19+0200] TSTENV = stdio	
No saved state, selection will be empty
Subroutine Time::HiRes::constant redefined at (eval 37) line 1.
Subroutine Time::HiRes::usleep redefined at (eval 37) line 1.
Subroutine Time::HiRes::nanosleep redefined at (eval 37) line 1.
Subroutine Time::HiRes::sleep redefined at (eval 37) line 1.
Subroutine Time::HiRes::ualarm redefined at (eval 37) line 1.
Subroutine Time::HiRes::alarm redefined at (eval 37) line 1.
Subroutine Time::HiRes::gettimeofday redefined at (eval 37) line 1.
Subroutine Time::HiRes::time redefined at (eval 37) line 1.
Subroutine Time::HiRes::setitimer redefined at (eval 37) line 1.
Subroutine Time::HiRes::getitimer redefined at (eval 37) line 1.
Subroutine Time::HiRes::utime redefined at (eval 37) line 1.
Subroutine Time::HiRes::clock_gettime redefined at (eval 37) line 1.
Subroutine Time::HiRes::clock_getres redefined at (eval 37) line 1.
Subroutine Time::HiRes::clock_nanosleep redefined at (eval 37) line 1.
Subroutine Time::HiRes::clock redefined at (eval 37) line 1.
Subroutine Time::HiRes::lstat redefined at (eval 37) line 1.
Subroutine Time::HiRes::stat redefined at (eval 37) line 1.
No such file or directory
No such file or directory
No such file or directory
No such file or directory
No such file or directory
No such file or directory
'pod/perlguts.pod-new' and 'pod/perlguts.pod' differ
/pro/3gl/CPAN/perl-current/perl -I. regen/mg_vtable.pl --tap failed: 512 at regen.pl line 20, <DATA> line 8.
    Hint:  A failure in this file can often be corrected by running:
     ./perl -Ilib regen.pl
No such file or directory
#   "Pod NAME already used" 
#     'pod/perlguts.pod-new' also has NAME 'perlguts' near line ??? of pod/perlguts.pod
# See end of this test output for your options on silencing this
#   "? Should you be using L<...> instead of" 
#     C<av_shift> near line 475 of pod/perlguts.pod-new
#   "Pod NAME already used" 
#     'pod/perlguts.pod' also has NAME 'perlguts' near line ??? of pod/perlguts.pod-new
# See end of this test output for your options on silencing this
# 
# HOW TO GET porting/podcheck.t TO PASS
# 
# There were 2 files that had new potential problems identified.
# Some of them may be real, and some of them may be false positives because
# this program isn't as smart as it likes to think it is.  You can teach this
# program to ignore the issues it has identified, and hence pass, by doing the
# following:
# 
# 1) If a problem is about a link to an unknown module or man page that
#    you know exists, re-run the command something like:
#       ./perl -I../lib porting/podcheck.t --add-link MODULE man_page ...
#    (MODULEs should look like Foo::Bar, and man_pages should look like
#    bar(3c); don't do this for a module or man page that you aren't sure
#    about; instead treat as another type of issue and follow the
#    instructions below.)
# 
# 2) For other issues, decide if each should be fixed now or not.  Fix the
#    ones you decided to, and rerun this test to verify that the fixes
#    worked.
# 
# 3) If there remain false positive or problems that you don't plan to fix right
#    now,
#    run this test script by hand, using the following formula (on
#    Un*x-like machines):
#         cd t
#         ./perl -I../lib porting/podcheck.t --regen
# 
#    That should cause all current potential problems to be accepted by
#    the program, so that the next time it runs, they won't be flagged.
#    For a few files, such as perltoc, certain issues will always be
#    expected, and more of the same will be added over time.  For those,
#    before you do the regen, you can edit
#    /pro/3gl/CPAN/perl-current/t/porting/known_pod_issues.dat
#    and find the entry for the module's file and specific error message,
#    and change the count of known potential problems to -1.
make: *** [makefile:856: test_harness] Error 3

error while running harness target 'test_harness': 2 at /pro/3gl/CPAN/smoke/lib/Test/Smoke/App/RunSmoke.pm line 118.
[2022-05-08 23:08:47+0200] 
[2022-05-08 23:08:47+0200] ../t/porting/regen.t........................................FAILED
[2022-05-08 23:08:47+0200]     22
[2022-05-08 23:08:47+0200] ../t/porting/regen.t........................................FAILED
[2022-05-08 23:08:47+0200]     Non-zero exit status: 22
[2022-05-08 23:08:47+0200] ../t/porting/regen.t........................................FAILED
[2022-05-08 23:08:47+0200]     Bad plan.  You planned 42 tests but ran 22.
[2022-05-08 23:08:47+0200] ../t/porting/podcheck.t.....................................FAILED
[2022-05-08 23:08:47+0200]     193-194
[2022-05-08 23:08:47+0200] Archived results...
[2022-05-08 23:08:47+0200] TSTENV = perlio	
#   "Pod NAME already used" 
#     'pod/perlguts.pod-new' also has NAME 'perlguts' near line ??? of pod/perlguts.pod
# See end of this test output for your options on silencing this
#   "? Should you be using L<...> instead of" 
#     C<av_shift> near line 475 of pod/perlguts.pod-new
#   "Pod NAME already used" 
#     'pod/perlguts.pod' also has NAME 'perlguts' near line ??? of pod/perlguts.pod-new
# See end of this test output for your options on silencing this
# 
# HOW TO GET porting/podcheck.t TO PASS
# 
# There were 2 files that had new potential problems identified.
# Some of them may be real, and some of them may be false positives because
# this program isn't as smart as it likes to think it is.  You can teach this
# program to ignore the issues it has identified, and hence pass, by doing the
# following:
# 
# 1) If a problem is about a link to an unknown module or man page that
#    you know exists, re-run the command something like:
#       ./perl -I../lib porting/podcheck.t --add-link MODULE man_page ...
#    (MODULEs should look like Foo::Bar, and man_pages should look like
#    bar(3c); don't do this for a module or man page that you aren't sure
#    about; instead treat as another type of issue and follow the
#    instructions below.)
# 
# 2) For other issues, decide if each should be fixed now or not.  Fix the
#    ones you decided to, and rerun this test to verify that the fixes
#    worked.
# 
# 3) If there remain false positive or problems that you don't plan to fix right
#    now,
#    run this test script by hand, using the following formula (on
#    Un*x-like machines):
#         cd t
#         ./perl -I../lib porting/podcheck.t --regen
# 
#    That should cause all current potential problems to be accepted by
#    the program, so that the next time it runs, they won't be flagged.
#    For a few files, such as perltoc, certain issues will always be
#    expected, and more of the same will be added over time.  For those,
#    before you do the regen, you can edit
#    /pro/3gl/CPAN/perl-current/t/porting/known_pod_issues.dat
#    and find the entry for the module's file and specific error message,
#    and change the count of known potential problems to -1.
'pod/perlguts.pod-new' and 'pod/perlguts.pod' differ
/pro/3gl/CPAN/perl-current/perl -I. regen/mg_vtable.pl --tap failed: 65280 at regen.pl line 20, <DATA> line 8.
    Hint:  A failure in this file can often be corrected by running:
     ./perl -Ilib regen.pl
Subroutine Time::HiRes::constant redefined at (eval 37) line 1.
Subroutine Time::HiRes::usleep redefined at (eval 37) line 1.
Subroutine Time::HiRes::nanosleep redefined at (eval 37) line 1.
Subroutine Time::HiRes::sleep redefined at (eval 37) line 1.
Subroutine Time::HiRes::ualarm redefined at (eval 37) line 1.
Subroutine Time::HiRes::alarm redefined at (eval 37) line 1.
Subroutine Time::HiRes::gettimeofday redefined at (eval 37) line 1.
Subroutine Time::HiRes::time redefined at (eval 37) line 1.
Subroutine Time::HiRes::setitimer redefined at (eval 37) line 1.
Subroutine Time::HiRes::getitimer redefined at (eval 37) line 1.
Subroutine Time::HiRes::utime redefined at (eval 37) line 1.
Subroutine Time::HiRes::clock_gettime redefined at (eval 37) line 1.
Subroutine Time::HiRes::clock_getres redefined at (eval 37) line 1.
Subroutine Time::HiRes::clock_nanosleep redefined at (eval 37) line 1.
Subroutine Time::HiRes::clock redefined at (eval 37) line 1.
Subroutine Time::HiRes::lstat redefined at (eval 37) line 1.
Subroutine Time::HiRes::stat redefined at (eval 37) line 1.
make: *** [makefile:856: test_harness] Error 3

error while running harness target 'test_harness': 2 at /pro/3gl/CPAN/smoke/lib/Test/Smoke/App/RunSmoke.pm line 118.
[2022-05-08 23:12:48+0200] 
[2022-05-08 23:12:48+0200] ../t/porting/podcheck.t.....................................FAILED
[2022-05-08 23:12:48+0200]     193-194
[2022-05-08 23:12:48+0200] ../t/porting/regen.t........................................FAILED
[2022-05-08 23:12:48+0200]     22
[2022-05-08 23:12:48+0200] ../t/porting/regen.t........................................FAILED
[2022-05-08 23:12:48+0200]     Non-zero exit status: 255
[2022-05-08 23:12:48+0200] ../t/porting/regen.t........................................FAILED
[2022-05-08 23:12:48+0200]     Bad plan.  You planned 42 tests but ran 22.
[2022-05-08 23:12:48+0200] Archived results...
[2022-05-08 23:12:48+0200] TSTENV = locale:en_US.utf8	
#   "Pod NAME already used" 
#     'pod/perlguts.pod-new' also has NAME 'perlguts' near line ??? of pod/perlguts.pod
# See end of this test output for your options on silencing this
#   "? Should you be using L<...> instead of" 
#     C<av_shift> near line 475 of pod/perlguts.pod-new
#   "Pod NAME already used" 
#     'pod/perlguts.pod' also has NAME 'perlguts' near line ??? of pod/perlguts.pod-new
# See end of this test output for your options on silencing this
# 
# HOW TO GET porting/podcheck.t TO PASS
# 
# There were 2 files that had new potential problems identified.
# Some of them may be real, and some of them may be false positives because
# this program isn't as smart as it likes to think it is.  You can teach this
# program to ignore the issues it has identified, and hence pass, by doing the
# following:
# 
# 1) If a problem is about a link to an unknown module or man page that
#    you know exists, re-run the command something like:
#       ./perl -I../lib porting/podcheck.t --add-link MODULE man_page ...
#    (MODULEs should look like Foo::Bar, and man_pages should look like
#    bar(3c); don't do this for a module or man page that you aren't sure
#    about; instead treat as another type of issue and follow the
#    instructions below.)
# 
# 2) For other issues, decide if each should be fixed now or not.  Fix the
#    ones you decided to, and rerun this test to verify that the fixes
#    worked.
# 
# 3) If there remain false positive or problems that you don't plan to fix right
#    now,
#    run this test script by hand, using the following formula (on
#    Un*x-like machines):
#         cd t
#         ./perl -I../lib porting/podcheck.t --regen
# 
#    That should cause all current potential problems to be accepted by
#    the program, so that the next time it runs, they won't be flagged.
#    For a few files, such as perltoc, certain issues will always be
#    expected, and more of the same will be added over time.  For those,
#    before you do the regen, you can edit
#    /pro/3gl/CPAN/perl-current/t/porting/known_pod_issues.dat
#    and find the entry for the module's file and specific error message,
#    and change the count of known potential problems to -1.
'pod/perlguts.pod-new' and 'pod/perlguts.pod' differ
/pro/3gl/CPAN/perl-current/perl -I. regen/mg_vtable.pl --tap failed: 65280 at regen.pl line 20, <DATA> line 8.
    Hint:  A failure in this file can often be corrected by running:
     ./perl -Ilib regen.pl
Subroutine Time::HiRes::constant redefined at (eval 37) line 1.
Subroutine Time::HiRes::usleep redefined at (eval 37) line 1.
Subroutine Time::HiRes::nanosleep redefined at (eval 37) line 1.
Subroutine Time::HiRes::sleep redefined at (eval 37) line 1.
Subroutine Time::HiRes::ualarm redefined at (eval 37) line 1.
Subroutine Time::HiRes::alarm redefined at (eval 37) line 1.
Subroutine Time::HiRes::gettimeofday redefined at (eval 37) line 1.
Subroutine Time::HiRes::time redefined at (eval 37) line 1.
Subroutine Time::HiRes::setitimer redefined at (eval 37) line 1.
Subroutine Time::HiRes::getitimer redefined at (eval 37) line 1.
Subroutine Time::HiRes::utime redefined at (eval 37) line 1.
Subroutine Time::HiRes::clock_gettime redefined at (eval 37) line 1.
Subroutine Time::HiRes::clock_getres redefined at (eval 37) line 1.
Subroutine Time::HiRes::clock_nanosleep redefined at (eval 37) line 1.
Subroutine Time::HiRes::clock redefined at (eval 37) line 1.
Subroutine Time::HiRes::lstat redefined at (eval 37) line 1.
Subroutine Time::HiRes::stat redefined at (eval 37) line 1.
make: *** [makefile:856: test_harness] Error 3

error while running harness target 'test_harness': 2 at /pro/3gl/CPAN/smoke/lib/Test/Smoke/App/RunSmoke.pm line 118.
[2022-05-08 23:16:42+0200] 
[2022-05-08 23:16:42+0200] ../t/porting/podcheck.t.....................................FAILED
[2022-05-08 23:16:42+0200]     193-194
[2022-05-08 23:16:42+0200] ../t/porting/regen.t........................................FAILED
[2022-05-08 23:16:42+0200]     22
[2022-05-08 23:16:42+0200] ../t/porting/regen.t........................................FAILED
[2022-05-08 23:16:42+0200]     Non-zero exit status: 255
[2022-05-08 23:16:42+0200] ../t/porting/regen.t........................................FAILED
[2022-05-08 23:16:42+0200]     Bad plan.  You planned 42 tests but ran 22.
[2022-05-08 23:16:42+0200] Archived results...
Cannot open(/pro/3gl/CPAN/smoke/p59.skip): No such file or directory at /pro/3gl/CPAN/smoke/lib/Test/Smoke/App/RunSmoke.pm line 118.
[2022-05-08 23:16:42+0200] 
[2022-05-08 23:16:42+0200] Configuration: -Dusedevel -Duseithreads -Duselongdouble
[2022-05-08 23:16:42+0200] ------------------------------------------------------------------------------
[2022-05-08 23:16:42+0200] make distclean ...
[2022-05-08 23:17:02+0200] 
[2022-05-08 23:17:02+0200] Copy Policy.sh ...
[2022-05-08 23:17:02+0200] 
[2022-05-08 23:17:02+0200] Configure ...
[2022-05-08 23:18:19+0200] 
[2022-05-08 23:18:19+0200] make ...
Cannot open(/pro/3gl/CPAN/smoke/p59.skip): No such file or directory at /pro/3gl/CPAN/smoke/lib/Test/Smoke/App/RunSmoke.pm line 118.
[2022-05-08 23:19:27+0200] 
[2022-05-08 23:19:27+0200]  Tests start here:
[2022-05-08 23:19:27+0200] TSTENV = stdio	
No saved state, selection will be empty
Subroutine Time::HiRes::constant redefined at (eval 37) line 1.
Subroutine Time::HiRes::usleep redefined at (eval 37) line 1.
Subroutine Time::HiRes::nanosleep redefined at (eval 37) line 1.
Subroutine Time::HiRes::sleep redefined at (eval 37) line 1.
Subroutine Time::HiRes::ualarm redefined at (eval 37) line 1.
Subroutine Time::HiRes::alarm redefined at (eval 37) line 1.
Subroutine Time::HiRes::gettimeofday redefined at (eval 37) line 1.
Subroutine Time::HiRes::time redefined at (eval 37) line 1.
Subroutine Time::HiRes::setitimer redefined at (eval 37) line 1.
Subroutine Time::HiRes::getitimer redefined at (eval 37) line 1.
Subroutine Time::HiRes::utime redefined at (eval 37) line 1.
Subroutine Time::HiRes::clock_gettime redefined at (eval 37) line 1.
Subroutine Time::HiRes::clock_getres redefined at (eval 37) line 1.
Subroutine Time::HiRes::clock_nanosleep redefined at (eval 37) line 1.
Subroutine Time::HiRes::clock redefined at (eval 37) line 1.
Subroutine Time::HiRes::lstat redefined at (eval 37) line 1.
Subroutine Time::HiRes::stat redefined at (eval 37) line 1.
No such file or directory
No such file or directory
No such file or directory
No such file or directory
No such file or directory
No such file or directory
No such file or directory
'pod/perlguts.pod-new' and 'pod/perlguts.pod' differ
/pro/3gl/CPAN/perl-current/perl -I. regen/mg_vtable.pl --tap failed: 512 at regen.pl line 20, <DATA> line 8.
    Hint:  A failure in this file can often be corrected by running:
     ./perl -Ilib regen.pl
#   "Pod NAME already used" 
#     'pod/perlguts.pod-new' also has NAME 'perlguts' near line ??? of pod/perlguts.pod
# See end of this test output for your options on silencing this
#   "? Should you be using L<...> instead of" 
#     C<av_shift> near line 475 of pod/perlguts.pod-new
#   "Pod NAME already used" 
#     'pod/perlguts.pod' also has NAME 'perlguts' near line ??? of pod/perlguts.pod-new
# See end of this test output for your options on silencing this
# 
# HOW TO GET porting/podcheck.t TO PASS
# 
# There were 2 files that had new potential problems identified.
# Some of them may be real, and some of them may be false positives because
# this program isn't as smart as it likes to think it is.  You can teach this
# program to ignore the issues it has identified, and hence pass, by doing the
# following:
# 
# 1) If a problem is about a link to an unknown module or man page that
#    you know exists, re-run the command something like:
#       ./perl -I../lib porting/podcheck.t --add-link MODULE man_page ...
#    (MODULEs should look like Foo::Bar, and man_pages should look like
#    bar(3c); don't do this for a module or man page that you aren't sure
#    about; instead treat as another type of issue and follow the
#    instructions below.)
# 
# 2) For other issues, decide if each should be fixed now or not.  Fix the
#    ones you decided to, and rerun this test to verify that the fixes
#    worked.
# 
# 3) If there remain false positive or problems that you don't plan to fix right
#    now,
#    run this test script by hand, using the following formula (on
#    Un*x-like machines):
#         cd t
#         ./perl -I../lib porting/podcheck.t --regen
# 
#    That should cause all current potential problems to be accepted by
#    the program, so that the next time it runs, they won't be flagged.
#    For a few files, such as perltoc, certain issues will always be
#    expected, and more of the same will be added over time.  For those,
#    before you do the regen, you can edit
#    /pro/3gl/CPAN/perl-current/t/porting/known_pod_issues.dat
#    and find the entry for the module's file and specific error message,
#    and change the count of known potential problems to -1.
make: *** [makefile:856: test_harness] Error 3

error while running harness target 'test_harness': 2 at /pro/3gl/CPAN/smoke/lib/Test/Smoke/App/RunSmoke.pm line 118.
[2022-05-08 23:23:09+0200] 
[2022-05-08 23:23:09+0200] ../t/porting/regen.t........................................FAILED
[2022-05-08 23:23:09+0200]     22
[2022-05-08 23:23:09+0200] ../t/porting/regen.t........................................FAILED
[2022-05-08 23:23:09+0200]     Non-zero exit status: 22
[2022-05-08 23:23:09+0200] ../t/porting/regen.t........................................FAILED
[2022-05-08 23:23:09+0200]     Bad plan.  You planned 42 tests but ran 22.
[2022-05-08 23:23:09+0200] ../t/porting/podcheck.t.....................................FAILED
[2022-05-08 23:23:09+0200]     193-194
[2022-05-08 23:23:09+0200] Archived results...
[2022-05-08 23:23:09+0200] TSTENV = perlio	
#   "Pod NAME already used" 
#     'pod/perlguts.pod-new' also has NAME 'perlguts' near line ??? of pod/perlguts.pod
# See end of this test output for your options on silencing this
#   "? Should you be using L<...> instead of" 
#     C<av_shift> near line 475 of pod/perlguts.pod-new
#   "Pod NAME already used" 
#     'pod/perlguts.pod' also has NAME 'perlguts' near line ??? of pod/perlguts.pod-new
# See end of this test output for your options on silencing this
# 
# HOW TO GET porting/podcheck.t TO PASS
# 
# There were 2 files that had new potential problems identified.
# Some of them may be real, and some of them may be false positives because
# this program isn't as smart as it likes to think it is.  You can teach this
# program to ignore the issues it has identified, and hence pass, by doing the
# following:
# 
# 1) If a problem is about a link to an unknown module or man page that
#    you know exists, re-run the command something like:
#       ./perl -I../lib porting/podcheck.t --add-link MODULE man_page ...
#    (MODULEs should look like Foo::Bar, and man_pages should look like
#    bar(3c); don't do this for a module or man page that you aren't sure
#    about; instead treat as another type of issue and follow the
#    instructions below.)
# 
# 2) For other issues, decide if each should be fixed now or not.  Fix the
#    ones you decided to, and rerun this test to verify that the fixes
#    worked.
# 
# 3) If there remain false positive or problems that you don't plan to fix right
#    now,
#    run this test script by hand, using the following formula (on
#    Un*x-like machines):
#         cd t
#         ./perl -I../lib porting/podcheck.t --regen
# 
#    That should cause all current potential problems to be accepted by
#    the program, so that the next time it runs, they won't be flagged.
#    For a few files, such as perltoc, certain issues will always be
#    expected, and more of the same will be added over time.  For those,
#    before you do the regen, you can edit
#    /pro/3gl/CPAN/perl-current/t/porting/known_pod_issues.dat
#    and find the entry for the module's file and specific error message,
#    and change the count of known potential problems to -1.
'pod/perlguts.pod-new' and 'pod/perlguts.pod' differ
/pro/3gl/CPAN/perl-current/perl -I. regen/mg_vtable.pl --tap failed: 65280 at regen.pl line 20, <DATA> line 8.
    Hint:  A failure in this file can often be corrected by running:
     ./perl -Ilib regen.pl
Subroutine Time::HiRes::constant redefined at (eval 37) line 1.
Subroutine Time::HiRes::usleep redefined at (eval 37) line 1.
Subroutine Time::HiRes::nanosleep redefined at (eval 37) line 1.
Subroutine Time::HiRes::sleep redefined at (eval 37) line 1.
Subroutine Time::HiRes::ualarm redefined at (eval 37) line 1.
Subroutine Time::HiRes::alarm redefined at (eval 37) line 1.
Subroutine Time::HiRes::gettimeofday redefined at (eval 37) line 1.
Subroutine Time::HiRes::time redefined at (eval 37) line 1.
Subroutine Time::HiRes::setitimer redefined at (eval 37) line 1.
Subroutine Time::HiRes::getitimer redefined at (eval 37) line 1.
Subroutine Time::HiRes::utime redefined at (eval 37) line 1.
Subroutine Time::HiRes::clock_gettime redefined at (eval 37) line 1.
Subroutine Time::HiRes::clock_getres redefined at (eval 37) line 1.
Subroutine Time::HiRes::clock_nanosleep redefined at (eval 37) line 1.
Subroutine Time::HiRes::clock redefined at (eval 37) line 1.
Subroutine Time::HiRes::lstat redefined at (eval 37) line 1.
Subroutine Time::HiRes::stat redefined at (eval 37) line 1.
make: *** [makefile:856: test_harness] Error 3

error while running harness target 'test_harness': 2 at /pro/3gl/CPAN/smoke/lib/Test/Smoke/App/RunSmoke.pm line 118.
[2022-05-08 23:26:42+0200] 
[2022-05-08 23:26:42+0200] ../t/porting/podcheck.t.....................................FAILED
[2022-05-08 23:26:42+0200]     193-194
[2022-05-08 23:26:42+0200] ../t/porting/regen.t........................................FAILED
[2022-05-08 23:26:42+0200]     22
[2022-05-08 23:26:42+0200] ../t/porting/regen.t........................................FAILED
[2022-05-08 23:26:42+0200]     Non-zero exit status: 255
[2022-05-08 23:26:42+0200] ../t/porting/regen.t........................................FAILED
[2022-05-08 23:26:42+0200]     Bad plan.  You planned 42 tests but ran 22.
[2022-05-08 23:26:42+0200] Archived results...
[2022-05-08 23:26:42+0200] TSTENV = locale:en_US.utf8	
#   "Pod NAME already used" 
#     'pod/perlguts.pod-new' also has NAME 'perlguts' near line ??? of pod/perlguts.pod
# See end of this test output for your options on silencing this
#   "? Should you be using L<...> instead of" 
#     C<av_shift> near line 475 of pod/perlguts.pod-new
#   "Pod NAME already used" 
#     'pod/perlguts.pod' also has NAME 'perlguts' near line ??? of pod/perlguts.pod-new
# See end of this test output for your options on silencing this
# 
# HOW TO GET porting/podcheck.t TO PASS
# 
# There were 2 files that had new potential problems identified.
# Some of them may be real, and some of them may be false positives because
# this program isn't as smart as it likes to think it is.  You can teach this
# program to ignore the issues it has identified, and hence pass, by doing the
# following:
# 
# 1) If a problem is about a link to an unknown module or man page that
#    you know exists, re-run the command something like:
#       ./perl -I../lib porting/podcheck.t --add-link MODULE man_page ...
#    (MODULEs should look like Foo::Bar, and man_pages should look like
#    bar(3c); don't do this for a module or man page that you aren't sure
#    about; instead treat as another type of issue and follow the
#    instructions below.)
# 
# 2) For other issues, decide if each should be fixed now or not.  Fix the
#    ones you decided to, and rerun this test to verify that the fixes
#    worked.
# 
# 3) If there remain false positive or problems that you don't plan to fix right
#    now,
#    run this test script by hand, using the following formula (on
#    Un*x-like machines):
#         cd t
#         ./perl -I../lib porting/podcheck.t --regen
# 
#    That should cause all current potential problems to be accepted by
#    the program, so that the next time it runs, they won't be flagged.
#    For a few files, such as perltoc, certain issues will always be
#    expected, and more of the same will be added over time.  For those,
#    before you do the regen, you can edit
#    /pro/3gl/CPAN/perl-current/t/porting/known_pod_issues.dat
#    and find the entry for the module's file and specific error message,
#    and change the count of known potential problems to -1.
'pod/perlguts.pod-new' and 'pod/perlguts.pod' differ
/pro/3gl/CPAN/perl-current/perl -I. regen/mg_vtable.pl --tap failed: 65280 at regen.pl line 20, <DATA> line 8.
    Hint:  A failure in this file can often be corrected by running:
     ./perl -Ilib regen.pl
Subroutine Time::HiRes::constant redefined at (eval 37) line 1.
Subroutine Time::HiRes::usleep redefined at (eval 37) line 1.
Subroutine Time::HiRes::nanosleep redefined at (eval 37) line 1.
Subroutine Time::HiRes::sleep redefined at (eval 37) line 1.
Subroutine Time::HiRes::ualarm redefined at (eval 37) line 1.
Subroutine Time::HiRes::alarm redefined at (eval 37) line 1.
Subroutine Time::HiRes::gettimeofday redefined at (eval 37) line 1.
Subroutine Time::HiRes::time redefined at (eval 37) line 1.
Subroutine Time::HiRes::setitimer redefined at (eval 37) line 1.
Subroutine Time::HiRes::getitimer redefined at (eval 37) line 1.
Subroutine Time::HiRes::utime redefined at (eval 37) line 1.
Subroutine Time::HiRes::clock_gettime redefined at (eval 37) line 1.
Subroutine Time::HiRes::clock_getres redefined at (eval 37) line 1.
Subroutine Time::HiRes::clock_nanosleep redefined at (eval 37) line 1.
Subroutine Time::HiRes::clock redefined at (eval 37) line 1.
Subroutine Time::HiRes::lstat redefined at (eval 37) line 1.
Subroutine Time::HiRes::stat redefined at (eval 37) line 1.
make: *** [makefile:856: test_harness] Error 3

error while running harness target 'test_harness': 2 at /pro/3gl/CPAN/smoke/lib/Test/Smoke/App/RunSmoke.pm line 118.
[2022-05-08 23:30:09+0200] 
[2022-05-08 23:30:09+0200] ../t/porting/podcheck.t.....................................FAILED
[2022-05-08 23:30:09+0200]     193-194
[2022-05-08 23:30:09+0200] ../t/porting/regen.t........................................FAILED
[2022-05-08 23:30:09+0200]     22
[2022-05-08 23:30:09+0200] ../t/porting/regen.t........................................FAILED
[2022-05-08 23:30:09+0200]     Non-zero exit status: 255
[2022-05-08 23:30:09+0200] ../t/porting/regen.t........................................FAILED
[2022-05-08 23:30:09+0200]     Bad plan.  You planned 42 tests but ran 22.
[2022-05-08 23:30:09+0200] Archived results...
Cannot open(/pro/3gl/CPAN/smoke/p59.skip): No such file or directory at /pro/3gl/CPAN/smoke/lib/Test/Smoke/App/RunSmoke.pm line 118.
[2022-05-08 23:30:09+0200] 
[2022-05-08 23:30:09+0200] Configuration: -Dusedevel -Duseithreads -Duselongdouble -DDEBUGGING
[2022-05-08 23:30:09+0200] ------------------------------------------------------------------------------
[2022-05-08 23:30:09+0200] make distclean ...
[2022-05-08 23:30:27+0200] 
[2022-05-08 23:30:27+0200] Copy Policy.sh ...
[2022-05-08 23:30:27+0200] 
[2022-05-08 23:30:27+0200] Configure ...
[2022-05-08 23:31:47+0200] 
[2022-05-08 23:31:47+0200] make ...
Cannot open(/pro/3gl/CPAN/smoke/p59.skip): No such file or directory at /pro/3gl/CPAN/smoke/lib/Test/Smoke/App/RunSmoke.pm line 118.
[2022-05-08 23:33:25+0200] 
[2022-05-08 23:33:25+0200]  Tests start here:
[2022-05-08 23:33:25+0200] TSTENV = stdio	
No saved state, selection will be empty
Subroutine Time::HiRes::constant redefined at (eval 37) line 1.
Subroutine Time::HiRes::usleep redefined at (eval 37) line 1.
Subroutine Time::HiRes::nanosleep redefined at (eval 37) line 1.
Subroutine Time::HiRes::sleep redefined at (eval 37) line 1.
Subroutine Time::HiRes::ualarm redefined at (eval 37) line 1.
Subroutine Time::HiRes::alarm redefined at (eval 37) line 1.
Subroutine Time::HiRes::gettimeofday redefined at (eval 37) line 1.
Subroutine Time::HiRes::time redefined at (eval 37) line 1.
Subroutine Time::HiRes::setitimer redefined at (eval 37) line 1.
Subroutine Time::HiRes::getitimer redefined at (eval 37) line 1.
Subroutine Time::HiRes::utime redefined at (eval 37) line 1.
Subroutine Time::HiRes::clock_gettime redefined at (eval 37) line 1.
Subroutine Time::HiRes::clock_getres redefined at (eval 37) line 1.
Subroutine Time::HiRes::clock_nanosleep redefined at (eval 37) line 1.
Subroutine Time::HiRes::clock redefined at (eval 37) line 1.
Subroutine Time::HiRes::lstat redefined at (eval 37) line 1.
Subroutine Time::HiRes::stat redefined at (eval 37) line 1.
No such file or directory
No such file or directory
No such file or directory
No such file or directory
No such file or directory
'pod/perlguts.pod-new' and 'pod/perlguts.pod' differ
/pro/3gl/CPAN/perl-current/perl -I. regen/mg_vtable.pl --tap failed: 512 at regen.pl line 20, <DATA> line 8.
    Hint:  A failure in this file can often be corrected by running:
     ./perl -Ilib regen.pl
No such file or directory
No such file or directory
#   "Pod NAME already used" 
#     'pod/perlguts.pod-new' also has NAME 'perlguts' near line ??? of pod/perlguts.pod
# See end of this test output for your options on silencing this
#   "? Should you be using L<...> instead of" 
#     C<av_shift> near line 475 of pod/perlguts.pod-new
#   "Pod NAME already used" 
#     'pod/perlguts.pod' also has NAME 'perlguts' near line ??? of pod/perlguts.pod-new
# See end of this test output for your options on silencing this
# 
# HOW TO GET porting/podcheck.t TO PASS
# 
# There were 2 files that had new potential problems identified.
# Some of them may be real, and some of them may be false positives because
# this program isn't as smart as it likes to think it is.  You can teach this
# program to ignore the issues it has identified, and hence pass, by doing the
# following:
# 
# 1) If a problem is about a link to an unknown module or man page that
#    you know exists, re-run the command something like:
#       ./perl -I../lib porting/podcheck.t --add-link MODULE man_page ...
#    (MODULEs should look like Foo::Bar, and man_pages should look like
#    bar(3c); don't do this for a module or man page that you aren't sure
#    about; instead treat as another type of issue and follow the
#    instructions below.)
# 
# 2) For other issues, decide if each should be fixed now or not.  Fix the
#    ones you decided to, and rerun this test to verify that the fixes
#    worked.
# 
# 3) If there remain false positive or problems that you don't plan to fix right
#    now,
#    run this test script by hand, using the following formula (on
#    Un*x-like machines):
#         cd t
#         ./perl -I../lib porting/podcheck.t --regen
# 
#    That should cause all current potential problems to be accepted by
#    the program, so that the next time it runs, they won't be flagged.
#    For a few files, such as perltoc, certain issues will always be
#    expected, and more of the same will be added over time.  For those,
#    before you do the regen, you can edit
#    /pro/3gl/CPAN/perl-current/t/porting/known_pod_issues.dat
#    and find the entry for the module's file and specific error message,
#    and change the count of known potential problems to -1.
make: *** [makefile:856: test_harness] Error 3

error while running harness target 'test_harness': 2 at /pro/3gl/CPAN/smoke/lib/Test/Smoke/App/RunSmoke.pm line 118.
[2022-05-08 23:37:55+0200] 
[2022-05-08 23:37:55+0200] ../t/porting/regen.t........................................FAILED
[2022-05-08 23:37:55+0200]     22
[2022-05-08 23:37:55+0200] ../t/porting/regen.t........................................FAILED
[2022-05-08 23:37:55+0200]     Non-zero exit status: 22
[2022-05-08 23:37:55+0200] ../t/porting/regen.t........................................FAILED
[2022-05-08 23:37:55+0200]     Bad plan.  You planned 42 tests but ran 22.
[2022-05-08 23:37:55+0200] ../t/porting/podcheck.t.....................................FAILED
[2022-05-08 23:37:55+0200]     193-194
[2022-05-08 23:37:55+0200] Archived results...
[2022-05-08 23:37:55+0200] TSTENV = perlio	
#   "Pod NAME already used" 
#     'pod/perlguts.pod-new' also has NAME 'perlguts' near line ??? of pod/perlguts.pod
# See end of this test output for your options on silencing this
#   "? Should you be using L<...> instead of" 
#     C<av_shift> near line 475 of pod/perlguts.pod-new
#   "Pod NAME already used" 
#     'pod/perlguts.pod' also has NAME 'perlguts' near line ??? of pod/perlguts.pod-new
# See end of this test output for your options on silencing this
# 
# HOW TO GET porting/podcheck.t TO PASS
# 
# There were 2 files that had new potential problems identified.
# Some of them may be real, and some of them may be false positives because
# this program isn't as smart as it likes to think it is.  You can teach this
# program to ignore the issues it has identified, and hence pass, by doing the
# following:
# 
# 1) If a problem is about a link to an unknown module or man page that
#    you know exists, re-run the command something like:
#       ./perl -I../lib porting/podcheck.t --add-link MODULE man_page ...
#    (MODULEs should look like Foo::Bar, and man_pages should look like
#    bar(3c); don't do this for a module or man page that you aren't sure
#    about; instead treat as another type of issue and follow the
#    instructions below.)
# 
# 2) For other issues, decide if each should be fixed now or not.  Fix the
#    ones you decided to, and rerun this test to verify that the fixes
#    worked.
# 
# 3) If there remain false positive or problems that you don't plan to fix right
#    now,
#    run this test script by hand, using the following formula (on
#    Un*x-like machines):
#         cd t
#         ./perl -I../lib porting/podcheck.t --regen
# 
#    That should cause all current potential problems to be accepted by
#    the program, so that the next time it runs, they won't be flagged.
#    For a few files, such as perltoc, certain issues will always be
#    expected, and more of the same will be added over time.  For those,
#    before you do the regen, you can edit
#    /pro/3gl/CPAN/perl-current/t/porting/known_pod_issues.dat
#    and find the entry for the module's file and specific error message,
#    and change the count of known potential problems to -1.
'pod/perlguts.pod-new' and 'pod/perlguts.pod' differ
/pro/3gl/CPAN/perl-current/perl -I. regen/mg_vtable.pl --tap failed: 65280 at regen.pl line 20, <DATA> line 8.
    Hint:  A failure in this file can often be corrected by running:
     ./perl -Ilib regen.pl
Subroutine Time::HiRes::constant redefined at (eval 37) line 1.
Subroutine Time::HiRes::usleep redefined at (eval 37) line 1.
Subroutine Time::HiRes::nanosleep redefined at (eval 37) line 1.
Subroutine Time::HiRes::sleep redefined at (eval 37) line 1.
Subroutine Time::HiRes::ualarm redefined at (eval 37) line 1.
Subroutine Time::HiRes::alarm redefined at (eval 37) line 1.
Subroutine Time::HiRes::gettimeofday redefined at (eval 37) line 1.
Subroutine Time::HiRes::time redefined at (eval 37) line 1.
Subroutine Time::HiRes::setitimer redefined at (eval 37) line 1.
Subroutine Time::HiRes::getitimer redefined at (eval 37) line 1.
Subroutine Time::HiRes::utime redefined at (eval 37) line 1.
Subroutine Time::HiRes::clock_gettime redefined at (eval 37) line 1.
Subroutine Time::HiRes::clock_getres redefined at (eval 37) line 1.
Subroutine Time::HiRes::clock_nanosleep redefined at (eval 37) line 1.
Subroutine Time::HiRes::clock redefined at (eval 37) line 1.
Subroutine Time::HiRes::lstat redefined at (eval 37) line 1.
Subroutine Time::HiRes::stat redefined at (eval 37) line 1.
make: *** [makefile:856: test_harness] Error 3

error while running harness target 'test_harness': 2 at /pro/3gl/CPAN/smoke/lib/Test/Smoke/App/RunSmoke.pm line 118.
[2022-05-08 23:42:08+0200] 
[2022-05-08 23:42:08+0200] ../t/porting/podcheck.t.....................................FAILED
[2022-05-08 23:42:08+0200]     193-194
[2022-05-08 23:42:08+0200] ../t/porting/regen.t........................................FAILED
[2022-05-08 23:42:08+0200]     22
[2022-05-08 23:42:08+0200] ../t/porting/regen.t........................................FAILED
[2022-05-08 23:42:08+0200]     Non-zero exit status: 255
[2022-05-08 23:42:08+0200] ../t/porting/regen.t........................................FAILED
[2022-05-08 23:42:08+0200]     Bad plan.  You planned 42 tests but ran 22.
[2022-05-08 23:42:08+0200] Archived results...
[2022-05-08 23:42:08+0200] TSTENV = locale:en_US.utf8	
#   "Pod NAME already used" 
#     'pod/perlguts.pod-new' also has NAME 'perlguts' near line ??? of pod/perlguts.pod
# See end of this test output for your options on silencing this
#   "? Should you be using L<...> instead of" 
#     C<av_shift> near line 475 of pod/perlguts.pod-new
#   "Pod NAME already used" 
#     'pod/perlguts.pod' also has NAME 'perlguts' near line ??? of pod/perlguts.pod-new
# See end of this test output for your options on silencing this
# 
# HOW TO GET porting/podcheck.t TO PASS
# 
# There were 2 files that had new potential problems identified.
# Some of them may be real, and some of them may be false positives because
# this program isn't as smart as it likes to think it is.  You can teach this
# program to ignore the issues it has identified, and hence pass, by doing the
# following:
# 
# 1) If a problem is about a link to an unknown module or man page that
#    you know exists, re-run the command something like:
#       ./perl -I../lib porting/podcheck.t --add-link MODULE man_page ...
#    (MODULEs should look like Foo::Bar, and man_pages should look like
#    bar(3c); don't do this for a module or man page that you aren't sure
#    about; instead treat as another type of issue and follow the
#    instructions below.)
# 
# 2) For other issues, decide if each should be fixed now or not.  Fix the
#    ones you decided to, and rerun this test to verify that the fixes
#    worked.
# 
# 3) If there remain false positive or problems that you don't plan to fix right
#    now,
#    run this test script by hand, using the following formula (on
#    Un*x-like machines):
#         cd t
#         ./perl -I../lib porting/podcheck.t --regen
# 
#    That should cause all current potential problems to be accepted by
#    the program, so that the next time it runs, they won't be flagged.
#    For a few files, such as perltoc, certain issues will always be
#    expected, and more of the same will be added over time.  For those,
#    before you do the regen, you can edit
#    /pro/3gl/CPAN/perl-current/t/porting/known_pod_issues.dat
#    and find the entry for the module's file and specific error message,
#    and change the count of known potential problems to -1.
'pod/perlguts.pod-new' and 'pod/perlguts.pod' differ
/pro/3gl/CPAN/perl-current/perl -I. regen/mg_vtable.pl --tap failed: 65280 at regen.pl line 20, <DATA> line 8.
    Hint:  A failure in this file can often be corrected by running:
     ./perl -Ilib regen.pl
Subroutine Time::HiRes::constant redefined at (eval 37) line 1.
Subroutine Time::HiRes::usleep redefined at (eval 37) line 1.
Subroutine Time::HiRes::nanosleep redefined at (eval 37) line 1.
Subroutine Time::HiRes::sleep redefined at (eval 37) line 1.
Subroutine Time::HiRes::ualarm redefined at (eval 37) line 1.
Subroutine Time::HiRes::alarm redefined at (eval 37) line 1.
Subroutine Time::HiRes::gettimeofday redefined at (eval 37) line 1.
Subroutine Time::HiRes::time redefined at (eval 37) line 1.
Subroutine Time::HiRes::setitimer redefined at (eval 37) line 1.
Subroutine Time::HiRes::getitimer redefined at (eval 37) line 1.
Subroutine Time::HiRes::utime redefined at (eval 37) line 1.
Subroutine Time::HiRes::clock_gettime redefined at (eval 37) line 1.
Subroutine Time::HiRes::clock_getres redefined at (eval 37) line 1.
Subroutine Time::HiRes::clock_nanosleep redefined at (eval 37) line 1.
Subroutine Time::HiRes::clock redefined at (eval 37) line 1.
Subroutine Time::HiRes::lstat redefined at (eval 37) line 1.
Subroutine Time::HiRes::stat redefined at (eval 37) line 1.
make: *** [makefile:856: test_harness] Error 3

error while running harness target 'test_harness': 2 at /pro/3gl/CPAN/smoke/lib/Test/Smoke/App/RunSmoke.pm line 118.
[2022-05-08 23:46:18+0200] 
[2022-05-08 23:46:18+0200] ../t/porting/podcheck.t.....................................FAILED
[2022-05-08 23:46:18+0200]     193-194
[2022-05-08 23:46:18+0200] ../t/porting/regen.t........................................FAILED
[2022-05-08 23:46:18+0200]     22
[2022-05-08 23:46:18+0200] ../t/porting/regen.t........................................FAILED
[2022-05-08 23:46:18+0200]     Non-zero exit status: 255
[2022-05-08 23:46:18+0200] ../t/porting/regen.t........................................FAILED
[2022-05-08 23:46:18+0200]     Bad plan.  You planned 42 tests but ran 22.
[2022-05-08 23:46:18+0200] Archived results...
Cannot open(/pro/3gl/CPAN/smoke/p59.skip): No such file or directory at /pro/3gl/CPAN/smoke/lib/Test/Smoke/App/RunSmoke.pm line 118.
[2022-05-08 23:46:18+0200] 
[2022-05-08 23:46:18+0200] Configuration: -Dusedevel -Duseithreads -Duse64bitall
[2022-05-08 23:46:18+0200] ------------------------------------------------------------------------------
[2022-05-08 23:46:18+0200] make distclean ...
[2022-05-08 23:46:38+0200] 
[2022-05-08 23:46:38+0200] Copy Policy.sh ...
[2022-05-08 23:46:38+0200] 
[2022-05-08 23:46:38+0200] Configure ...
[2022-05-08 23:47:53+0200] 
[2022-05-08 23:47:53+0200] make ...
Cannot open(/pro/3gl/CPAN/smoke/p59.skip): No such file or directory at /pro/3gl/CPAN/smoke/lib/Test/Smoke/App/RunSmoke.pm line 118.
[2022-05-08 23:49:01+0200] 
[2022-05-08 23:49:01+0200]  Tests start here:
[2022-05-08 23:49:01+0200] TSTENV = stdio	
No saved state, selection will be empty
Subroutine Time::HiRes::constant redefined at (eval 37) line 1.
Subroutine Time::HiRes::usleep redefined at (eval 37) line 1.
Subroutine Time::HiRes::nanosleep redefined at (eval 37) line 1.
Subroutine Time::HiRes::sleep redefined at (eval 37) line 1.
Subroutine Time::HiRes::ualarm redefined at (eval 37) line 1.
Subroutine Time::HiRes::alarm redefined at (eval 37) line 1.
Subroutine Time::HiRes::gettimeofday redefined at (eval 37) line 1.
Subroutine Time::HiRes::time redefined at (eval 37) line 1.
Subroutine Time::HiRes::setitimer redefined at (eval 37) line 1.
Subroutine Time::HiRes::getitimer redefined at (eval 37) line 1.
Subroutine Time::HiRes::utime redefined at (eval 37) line 1.
Subroutine Time::HiRes::clock_gettime redefined at (eval 37) line 1.
Subroutine Time::HiRes::clock_getres redefined at (eval 37) line 1.
Subroutine Time::HiRes::clock_nanosleep redefined at (eval 37) line 1.
Subroutine Time::HiRes::clock redefined at (eval 37) line 1.
Subroutine Time::HiRes::lstat redefined at (eval 37) line 1.
Subroutine Time::HiRes::stat redefined at (eval 37) line 1.
No such file or directory
No such file or directory
No such file or directory
No such file or directory
No such file or directory
No such file or directory
'pod/perlguts.pod-new' and 'pod/perlguts.pod' differ
/pro/3gl/CPAN/perl-current/perl -I. regen/mg_vtable.pl --tap failed: 512 at regen.pl line 20, <DATA> line 8.
    Hint:  A failure in this file can often be corrected by running:
     ./perl -Ilib regen.pl
No such file or directory
#   "Pod NAME already used" 
#     'pod/perlguts.pod-new' also has NAME 'perlguts' near line ??? of pod/perlguts.pod
# See end of this test output for your options on silencing this
#   "? Should you be using L<...> instead of" 
#     C<av_shift> near line 475 of pod/perlguts.pod-new
#   "Pod NAME already used" 
#     'pod/perlguts.pod' also has NAME 'perlguts' near line ??? of pod/perlguts.pod-new
# See end of this test output for your options on silencing this
# 
# HOW TO GET porting/podcheck.t TO PASS
# 
# There were 2 files that had new potential problems identified.
# Some of them may be real, and some of them may be false positives because
# this program isn't as smart as it likes to think it is.  You can teach this
# program to ignore the issues it has identified, and hence pass, by doing the
# following:
# 
# 1) If a problem is about a link to an unknown module or man page that
#    you know exists, re-run the command something like:
#       ./perl -I../lib porting/podcheck.t --add-link MODULE man_page ...
#    (MODULEs should look like Foo::Bar, and man_pages should look like
#    bar(3c); don't do this for a module or man page that you aren't sure
#    about; instead treat as another type of issue and follow the
#    instructions below.)
# 
# 2) For other issues, decide if each should be fixed now or not.  Fix the
#    ones you decided to, and rerun this test to verify that the fixes
#    worked.
# 
# 3) If there remain false positive or problems that you don't plan to fix right
#    now,
#    run this test script by hand, using the following formula (on
#    Un*x-like machines):
#         cd t
#         ./perl -I../lib porting/podcheck.t --regen
# 
#    That should cause all current potential problems to be accepted by
#    the program, so that the next time it runs, they won't be flagged.
#    For a few files, such as perltoc, certain issues will always be
#    expected, and more of the same will be added over time.  For those,
#    before you do the regen, you can edit
#    /pro/3gl/CPAN/perl-current/t/porting/known_pod_issues.dat
#    and find the entry for the module's file and specific error message,
#    and change the count of known potential problems to -1.
make: *** [makefile:856: test_harness] Error 3

error while running harness target 'test_harness': 2 at /pro/3gl/CPAN/smoke/lib/Test/Smoke/App/RunSmoke.pm line 118.
[2022-05-08 23:52:43+0200] 
[2022-05-08 23:52:43+0200] ../t/porting/regen.t........................................FAILED
[2022-05-08 23:52:43+0200]     22
[2022-05-08 23:52:43+0200] ../t/porting/regen.t........................................FAILED
[2022-05-08 23:52:43+0200]     Non-zero exit status: 22
[2022-05-08 23:52:43+0200] ../t/porting/regen.t........................................FAILED
[2022-05-08 23:52:43+0200]     Bad plan.  You planned 42 tests but ran 22.
[2022-05-08 23:52:43+0200] ../t/porting/podcheck.t.....................................FAILED
[2022-05-08 23:52:43+0200]     193-194
[2022-05-08 23:52:43+0200] Archived results...
[2022-05-08 23:52:43+0200] TSTENV = perlio	
#   "Pod NAME already used" 
#     'pod/perlguts.pod-new' also has NAME 'perlguts' near line ??? of pod/perlguts.pod
# See end of this test output for your options on silencing this
#   "? Should you be using L<...> instead of" 
#     C<av_shift> near line 475 of pod/perlguts.pod-new
#   "Pod NAME already used" 
#     'pod/perlguts.pod' also has NAME 'perlguts' near line ??? of pod/perlguts.pod-new
# See end of this test output for your options on silencing this
# 
# HOW TO GET porting/podcheck.t TO PASS
# 
# There were 2 files that had new potential problems identified.
# Some of them may be real, and some of them may be false positives because
# this program isn't as smart as it likes to think it is.  You can teach this
# program to ignore the issues it has identified, and hence pass, by doing the
# following:
# 
# 1) If a problem is about a link to an unknown module or man page that
#    you know exists, re-run the command something like:
#       ./perl -I../lib porting/podcheck.t --add-link MODULE man_page ...
#    (MODULEs should look like Foo::Bar, and man_pages should look like
#    bar(3c); don't do this for a module or man page that you aren't sure
#    about; instead treat as another type of issue and follow the
#    instructions below.)
# 
# 2) For other issues, decide if each should be fixed now or not.  Fix the
#    ones you decided to, and rerun this test to verify that the fixes
#    worked.
# 
# 3) If there remain false positive or problems that you don't plan to fix right
#    now,
#    run this test script by hand, using the following formula (on
#    Un*x-like machines):
#         cd t
#         ./perl -I../lib porting/podcheck.t --regen
# 
#    That should cause all current potential problems to be accepted by
#    the program, so that the next time it runs, they won't be flagged.
#    For a few files, such as perltoc, certain issues will always be
#    expected, and more of the same will be added over time.  For those,
#    before you do the regen, you can edit
#    /pro/3gl/CPAN/perl-current/t/porting/known_pod_issues.dat
#    and find the entry for the module's file and specific error message,
#    and change the count of known potential problems to -1.
'pod/perlguts.pod-new' and 'pod/perlguts.pod' differ
/pro/3gl/CPAN/perl-current/perl -I. regen/mg_vtable.pl --tap failed: 65280 at regen.pl line 20, <DATA> line 8.
    Hint:  A failure in this file can often be corrected by running:
     ./perl -Ilib regen.pl
Subroutine Time::HiRes::constant redefined at (eval 37) line 1.
Subroutine Time::HiRes::usleep redefined at (eval 37) line 1.
Subroutine Time::HiRes::nanosleep redefined at (eval 37) line 1.
Subroutine Time::HiRes::sleep redefined at (eval 37) line 1.
Subroutine Time::HiRes::ualarm redefined at (eval 37) line 1.
Subroutine Time::HiRes::alarm redefined at (eval 37) line 1.
Subroutine Time::HiRes::gettimeofday redefined at (eval 37) line 1.
Subroutine Time::HiRes::time redefined at (eval 37) line 1.
Subroutine Time::HiRes::setitimer redefined at (eval 37) line 1.
Subroutine Time::HiRes::getitimer redefined at (eval 37) line 1.
Subroutine Time::HiRes::utime redefined at (eval 37) line 1.
Subroutine Time::HiRes::clock_gettime redefined at (eval 37) line 1.
Subroutine Time::HiRes::clock_getres redefined at (eval 37) line 1.
Subroutine Time::HiRes::clock_nanosleep redefined at (eval 37) line 1.
Subroutine Time::HiRes::clock redefined at (eval 37) line 1.
Subroutine Time::HiRes::lstat redefined at (eval 37) line 1.
Subroutine Time::HiRes::stat redefined at (eval 37) line 1.
make: *** [makefile:856: test_harness] Error 3

error while running harness target 'test_harness': 2 at /pro/3gl/CPAN/smoke/lib/Test/Smoke/App/RunSmoke.pm line 118.
[2022-05-08 23:56:10+0200] 
[2022-05-08 23:56:10+0200] ../t/porting/podcheck.t.....................................FAILED
[2022-05-08 23:56:10+0200]     193-194
[2022-05-08 23:56:10+0200] ../t/porting/regen.t........................................FAILED
[2022-05-08 23:56:10+0200]     22
[2022-05-08 23:56:10+0200] ../t/porting/regen.t........................................FAILED
[2022-05-08 23:56:10+0200]     Non-zero exit status: 255
[2022-05-08 23:56:10+0200] ../t/porting/regen.t........................................FAILED
[2022-05-08 23:56:10+0200]     Bad plan.  You planned 42 tests but ran 22.
[2022-05-08 23:56:10+0200] Archived results...
[2022-05-08 23:56:10+0200] TSTENV = locale:en_US.utf8	
#   "Pod NAME already used" 
#     'pod/perlguts.pod-new' also has NAME 'perlguts' near line ??? of pod/perlguts.pod
# See end of this test output for your options on silencing this
#   "? Should you be using L<...> instead of" 
#     C<av_shift> near line 475 of pod/perlguts.pod-new
#   "Pod NAME already used" 
#     'pod/perlguts.pod' also has NAME 'perlguts' near line ??? of pod/perlguts.pod-new
# See end of this test output for your options on silencing this
# 
# HOW TO GET porting/podcheck.t TO PASS
# 
# There were 2 files that had new potential problems identified.
# Some of them may be real, and some of them may be false positives because
# this program isn't as smart as it likes to think it is.  You can teach this
# program to ignore the issues it has identified, and hence pass, by doing the
# following:
# 
# 1) If a problem is about a link to an unknown module or man page that
#    you know exists, re-run the command something like:
#       ./perl -I../lib porting/podcheck.t --add-link MODULE man_page ...
#    (MODULEs should look like Foo::Bar, and man_pages should look like
#    bar(3c); don't do this for a module or man page that you aren't sure
#    about; instead treat as another type of issue and follow the
#    instructions below.)
# 
# 2) For other issues, decide if each should be fixed now or not.  Fix the
#    ones you decided to, and rerun this test to verify that the fixes
#    worked.
# 
# 3) If there remain false positive or problems that you don't plan to fix right
#    now,
#    run this test script by hand, using the following formula (on
#    Un*x-like machines):
#         cd t
#         ./perl -I../lib porting/podcheck.t --regen
# 
#    That should cause all current potential problems to be accepted by
#    the program, so that the next time it runs, they won't be flagged.
#    For a few files, such as perltoc, certain issues will always be
#    expected, and more of the same will be added over time.  For those,
#    before you do the regen, you can edit
#    /pro/3gl/CPAN/perl-current/t/porting/known_pod_issues.dat
#    and find the entry for the module's file and specific error message,
#    and change the count of known potential problems to -1.
'pod/perlguts.pod-new' and 'pod/perlguts.pod' differ
/pro/3gl/CPAN/perl-current/perl -I. regen/mg_vtable.pl --tap failed: 65280 at regen.pl line 20, <DATA> line 8.
    Hint:  A failure in this file can often be corrected by running:
     ./perl -Ilib regen.pl
Subroutine Time::HiRes::constant redefined at (eval 37) line 1.
Subroutine Time::HiRes::usleep redefined at (eval 37) line 1.
Subroutine Time::HiRes::nanosleep redefined at (eval 37) line 1.
Subroutine Time::HiRes::sleep redefined at (eval 37) line 1.
Subroutine Time::HiRes::ualarm redefined at (eval 37) line 1.
Subroutine Time::HiRes::alarm redefined at (eval 37) line 1.
Subroutine Time::HiRes::gettimeofday redefined at (eval 37) line 1.
Subroutine Time::HiRes::time redefined at (eval 37) line 1.
Subroutine Time::HiRes::setitimer redefined at (eval 37) line 1.
Subroutine Time::HiRes::getitimer redefined at (eval 37) line 1.
Subroutine Time::HiRes::utime redefined at (eval 37) line 1.
Subroutine Time::HiRes::clock_gettime redefined at (eval 37) line 1.
Subroutine Time::HiRes::clock_getres redefined at (eval 37) line 1.
Subroutine Time::HiRes::clock_nanosleep redefined at (eval 37) line 1.
Subroutine Time::HiRes::clock redefined at (eval 37) line 1.
Subroutine Time::HiRes::lstat redefined at (eval 37) line 1.
Subroutine Time::HiRes::stat redefined at (eval 37) line 1.
make: *** [makefile:856: test_harness] Error 3

error while running harness target 'test_harness': 2 at /pro/3gl/CPAN/smoke/lib/Test/Smoke/App/RunSmoke.pm line 118.
[2022-05-08 23:59:36+0200] 
[2022-05-08 23:59:36+0200] ../t/porting/podcheck.t.....................................FAILED
[2022-05-08 23:59:36+0200]     193-194
[2022-05-08 23:59:36+0200] ../t/porting/regen.t........................................FAILED
[2022-05-08 23:59:36+0200]     22
[2022-05-08 23:59:36+0200] ../t/porting/regen.t........................................FAILED
[2022-05-08 23:59:36+0200]     Non-zero exit status: 255
[2022-05-08 23:59:36+0200] ../t/porting/regen.t........................................FAILED
[2022-05-08 23:59:36+0200]     Bad plan.  You planned 42 tests but ran 22.
[2022-05-08 23:59:36+0200] Archived results...
Cannot open(/pro/3gl/CPAN/smoke/p59.skip): No such file or directory at /pro/3gl/CPAN/smoke/lib/Test/Smoke/App/RunSmoke.pm line 118.
[2022-05-08 23:59:36+0200] 
[2022-05-08 23:59:36+0200] Configuration: -Dusedevel -Duseithreads -Duse64bitall -DDEBUGGING
[2022-05-08 23:59:36+0200] ------------------------------------------------------------------------------
[2022-05-08 23:59:36+0200] make distclean ...
[2022-05-08 23:59:54+0200] 
[2022-05-08 23:59:54+0200] Copy Policy.sh ...
[2022-05-08 23:59:54+0200] 
[2022-05-08 23:59:54+0200] Configure ...
[2022-05-09 00:01:10+0200] 
[2022-05-09 00:01:10+0200] make ...
Cannot open(/pro/3gl/CPAN/smoke/p59.skip): No such file or directory at /pro/3gl/CPAN/smoke/lib/Test/Smoke/App/RunSmoke.pm line 118.
[2022-05-09 00:02:49+0200] 
[2022-05-09 00:02:49+0200]  Tests start here:
[2022-05-09 00:02:49+0200] TSTENV = stdio	
No saved state, selection will be empty
Subroutine Time::HiRes::constant redefined at (eval 37) line 1.
Subroutine Time::HiRes::usleep redefined at (eval 37) line 1.
Subroutine Time::HiRes::nanosleep redefined at (eval 37) line 1.
Subroutine Time::HiRes::sleep redefined at (eval 37) line 1.
Subroutine Time::HiRes::ualarm redefined at (eval 37) line 1.
Subroutine Time::HiRes::alarm redefined at (eval 37) line 1.
Subroutine Time::HiRes::gettimeofday redefined at (eval 37) line 1.
Subroutine Time::HiRes::time redefined at (eval 37) line 1.
Subroutine Time::HiRes::setitimer redefined at (eval 37) line 1.
Subroutine Time::HiRes::getitimer redefined at (eval 37) line 1.
Subroutine Time::HiRes::utime redefined at (eval 37) line 1.
Subroutine Time::HiRes::clock_gettime redefined at (eval 37) line 1.
Subroutine Time::HiRes::clock_getres redefined at (eval 37) line 1.
Subroutine Time::HiRes::clock_nanosleep redefined at (eval 37) line 1.
Subroutine Time::HiRes::clock redefined at (eval 37) line 1.
Subroutine Time::HiRes::lstat redefined at (eval 37) line 1.
Subroutine Time::HiRes::stat redefined at (eval 37) line 1.
No such file or directory
No such file or directory
No such file or directory
No such file or directory
No such file or directory
No such file or directory
'pod/perlguts.pod-new' and 'pod/perlguts.pod' differ
/pro/3gl/CPAN/perl-current/perl -I. regen/mg_vtable.pl --tap failed: 512 at regen.pl line 20, <DATA> line 8.
    Hint:  A failure in this file can often be corrected by running:
     ./perl -Ilib regen.pl
No such file or directory
#   "Pod NAME already used" 
#     'pod/perlguts.pod-new' also has NAME 'perlguts' near line ??? of pod/perlguts.pod
# See end of this test output for your options on silencing this
#   "? Should you be using L<...> instead of" 
#     C<av_shift> near line 475 of pod/perlguts.pod-new
#   "Pod NAME already used" 
#     'pod/perlguts.pod' also has NAME 'perlguts' near line ??? of pod/perlguts.pod-new
# See end of this test output for your options on silencing this
# 
# HOW TO GET porting/podcheck.t TO PASS
# 
# There were 2 files that had new potential problems identified.
# Some of them may be real, and some of them may be false positives because
# this program isn't as smart as it likes to think it is.  You can teach this
# program to ignore the issues it has identified, and hence pass, by doing the
# following:
# 
# 1) If a problem is about a link to an unknown module or man page that
#    you know exists, re-run the command something like:
#       ./perl -I../lib porting/podcheck.t --add-link MODULE man_page ...
#    (MODULEs should look like Foo::Bar, and man_pages should look like
#    bar(3c); don't do this for a module or man page that you aren't sure
#    about; instead treat as another type of issue and follow the
#    instructions below.)
# 
# 2) For other issues, decide if each should be fixed now or not.  Fix the
#    ones you decided to, and rerun this test to verify that the fixes
#    worked.
# 
# 3) If there remain false positive or problems that you don't plan to fix right
#    now,
#    run this test script by hand, using the following formula (on
#    Un*x-like machines):
#         cd t
#         ./perl -I../lib porting/podcheck.t --regen
# 
#    That should cause all current potential problems to be accepted by
#    the program, so that the next time it runs, they won't be flagged.
#    For a few files, such as perltoc, certain issues will always be
#    expected, and more of the same will be added over time.  For those,
#    before you do the regen, you can edit
#    /pro/3gl/CPAN/perl-current/t/porting/known_pod_issues.dat
#    and find the entry for the module's file and specific error message,
#    and change the count of known potential problems to -1.
make: *** [makefile:856: test_harness] Error 3

error while running harness target 'test_harness': 2 at /pro/3gl/CPAN/smoke/lib/Test/Smoke/App/RunSmoke.pm line 118.
[2022-05-09 00:07:20+0200] 
[2022-05-09 00:07:20+0200] ../t/porting/regen.t........................................FAILED
[2022-05-09 00:07:20+0200]     22
[2022-05-09 00:07:20+0200] ../t/porting/regen.t........................................FAILED
[2022-05-09 00:07:20+0200]     Non-zero exit status: 22
[2022-05-09 00:07:20+0200] ../t/porting/regen.t........................................FAILED
[2022-05-09 00:07:20+0200]     Bad plan.  You planned 42 tests but ran 22.
[2022-05-09 00:07:20+0200] ../t/porting/podcheck.t.....................................FAILED
[2022-05-09 00:07:20+0200]     193-194
[2022-05-09 00:07:20+0200] Archived results...
[2022-05-09 00:07:20+0200] TSTENV = perlio	
#   "Pod NAME already used" 
#     'pod/perlguts.pod-new' also has NAME 'perlguts' near line ??? of pod/perlguts.pod
# See end of this test output for your options on silencing this
#   "? Should you be using L<...> instead of" 
#     C<av_shift> near line 475 of pod/perlguts.pod-new
#   "Pod NAME already used" 
#     'pod/perlguts.pod' also has NAME 'perlguts' near line ??? of pod/perlguts.pod-new
# See end of this test output for your options on silencing this
# 
# HOW TO GET porting/podcheck.t TO PASS
# 
# There were 2 files that had new potential problems identified.
# Some of them may be real, and some of them may be false positives because
# this program isn't as smart as it likes to think it is.  You can teach this
# program to ignore the issues it has identified, and hence pass, by doing the
# following:
# 
# 1) If a problem is about a link to an unknown module or man page that
#    you know exists, re-run the command something like:
#       ./perl -I../lib porting/podcheck.t --add-link MODULE man_page ...
#    (MODULEs should look like Foo::Bar, and man_pages should look like
#    bar(3c); don't do this for a module or man page that you aren't sure
#    about; instead treat as another type of issue and follow the
#    instructions below.)
# 
# 2) For other issues, decide if each should be fixed now or not.  Fix the
#    ones you decided to, and rerun this test to verify that the fixes
#    worked.
# 
# 3) If there remain false positive or problems that you don't plan to fix right
#    now,
#    run this test script by hand, using the following formula (on
#    Un*x-like machines):
#         cd t
#         ./perl -I../lib porting/podcheck.t --regen
# 
#    That should cause all current potential problems to be accepted by
#    the program, so that the next time it runs, they won't be flagged.
#    For a few files, such as perltoc, certain issues will always be
#    expected, and more of the same will be added over time.  For those,
#    before you do the regen, you can edit
#    /pro/3gl/CPAN/perl-current/t/porting/known_pod_issues.dat
#    and find the entry for the module's file and specific error message,
#    and change the count of known potential problems to -1.
'pod/perlguts.pod-new' and 'pod/perlguts.pod' differ
/pro/3gl/CPAN/perl-current/perl -I. regen/mg_vtable.pl --tap failed: 65280 at regen.pl line 20, <DATA> line 8.
    Hint:  A failure in this file can often be corrected by running:
     ./perl -Ilib regen.pl
Subroutine Time::HiRes::constant redefined at (eval 37) line 1.
Subroutine Time::HiRes::usleep redefined at (eval 37) line 1.
Subroutine Time::HiRes::nanosleep redefined at (eval 37) line 1.
Subroutine Time::HiRes::sleep redefined at (eval 37) line 1.
Subroutine Time::HiRes::ualarm redefined at (eval 37) line 1.
Subroutine Time::HiRes::alarm redefined at (eval 37) line 1.
Subroutine Time::HiRes::gettimeofday redefined at (eval 37) line 1.
Subroutine Time::HiRes::time redefined at (eval 37) line 1.
Subroutine Time::HiRes::setitimer redefined at (eval 37) line 1.
Subroutine Time::HiRes::getitimer redefined at (eval 37) line 1.
Subroutine Time::HiRes::utime redefined at (eval 37) line 1.
Subroutine Time::HiRes::clock_gettime redefined at (eval 37) line 1.
Subroutine Time::HiRes::clock_getres redefined at (eval 37) line 1.
Subroutine Time::HiRes::clock_nanosleep redefined at (eval 37) line 1.
Subroutine Time::HiRes::clock redefined at (eval 37) line 1.
Subroutine Time::HiRes::lstat redefined at (eval 37) line 1.
Subroutine Time::HiRes::stat redefined at (eval 37) line 1.
make: *** [makefile:856: test_harness] Error 3

error while running harness target 'test_harness': 2 at /pro/3gl/CPAN/smoke/lib/Test/Smoke/App/RunSmoke.pm line 118.
[2022-05-09 00:11:33+0200] 
[2022-05-09 00:11:33+0200] ../t/porting/podcheck.t.....................................FAILED
[2022-05-09 00:11:33+0200]     193-194
[2022-05-09 00:11:33+0200] ../t/porting/regen.t........................................FAILED
[2022-05-09 00:11:33+0200]     22
[2022-05-09 00:11:33+0200] ../t/porting/regen.t........................................FAILED
[2022-05-09 00:11:33+0200]     Non-zero exit status: 255
[2022-05-09 00:11:33+0200] ../t/porting/regen.t........................................FAILED
[2022-05-09 00:11:33+0200]     Bad plan.  You planned 42 tests but ran 22.
[2022-05-09 00:11:33+0200] Archived results...
[2022-05-09 00:11:33+0200] TSTENV = locale:en_US.utf8	
#   "Pod NAME already used" 
#     'pod/perlguts.pod-new' also has NAME 'perlguts' near line ??? of pod/perlguts.pod
# See end of this test output for your options on silencing this
#   "? Should you be using L<...> instead of" 
#     C<av_shift> near line 475 of pod/perlguts.pod-new
#   "Pod NAME already used" 
#     'pod/perlguts.pod' also has NAME 'perlguts' near line ??? of pod/perlguts.pod-new
# See end of this test output for your options on silencing this
# 
# HOW TO GET porting/podcheck.t TO PASS
# 
# There were 2 files that had new potential problems identified.
# Some of them may be real, and some of them may be false positives because
# this program isn't as smart as it likes to think it is.  You can teach this
# program to ignore the issues it has identified, and hence pass, by doing the
# following:
# 
# 1) If a problem is about a link to an unknown module or man page that
#    you know exists, re-run the command something like:
#       ./perl -I../lib porting/podcheck.t --add-link MODULE man_page ...
#    (MODULEs should look like Foo::Bar, and man_pages should look like
#    bar(3c); don't do this for a module or man page that you aren't sure
#    about; instead treat as another type of issue and follow the
#    instructions below.)
# 
# 2) For other issues, decide if each should be fixed now or not.  Fix the
#    ones you decided to, and rerun this test to verify that the fixes
#    worked.
# 
# 3) If there remain false positive or problems that you don't plan to fix right
#    now,
#    run this test script by hand, using the following formula (on
#    Un*x-like machines):
#         cd t
#         ./perl -I../lib porting/podcheck.t --regen
# 
#    That should cause all current potential problems to be accepted by
#    the program, so that the next time it runs, they won't be flagged.
#    For a few files, such as perltoc, certain issues will always be
#    expected, and more of the same will be added over time.  For those,
#    before you do the regen, you can edit
#    /pro/3gl/CPAN/perl-current/t/porting/known_pod_issues.dat
#    and find the entry for the module's file and specific error message,
#    and change the count of known potential problems to -1.
'pod/perlguts.pod-new' and 'pod/perlguts.pod' differ
/pro/3gl/CPAN/perl-current/perl -I. regen/mg_vtable.pl --tap failed: 65280 at regen.pl line 20, <DATA> line 8.
    Hint:  A failure in this file can often be corrected by running:
     ./perl -Ilib regen.pl
Subroutine Time::HiRes::constant redefined at (eval 37) line 1.
Subroutine Time::HiRes::usleep redefined at (eval 37) line 1.
Subroutine Time::HiRes::nanosleep redefined at (eval 37) line 1.
Subroutine Time::HiRes::sleep redefined at (eval 37) line 1.
Subroutine Time::HiRes::ualarm redefined at (eval 37) line 1.
Subroutine Time::HiRes::alarm redefined at (eval 37) line 1.
Subroutine Time::HiRes::gettimeofday redefined at (eval 37) line 1.
Subroutine Time::HiRes::time redefined at (eval 37) line 1.
Subroutine Time::HiRes::setitimer redefined at (eval 37) line 1.
Subroutine Time::HiRes::getitimer redefined at (eval 37) line 1.
Subroutine Time::HiRes::utime redefined at (eval 37) line 1.
Subroutine Time::HiRes::clock_gettime redefined at (eval 37) line 1.
Subroutine Time::HiRes::clock_getres redefined at (eval 37) line 1.
Subroutine Time::HiRes::clock_nanosleep redefined at (eval 37) line 1.
Subroutine Time::HiRes::clock redefined at (eval 37) line 1.
Subroutine Time::HiRes::lstat redefined at (eval 37) line 1.
Subroutine Time::HiRes::stat redefined at (eval 37) line 1.
make: *** [makefile:856: test_harness] Error 3

error while running harness target 'test_harness': 2 at /pro/3gl/CPAN/smoke/lib/Test/Smoke/App/RunSmoke.pm line 118.
[2022-05-09 00:15:39+0200] 
[2022-05-09 00:15:39+0200] ../t/porting/podcheck.t.....................................FAILED
[2022-05-09 00:15:39+0200]     193-194
[2022-05-09 00:15:39+0200] ../t/porting/regen.t........................................FAILED
[2022-05-09 00:15:39+0200]     22
[2022-05-09 00:15:39+0200] ../t/porting/regen.t........................................FAILED
[2022-05-09 00:15:39+0200]     Non-zero exit status: 255
[2022-05-09 00:15:39+0200] ../t/porting/regen.t........................................FAILED
[2022-05-09 00:15:39+0200]     Bad plan.  You planned 42 tests but ran 22.
[2022-05-09 00:15:39+0200] Archived results...
Cannot open(/pro/3gl/CPAN/smoke/p59.skip): No such file or directory at /pro/3gl/CPAN/smoke/lib/Test/Smoke/App/RunSmoke.pm line 118.
[2022-05-09 00:15:39+0200] Finished smoking 300ff263fbad8007ca52d84a8be8b98fba791a3c v5.35.11-140-g300ff26 blead
[2022-05-09 00:15:39+0200] Reading smokeresult from /pro/3gl/CPAN/perl-current/mktest.out
[2022-05-09 00:15:39+0200] Processing [-Duselongdouble]
[2022-05-09 00:15:39+0200] Processing [-DDEBUGGING -Duselongdouble]
[2022-05-09 00:15:39+0200] Processing [-Duse64bitall]
[2022-05-09 00:15:39+0200] Processing [-DDEBUGGING -Duse64bitall]
[2022-05-09 00:15:39+0200] Processing [-Duseithreads -Duselongdouble]
[2022-05-09 00:15:39+0200] Processing [-DDEBUGGING -Duseithreads -Duselongdouble]
[2022-05-09 00:15:39+0200] Processing [-Duseithreads -Duse64bitall]
[2022-05-09 00:15:39+0200] Processing [-DDEBUGGING -Duseithreads -Duse64bitall]
[2022-05-09 00:15:39+0200] ==> Starting reporter
[2022-05-09 00:15:39+0200] Writing report to '/pro/3gl/CPAN/perl-current/mktest.rpt'
[2022-05-09 00:15:39+0200] Locally applied patches from '/pro/3gl/CPAN/perl-current/patchlevel.h'
[2022-05-09 00:15:39+0200] Patches: 'uncommitted-changes'
[2022-05-09 00:15:39+0200] Looking for cc messages: 'gcc'
-- 
Report generated by Test::Smoke::Gateway v0.12