Show report
[2022-04-23 08:11:35+0200] ==> Skipping synctree
[2022-04-23 08:11:35+0200] ==> Starting runsmoke
[2022-04-23 08:11:35+0200] [tssmokeperl.pl] chdir(/pro/3gl/CPAN/perl-current)
[2022-04-23 08:11:35+0200] Setup alarm: Sun Apr 24 07:41:35 2022
[2022-04-23 08:11:35+0200] qx[/pro/bin/perl -e "require q[/pro/3gl/CPAN/perl-current/cpan/Test-Harness/lib/Test/Harness.pm];print Test::Harness->VERSION" 2>&1]
[2022-04-23 08:11:36+0200] Found: Test::Harness version 3.44.
[2022-04-23 08:11:36+0200] Reading build configurations from /pro/3gl/CPAN/smoke/p59.cfg
[2022-04-23 08:11:36+0200] Reading 'Policy.sh' from ../Policy.sh (v=1)
[2022-04-23 08:11:36+0200] Running test suite only with 'harness'
[2022-04-23 08:11:36+0200] make distclean ...
[2022-04-23 08:11:36+0200] Smoking patch 70f5c3e99f92075109e4262faf825fb00ea79bd3 v5.35.11-10-g70f5c3e
[2022-04-23 08:11:36+0200] Smoking branch blead
[2022-04-23 08:11:36+0200] Locally applied patches from '/pro/3gl/CPAN/perl-current/patchlevel.h'
[2022-04-23 08:11:36+0200] Patches: 'uncommitted-changes'
[2022-04-23 08:11:36+0200] Adding 'SMOKE70f5c3e99f92075109e4262faf825fb00ea79bd3' to the registered patches.
[2022-04-23 08:11:36+0200] 
[2022-04-23 08:11:36+0200] Configuration: -Dusedevel
[2022-04-23 08:11:36+0200] ------------------------------------------------------------------------------
[2022-04-23 08:11:36+0200] make distclean ...
[2022-04-23 08:11:36+0200] 
[2022-04-23 08:11:36+0200] Copy Policy.sh ...
[2022-04-23 08:11:36+0200] 
[2022-04-23 08:11:36+0200] Configure ...
[2022-04-23 08:13:11+0200] 
[2022-04-23 08:13:11+0200] make ...
[2022-04-23 08:26:04+0200] Skip tests from '/pro/3gl/CPAN/smoke/p59.skip'
[2022-04-23 08:26:05+0200] 	cpan/Sys-Syslog/t/syslog.t
[2022-04-23 08:26:05+0200] 
[2022-04-23 08:26:05+0200]  Tests start here:
[2022-04-23 08:26:05+0200] TSTENV = stdio	
No saved state, selection will be empty
Cannot figure out an encoding to use at t/use-Encode-Alias.t line 5.
"../../../../sv_inline.h", line 487: warning #4232-D: conversion from "XPVIO *" to a more strictly aligned type "XPVMG *" may cause misaligned access
              SvSTASH_set(io, MUTABLE_HV(SvREFCNT_inc(GvHV(iogv))));
              ^

"../../../../sv_inline.h", line 468: warning #4276-D: relational operator ">" always evaluates to 'false'
              Zero(new_body, type_details->body_size, char);
              ^

"../../../../sv_inline.h", line 487: warning #4232-D: conversion from "XPVIO *" to a more strictly aligned type "XPVMG *" may cause misaligned access
              SvSTASH_set(io, MUTABLE_HV(SvREFCNT_inc(GvHV(iogv))));
              ^

"../../../../sv_inline.h", line 468: warning #4276-D: relational operator ">" always evaluates to 'false'
              Zero(new_body, type_details->body_size, char);
              ^

"../../../../sv_inline.h", line 487: warning #4232-D: conversion from "XPVIO *" to a more strictly aligned type "XPVMG *" may cause misaligned access
              SvSTASH_set(io, MUTABLE_HV(SvREFCNT_inc(GvHV(iogv))));
              ^

"../../../../sv_inline.h", line 468: warning #4276-D: relational operator ">" always evaluates to 'false'
              Zero(new_body, type_details->body_size, char);
              ^

"../../../../sv_inline.h", line 487: warning #4232-D: conversion from "XPVIO *" to a more strictly aligned type "XPVMG *" may cause misaligned access
              SvSTASH_set(io, MUTABLE_HV(SvREFCNT_inc(GvHV(iogv))));
              ^

"../../../../sv_inline.h", line 468: warning #4276-D: relational operator ">" always evaluates to 'false'
              Zero(new_body, type_details->body_size, char);
              ^

"../../../../sv_inline.h", line 487: warning #4232-D: conversion from "XPVIO *" to a more strictly aligned type "XPVMG *" may cause misaligned access
              SvSTASH_set(io, MUTABLE_HV(SvREFCNT_inc(GvHV(iogv))));
              ^

"../../../../sv_inline.h", line 468: warning #4276-D: relational operator ">" always evaluates to 'false'
              Zero(new_body, type_details->body_size, char);
              ^

"../../../../sv_inline.h", line 487: warning #4232-D: conversion from "XPVIO *" to a more strictly aligned type "XPVMG *" may cause misaligned access
              SvSTASH_set(io, MUTABLE_HV(SvREFCNT_inc(GvHV(iogv))));
              ^

"../../../../sv_inline.h", line 468: warning #4276-D: relational operator ">" always evaluates to 'false'
              Zero(new_body, type_details->body_size, char);
              ^

"../../../../sv_inline.h", line 487: warning #4232-D: conversion from "XPVIO *" to a more strictly aligned type "XPVMG *" may cause misaligned access
              SvSTASH_set(io, MUTABLE_HV(SvREFCNT_inc(GvHV(iogv))));
              ^

"../../../../sv_inline.h", line 468: warning #4276-D: relational operator ">" always evaluates to 'false'
              Zero(new_body, type_details->body_size, char);
              ^

# Connected to 127.0.0.1
# Connected to 127.0.0.1
Integer overflow in hexadecimal number at t/broken_univ_can.t line 13.
Redefining sub xChild::foo at xChild--28360 line 2.
Redefining sub Data::ok at -e line 1.
"/pro/3gl/CPAN/perl-current/sv_inline.h", line 487: warning #4232-D: conversion from "XPVIO *" to a more strictly aligned type "XPVMG *" may cause misaligned access
              SvSTASH_set(io, MUTABLE_HV(SvREFCNT_inc(GvHV(iogv))));
              ^

"XSTest.c", line 249: warning #2111-D: statement is unreachable
  	PUTBACK;
  	^

"/pro/3gl/CPAN/perl-current/sv_inline.h", line 468: warning #4276-D: relational operator ">" always evaluates to 'false'
              Zero(new_body, type_details->body_size, char);
              ^

c++: error: +Z: No such file or directory
c++: error: +O2: No such file or directory
c++: error: +Onolimit: No such file or directory
"/pro/3gl/CPAN/perl-current/sv_inline.h", line 487: warning #4232-D: conversion from "XPVIO *" to a more strictly aligned type "XPVMG *" may cause misaligned access
              SvSTASH_set(io, MUTABLE_HV(SvREFCNT_inc(GvHV(iogv))));
              ^

"/pro/3gl/CPAN/perl-current/sv_inline.h", line 468: warning #4276-D: relational operator ">" always evaluates to 'false'
              Zero(new_body, type_details->body_size, char);
              ^

"XSMore.xs", line 48: warning #4276-D: relational operator ">" always evaluates to 'false'
     Newx(*c, lenc+1, char);
     ^

"XSMore.xs", line 63: warning #4276-D: relational operator ">" always evaluates to 'false'
     Newx(*c, lenc+1, char);
     ^

"/pro/3gl/CPAN/perl-current/sv_inline.h", line 487: warning #4232-D: conversion from "XPVIO *" to a more strictly aligned type "XPVMG *" may cause misaligned access
              SvSTASH_set(io, MUTABLE_HV(SvREFCNT_inc(GvHV(iogv))));
              ^

"/pro/3gl/CPAN/perl-current/sv_inline.h", line 468: warning #4276-D: relational operator ">" always evaluates to 'false'
              Zero(new_body, type_details->body_size, char);
              ^

Subroutine Time::HiRes::constant redefined at (eval 37) line 1.
Subroutine Time::HiRes::usleep redefined at (eval 37) line 1.
Subroutine Time::HiRes::nanosleep redefined at (eval 37) line 1.
Subroutine Time::HiRes::sleep redefined at (eval 37) line 1.
Subroutine Time::HiRes::ualarm redefined at (eval 37) line 1.
Subroutine Time::HiRes::alarm redefined at (eval 37) line 1.
Subroutine Time::HiRes::gettimeofday redefined at (eval 37) line 1.
Subroutine Time::HiRes::time redefined at (eval 37) line 1.
Subroutine Time::HiRes::setitimer redefined at (eval 37) line 1.
Subroutine Time::HiRes::getitimer redefined at (eval 37) line 1.
Subroutine Time::HiRes::utime redefined at (eval 37) line 1.
Subroutine Time::HiRes::clock_gettime redefined at (eval 37) line 1.
Subroutine Time::HiRes::clock_getres redefined at (eval 37) line 1.
Subroutine Time::HiRes::clock_nanosleep redefined at (eval 37) line 1.
Subroutine Time::HiRes::clock redefined at (eval 37) line 1.
Subroutine Time::HiRes::lstat redefined at (eval 37) line 1.
Subroutine Time::HiRes::stat redefined at (eval 37) line 1.
"../sv_inline.h", line 487: warning #4232-D: conversion from "XPVIO *" to a more strictly aligned type "XPVMG *" may cause misaligned access
              SvSTASH_set(io, MUTABLE_HV(SvREFCNT_inc(GvHV(iogv))));
              ^

"../sv_inline.h", line 468: warning #4276-D: relational operator ">" always evaluates to 'false'
              Zero(new_body, type_details->body_size, char);
              ^

cc: warning 983: The -lc library specified on the command line is also added automatically by the compiler driver.  
# Failed test 1701 - sprintf( "%.54g", 0.3 ) renders correctly at op/sprintf2.t line 1197
#      got "0.299999999999999988897769753748434596"
# expected eq "0.299999999999999988897769753748434595763683319091796875"
make: *** [test_harness] Error 1

error while running harness target 'test_harness': 2 at /pro/3gl/CPAN/smoke/lib/Test/Smoke/App/RunSmoke.pm line 118.
[2022-04-23 08:42:23+0200] 
[2022-04-23 08:42:23+0200] ../dist/Net-Ping/t/450_service.t............................PASSED
[2022-04-23 08:42:23+0200]     9, 18
[2022-04-23 08:42:23+0200] ../t/op/sprintf2.t..........................................FAILED
[2022-04-23 08:42:23+0200]     1701
[2022-04-23 08:42:23+0200] Archived results...
[2022-04-23 08:42:23+0200] TSTENV = perlio	
"../../../../sv_inline.h", line 487: warning #4232-D: conversion from "XPVIO *" to a more strictly aligned type "XPVMG *" may cause misaligned access
              SvSTASH_set(io, MUTABLE_HV(SvREFCNT_inc(GvHV(iogv))));
              ^

"../../../../sv_inline.h", line 468: warning #4276-D: relational operator ">" always evaluates to 'false'
              Zero(new_body, type_details->body_size, char);
              ^

"../../../../sv_inline.h", line 487: warning #4232-D: conversion from "XPVIO *" to a more strictly aligned type "XPVMG *" may cause misaligned access
              SvSTASH_set(io, MUTABLE_HV(SvREFCNT_inc(GvHV(iogv))));
              ^

"../../../../sv_inline.h", line 468: warning #4276-D: relational operator ">" always evaluates to 'false'
              Zero(new_body, type_details->body_size, char);
              ^

"../../../../sv_inline.h", line 487: warning #4232-D: conversion from "XPVIO *" to a more strictly aligned type "XPVMG *" may cause misaligned access
              SvSTASH_set(io, MUTABLE_HV(SvREFCNT_inc(GvHV(iogv))));
              ^

"../../../../sv_inline.h", line 468: warning #4276-D: relational operator ">" always evaluates to 'false'
              Zero(new_body, type_details->body_size, char);
              ^

"../../../../sv_inline.h", line 487: warning #4232-D: conversion from "XPVIO *" to a more strictly aligned type "XPVMG *" may cause misaligned access
              SvSTASH_set(io, MUTABLE_HV(SvREFCNT_inc(GvHV(iogv))));
              ^

"../../../../sv_inline.h", line 468: warning #4276-D: relational operator ">" always evaluates to 'false'
              Zero(new_body, type_details->body_size, char);
              ^

"../../../../sv_inline.h", line 487: warning #4232-D: conversion from "XPVIO *" to a more strictly aligned type "XPVMG *" may cause misaligned access
              SvSTASH_set(io, MUTABLE_HV(SvREFCNT_inc(GvHV(iogv))));
              ^

"../../../../sv_inline.h", line 468: warning #4276-D: relational operator ">" always evaluates to 'false'
              Zero(new_body, type_details->body_size, char);
              ^

"../../../../sv_inline.h", line 487: warning #4232-D: conversion from "XPVIO *" to a more strictly aligned type "XPVMG *" may cause misaligned access
              SvSTASH_set(io, MUTABLE_HV(SvREFCNT_inc(GvHV(iogv))));
              ^

"../../../../sv_inline.h", line 468: warning #4276-D: relational operator ">" always evaluates to 'false'
              Zero(new_body, type_details->body_size, char);
              ^

"../../../../sv_inline.h", line 487: warning #4232-D: conversion from "XPVIO *" to a more strictly aligned type "XPVMG *" may cause misaligned access
              SvSTASH_set(io, MUTABLE_HV(SvREFCNT_inc(GvHV(iogv))));
              ^

"../../../../sv_inline.h", line 468: warning #4276-D: relational operator ">" always evaluates to 'false'
              Zero(new_body, type_details->body_size, char);
              ^

"/pro/3gl/CPAN/perl-current/sv_inline.h", line 487: warning #4232-D: conversion from "XPVIO *" to a more strictly aligned type "XPVMG *" may cause misaligned access
              SvSTASH_set(io, MUTABLE_HV(SvREFCNT_inc(GvHV(iogv))));
              ^

"XSTest.c", line 249: warning #2111-D: statement is unreachable
  	PUTBACK;
  	^

"/pro/3gl/CPAN/perl-current/sv_inline.h", line 468: warning #4276-D: relational operator ">" always evaluates to 'false'
              Zero(new_body, type_details->body_size, char);
              ^

"/pro/3gl/CPAN/perl-current/sv_inline.h", line 487: warning #4232-D: conversion from "XPVIO *" to a more strictly aligned type "XPVMG *" may cause misaligned access
              SvSTASH_set(io, MUTABLE_HV(SvREFCNT_inc(GvHV(iogv))));
              ^

"/pro/3gl/CPAN/perl-current/sv_inline.h", line 468: warning #4276-D: relational operator ">" always evaluates to 'false'
              Zero(new_body, type_details->body_size, char);
              ^

"XSMore.xs", line 48: warning #4276-D: relational operator ">" always evaluates to 'false'
     Newx(*c, lenc+1, char);
     ^

"XSMore.xs", line 63: warning #4276-D: relational operator ">" always evaluates to 'false'
     Newx(*c, lenc+1, char);
     ^

"/pro/3gl/CPAN/perl-current/sv_inline.h", line 487: warning #4232-D: conversion from "XPVIO *" to a more strictly aligned type "XPVMG *" may cause misaligned access
              SvSTASH_set(io, MUTABLE_HV(SvREFCNT_inc(GvHV(iogv))));
              ^

"/pro/3gl/CPAN/perl-current/sv_inline.h", line 468: warning #4276-D: relational operator ">" always evaluates to 'false'
              Zero(new_body, type_details->body_size, char);
              ^

c++: error: +Z: No such file or directory
c++: error: +O2: No such file or directory
c++: error: +Onolimit: No such file or directory
"../sv_inline.h", line 487: warning #4232-D: conversion from "XPVIO *" to a more strictly aligned type "XPVMG *" may cause misaligned access
              SvSTASH_set(io, MUTABLE_HV(SvREFCNT_inc(GvHV(iogv))));
              ^

"../sv_inline.h", line 468: warning #4276-D: relational operator ">" always evaluates to 'false'
              Zero(new_body, type_details->body_size, char);
              ^

cc: warning 983: The -lc library specified on the command line is also added automatically by the compiler driver.  
# Failed test 1701 - sprintf( "%.54g", 0.3 ) renders correctly at op/sprintf2.t line 1197
#      got "0.299999999999999988897769753748434596"
# expected eq "0.299999999999999988897769753748434595763683319091796875"
# Connected to 127.0.0.1
# Connected to 127.0.0.1
Subroutine Time::HiRes::constant redefined at (eval 37) line 1.
Subroutine Time::HiRes::usleep redefined at (eval 37) line 1.
Subroutine Time::HiRes::nanosleep redefined at (eval 37) line 1.
Subroutine Time::HiRes::sleep redefined at (eval 37) line 1.
Subroutine Time::HiRes::ualarm redefined at (eval 37) line 1.
Subroutine Time::HiRes::alarm redefined at (eval 37) line 1.
Subroutine Time::HiRes::gettimeofday redefined at (eval 37) line 1.
Subroutine Time::HiRes::time redefined at (eval 37) line 1.
Subroutine Time::HiRes::setitimer redefined at (eval 37) line 1.
Subroutine Time::HiRes::getitimer redefined at (eval 37) line 1.
Subroutine Time::HiRes::utime redefined at (eval 37) line 1.
Subroutine Time::HiRes::clock_gettime redefined at (eval 37) line 1.
Subroutine Time::HiRes::clock_getres redefined at (eval 37) line 1.
Subroutine Time::HiRes::clock_nanosleep redefined at (eval 37) line 1.
Subroutine Time::HiRes::clock redefined at (eval 37) line 1.
Subroutine Time::HiRes::lstat redefined at (eval 37) line 1.
Subroutine Time::HiRes::stat redefined at (eval 37) line 1.
Cannot figure out an encoding to use at t/use-Encode-Alias.t line 5.
Integer overflow in hexadecimal number at t/broken_univ_can.t line 13.
make: *** [test_harness] Error 1

error while running harness target 'test_harness': 2 at /pro/3gl/CPAN/smoke/lib/Test/Smoke/App/RunSmoke.pm line 118.
[2022-04-23 08:56:30+0200] 
[2022-04-23 08:56:30+0200] ../dist/Net-Ping/t/450_service.t............................PASSED
[2022-04-23 08:56:30+0200]     9, 18
[2022-04-23 08:56:30+0200] ../t/op/sprintf2.t..........................................FAILED
[2022-04-23 08:56:30+0200]     1701
[2022-04-23 08:56:30+0200] Archived results...
[2022-04-23 08:56:30+0200] TSTENV = locale:en_US.utf8	
"../../../../sv_inline.h", line 487: warning #4232-D: conversion from "XPVIO *" to a more strictly aligned type "XPVMG *" may cause misaligned access
              SvSTASH_set(io, MUTABLE_HV(SvREFCNT_inc(GvHV(iogv))));
              ^

"../../../../sv_inline.h", line 468: warning #4276-D: relational operator ">" always evaluates to 'false'
              Zero(new_body, type_details->body_size, char);
              ^

"../../../../sv_inline.h", line 487: warning #4232-D: conversion from "XPVIO *" to a more strictly aligned type "XPVMG *" may cause misaligned access
              SvSTASH_set(io, MUTABLE_HV(SvREFCNT_inc(GvHV(iogv))));
              ^

"../../../../sv_inline.h", line 468: warning #4276-D: relational operator ">" always evaluates to 'false'
              Zero(new_body, type_details->body_size, char);
              ^

"../../../../sv_inline.h", line 487: warning #4232-D: conversion from "XPVIO *" to a more strictly aligned type "XPVMG *" may cause misaligned access
              SvSTASH_set(io, MUTABLE_HV(SvREFCNT_inc(GvHV(iogv))));
              ^

"../../../../sv_inline.h", line 468: warning #4276-D: relational operator ">" always evaluates to 'false'
              Zero(new_body, type_details->body_size, char);
              ^

"../../../../sv_inline.h", line 487: warning #4232-D: conversion from "XPVIO *" to a more strictly aligned type "XPVMG *" may cause misaligned access
              SvSTASH_set(io, MUTABLE_HV(SvREFCNT_inc(GvHV(iogv))));
              ^

"../../../../sv_inline.h", line 468: warning #4276-D: relational operator ">" always evaluates to 'false'
              Zero(new_body, type_details->body_size, char);
              ^

"../../../../sv_inline.h", line 487: warning #4232-D: conversion from "XPVIO *" to a more strictly aligned type "XPVMG *" may cause misaligned access
              SvSTASH_set(io, MUTABLE_HV(SvREFCNT_inc(GvHV(iogv))));
              ^

"../../../../sv_inline.h", line 468: warning #4276-D: relational operator ">" always evaluates to 'false'
              Zero(new_body, type_details->body_size, char);
              ^

"../../../../sv_inline.h", line 487: warning #4232-D: conversion from "XPVIO *" to a more strictly aligned type "XPVMG *" may cause misaligned access
              SvSTASH_set(io, MUTABLE_HV(SvREFCNT_inc(GvHV(iogv))));
              ^

"../../../../sv_inline.h", line 468: warning #4276-D: relational operator ">" always evaluates to 'false'
              Zero(new_body, type_details->body_size, char);
              ^

"../../../../sv_inline.h", line 487: warning #4232-D: conversion from "XPVIO *" to a more strictly aligned type "XPVMG *" may cause misaligned access
              SvSTASH_set(io, MUTABLE_HV(SvREFCNT_inc(GvHV(iogv))));
              ^

"../../../../sv_inline.h", line 468: warning #4276-D: relational operator ">" always evaluates to 'false'
              Zero(new_body, type_details->body_size, char);
              ^

"/pro/3gl/CPAN/perl-current/sv_inline.h", line 487: warning #4232-D: conversion from "XPVIO *" to a more strictly aligned type "XPVMG *" may cause misaligned access
              SvSTASH_set(io, MUTABLE_HV(SvREFCNT_inc(GvHV(iogv))));
              ^

"XSTest.c", line 249: warning #2111-D: statement is unreachable
  	PUTBACK;
  	^

"/pro/3gl/CPAN/perl-current/sv_inline.h", line 468: warning #4276-D: relational operator ">" always evaluates to 'false'
              Zero(new_body, type_details->body_size, char);
              ^

"/pro/3gl/CPAN/perl-current/sv_inline.h", line 487: warning #4232-D: conversion from "XPVIO *" to a more strictly aligned type "XPVMG *" may cause misaligned access
              SvSTASH_set(io, MUTABLE_HV(SvREFCNT_inc(GvHV(iogv))));
              ^

"/pro/3gl/CPAN/perl-current/sv_inline.h", line 468: warning #4276-D: relational operator ">" always evaluates to 'false'
              Zero(new_body, type_details->body_size, char);
              ^

"XSMore.xs", line 48: warning #4276-D: relational operator ">" always evaluates to 'false'
     Newx(*c, lenc+1, char);
     ^

"XSMore.xs", line 63: warning #4276-D: relational operator ">" always evaluates to 'false'
     Newx(*c, lenc+1, char);
     ^

"/pro/3gl/CPAN/perl-current/sv_inline.h", line 487: warning #4232-D: conversion from "XPVIO *" to a more strictly aligned type "XPVMG *" may cause misaligned access
              SvSTASH_set(io, MUTABLE_HV(SvREFCNT_inc(GvHV(iogv))));
              ^

"/pro/3gl/CPAN/perl-current/sv_inline.h", line 468: warning #4276-D: relational operator ">" always evaluates to 'false'
              Zero(new_body, type_details->body_size, char);
              ^

c++: error: +Z: No such file or directory
c++: error: +O2: No such file or directory
c++: error: +Onolimit: No such file or directory
"../sv_inline.h", line 487: warning #4232-D: conversion from "XPVIO *" to a more strictly aligned type "XPVMG *" may cause misaligned access
              SvSTASH_set(io, MUTABLE_HV(SvREFCNT_inc(GvHV(iogv))));
              ^

"../sv_inline.h", line 468: warning #4276-D: relational operator ">" always evaluates to 'false'
              Zero(new_body, type_details->body_size, char);
              ^

cc: warning 983: The -lc library specified on the command line is also added automatically by the compiler driver.  
# Failed test 1701 - sprintf( "%.54g", 0.3 ) renders correctly at op/sprintf2.t line 1197
#      got "0.299999999999999988897769753748434596"
# expected eq "0.299999999999999988897769753748434595763683319091796875"
Subroutine Time::HiRes::constant redefined at (eval 37) line 1.
Subroutine Time::HiRes::usleep redefined at (eval 37) line 1.
Subroutine Time::HiRes::nanosleep redefined at (eval 37) line 1.
Subroutine Time::HiRes::sleep redefined at (eval 37) line 1.
Subroutine Time::HiRes::ualarm redefined at (eval 37) line 1.
Subroutine Time::HiRes::alarm redefined at (eval 37) line 1.
Subroutine Time::HiRes::gettimeofday redefined at (eval 37) line 1.
Subroutine Time::HiRes::time redefined at (eval 37) line 1.
Subroutine Time::HiRes::setitimer redefined at (eval 37) line 1.
Subroutine Time::HiRes::getitimer redefined at (eval 37) line 1.
Subroutine Time::HiRes::utime redefined at (eval 37) line 1.
Subroutine Time::HiRes::clock_gettime redefined at (eval 37) line 1.
Subroutine Time::HiRes::clock_getres redefined at (eval 37) line 1.
Subroutine Time::HiRes::clock_nanosleep redefined at (eval 37) line 1.
Subroutine Time::HiRes::clock redefined at (eval 37) line 1.
Subroutine Time::HiRes::lstat redefined at (eval 37) line 1.
Subroutine Time::HiRes::stat redefined at (eval 37) line 1.
# Connected to 127.0.0.1
# Connected to 127.0.0.1
Integer overflow in hexadecimal number at t/broken_univ_can.t line 13.
make: *** [test_harness] Error 1

error while running harness target 'test_harness': 2 at /pro/3gl/CPAN/smoke/lib/Test/Smoke/App/RunSmoke.pm line 118.
[2022-04-23 09:10:23+0200] 
[2022-04-23 09:10:23+0200] ../dist/Net-Ping/t/450_service.t............................PASSED
[2022-04-23 09:10:23+0200]     9, 18
[2022-04-23 09:10:23+0200] ../t/op/sprintf2.t..........................................FAILED
[2022-04-23 09:10:23+0200]     1701
[2022-04-23 09:10:23+0200] Archived results...
[2022-04-23 09:10:23+0200] Unskip tests from '/pro/3gl/CPAN/smoke/p59.skip'
[2022-04-23 09:10:23+0200] 
[2022-04-23 09:10:23+0200] Configuration: -Dusedevel -DDEBUGGING
[2022-04-23 09:10:23+0200] ------------------------------------------------------------------------------
[2022-04-23 09:10:23+0200] make distclean ...
[2022-04-23 09:11:03+0200] 
[2022-04-23 09:11:03+0200] Copy Policy.sh ...
[2022-04-23 09:11:03+0200] 
[2022-04-23 09:11:03+0200] Configure ...
[2022-04-23 09:12:38+0200] 
[2022-04-23 09:12:38+0200] make ...
[2022-04-23 09:27:46+0200] Skip tests from '/pro/3gl/CPAN/smoke/p59.skip'
[2022-04-23 09:27:46+0200] 	cpan/Sys-Syslog/t/syslog.t
[2022-04-23 09:27:46+0200] 
[2022-04-23 09:27:46+0200]  Tests start here:
[2022-04-23 09:27:46+0200] TSTENV = stdio	
No saved state, selection will be empty
Cannot figure out an encoding to use at t/use-Encode-Alias.t line 5.
"../../../../sv_inline.h", line 487: warning #4232-D: conversion from "XPVIO *" to a more strictly aligned type "XPVMG *" may cause misaligned access
              SvSTASH_set(io, MUTABLE_HV(SvREFCNT_inc(GvHV(iogv))));
              ^

"../../../../sv_inline.h", line 468: warning #4276-D: relational operator ">" always evaluates to 'false'
              Zero(new_body, type_details->body_size, char);
              ^

"../../../../sv_inline.h", line 487: warning #4232-D: conversion from "XPVIO *" to a more strictly aligned type "XPVMG *" may cause misaligned access
              SvSTASH_set(io, MUTABLE_HV(SvREFCNT_inc(GvHV(iogv))));
              ^

"../../../../sv_inline.h", line 468: warning #4276-D: relational operator ">" always evaluates to 'false'
              Zero(new_body, type_details->body_size, char);
              ^

"../../../../sv_inline.h", line 487: warning #4232-D: conversion from "XPVIO *" to a more strictly aligned type "XPVMG *" may cause misaligned access
              SvSTASH_set(io, MUTABLE_HV(SvREFCNT_inc(GvHV(iogv))));
              ^

"../../../../sv_inline.h", line 468: warning #4276-D: relational operator ">" always evaluates to 'false'
              Zero(new_body, type_details->body_size, char);
              ^

"../../../../sv_inline.h", line 487: warning #4232-D: conversion from "XPVIO *" to a more strictly aligned type "XPVMG *" may cause misaligned access
              SvSTASH_set(io, MUTABLE_HV(SvREFCNT_inc(GvHV(iogv))));
              ^

"../../../../sv_inline.h", line 468: warning #4276-D: relational operator ">" always evaluates to 'false'
              Zero(new_body, type_details->body_size, char);
              ^

"../../../../sv_inline.h", line 487: warning #4232-D: conversion from "XPVIO *" to a more strictly aligned type "XPVMG *" may cause misaligned access
              SvSTASH_set(io, MUTABLE_HV(SvREFCNT_inc(GvHV(iogv))));
              ^

"../../../../sv_inline.h", line 468: warning #4276-D: relational operator ">" always evaluates to 'false'
              Zero(new_body, type_details->body_size, char);
              ^

"../../../../sv_inline.h", line 487: warning #4232-D: conversion from "XPVIO *" to a more strictly aligned type "XPVMG *" may cause misaligned access
              SvSTASH_set(io, MUTABLE_HV(SvREFCNT_inc(GvHV(iogv))));
              ^

"../../../../sv_inline.h", line 468: warning #4276-D: relational operator ">" always evaluates to 'false'
              Zero(new_body, type_details->body_size, char);
              ^

"../../../../sv_inline.h", line 487: warning #4232-D: conversion from "XPVIO *" to a more strictly aligned type "XPVMG *" may cause misaligned access
              SvSTASH_set(io, MUTABLE_HV(SvREFCNT_inc(GvHV(iogv))));
              ^

"../../../../sv_inline.h", line 468: warning #4276-D: relational operator ">" always evaluates to 'false'
              Zero(new_body, type_details->body_size, char);
              ^

# Connected to 127.0.0.1
# Connected to 127.0.0.1
Integer overflow in hexadecimal number at t/broken_univ_can.t line 13.
Redefining sub xChild::foo at xChild--6322 line 2.
Redefining sub Data::ok at -e line 1.
"/pro/3gl/CPAN/perl-current/sv_inline.h", line 487: warning #4232-D: conversion from "XPVIO *" to a more strictly aligned type "XPVMG *" may cause misaligned access
              SvSTASH_set(io, MUTABLE_HV(SvREFCNT_inc(GvHV(iogv))));
              ^

"XSTest.c", line 249: warning #2111-D: statement is unreachable
  	PUTBACK;
  	^

"/pro/3gl/CPAN/perl-current/sv_inline.h", line 468: warning #4276-D: relational operator ">" always evaluates to 'false'
              Zero(new_body, type_details->body_size, char);
              ^

c++: error: +Z: No such file or directory
c++: error: +O2: No such file or directory
c++: error: +Onolimit: No such file or directory
"/pro/3gl/CPAN/perl-current/sv_inline.h", line 487: warning #4232-D: conversion from "XPVIO *" to a more strictly aligned type "XPVMG *" may cause misaligned access
              SvSTASH_set(io, MUTABLE_HV(SvREFCNT_inc(GvHV(iogv))));
              ^

"/pro/3gl/CPAN/perl-current/sv_inline.h", line 468: warning #4276-D: relational operator ">" always evaluates to 'false'
              Zero(new_body, type_details->body_size, char);
              ^

"XSMore.xs", line 48: warning #4276-D: relational operator ">" always evaluates to 'false'
     Newx(*c, lenc+1, char);
     ^

"XSMore.xs", line 63: warning #4276-D: relational operator ">" always evaluates to 'false'
     Newx(*c, lenc+1, char);
     ^

"/pro/3gl/CPAN/perl-current/sv_inline.h", line 487: warning #4232-D: conversion from "XPVIO *" to a more strictly aligned type "XPVMG *" may cause misaligned access
              SvSTASH_set(io, MUTABLE_HV(SvREFCNT_inc(GvHV(iogv))));
              ^

"/pro/3gl/CPAN/perl-current/sv_inline.h", line 468: warning #4276-D: relational operator ">" always evaluates to 'false'
              Zero(new_body, type_details->body_size, char);
              ^

Subroutine Time::HiRes::constant redefined at (eval 37) line 1.
Subroutine Time::HiRes::usleep redefined at (eval 37) line 1.
Subroutine Time::HiRes::nanosleep redefined at (eval 37) line 1.
Subroutine Time::HiRes::sleep redefined at (eval 37) line 1.
Subroutine Time::HiRes::ualarm redefined at (eval 37) line 1.
Subroutine Time::HiRes::alarm redefined at (eval 37) line 1.
Subroutine Time::HiRes::gettimeofday redefined at (eval 37) line 1.
Subroutine Time::HiRes::time redefined at (eval 37) line 1.
Subroutine Time::HiRes::setitimer redefined at (eval 37) line 1.
Subroutine Time::HiRes::getitimer redefined at (eval 37) line 1.
Subroutine Time::HiRes::utime redefined at (eval 37) line 1.
Subroutine Time::HiRes::clock_gettime redefined at (eval 37) line 1.
Subroutine Time::HiRes::clock_getres redefined at (eval 37) line 1.
Subroutine Time::HiRes::clock_nanosleep redefined at (eval 37) line 1.
Subroutine Time::HiRes::clock redefined at (eval 37) line 1.
Subroutine Time::HiRes::lstat redefined at (eval 37) line 1.
Subroutine Time::HiRes::stat redefined at (eval 37) line 1.
"../sv_inline.h", line 487: warning #4232-D: conversion from "XPVIO *" to a more strictly aligned type "XPVMG *" may cause misaligned access
              SvSTASH_set(io, MUTABLE_HV(SvREFCNT_inc(GvHV(iogv))));
              ^

"../sv_inline.h", line 468: warning #4276-D: relational operator ">" always evaluates to 'false'
              Zero(new_body, type_details->body_size, char);
              ^

cc: warning 983: The -lc library specified on the command line is also added automatically by the compiler driver.  
# Failed test 1701 - sprintf( "%.54g", 0.3 ) renders correctly at op/sprintf2.t line 1197
#      got "0.299999999999999988897769753748434596"
# expected eq "0.299999999999999988897769753748434595763683319091796875"
make: *** [test_harness] Error 1

error while running harness target 'test_harness': 2 at /pro/3gl/CPAN/smoke/lib/Test/Smoke/App/RunSmoke.pm line 118.
[2022-04-23 09:46:12+0200] 
[2022-04-23 09:46:12+0200] ../dist/Net-Ping/t/450_service.t............................PASSED
[2022-04-23 09:46:12+0200]     9, 18
[2022-04-23 09:46:12+0200] ../t/op/sprintf2.t..........................................FAILED
[2022-04-23 09:46:12+0200]     1701
[2022-04-23 09:46:12+0200] Archived results...
[2022-04-23 09:46:12+0200] TSTENV = perlio	
"../../../../sv_inline.h", line 487: warning #4232-D: conversion from "XPVIO *" to a more strictly aligned type "XPVMG *" may cause misaligned access
              SvSTASH_set(io, MUTABLE_HV(SvREFCNT_inc(GvHV(iogv))));
              ^

"../../../../sv_inline.h", line 468: warning #4276-D: relational operator ">" always evaluates to 'false'
              Zero(new_body, type_details->body_size, char);
              ^

"../../../../sv_inline.h", line 487: warning #4232-D: conversion from "XPVIO *" to a more strictly aligned type "XPVMG *" may cause misaligned access
              SvSTASH_set(io, MUTABLE_HV(SvREFCNT_inc(GvHV(iogv))));
              ^

"../../../../sv_inline.h", line 468: warning #4276-D: relational operator ">" always evaluates to 'false'
              Zero(new_body, type_details->body_size, char);
              ^

"../../../../sv_inline.h", line 487: warning #4232-D: conversion from "XPVIO *" to a more strictly aligned type "XPVMG *" may cause misaligned access
              SvSTASH_set(io, MUTABLE_HV(SvREFCNT_inc(GvHV(iogv))));
              ^

"../../../../sv_inline.h", line 468: warning #4276-D: relational operator ">" always evaluates to 'false'
              Zero(new_body, type_details->body_size, char);
              ^

"../../../../sv_inline.h", line 487: warning #4232-D: conversion from "XPVIO *" to a more strictly aligned type "XPVMG *" may cause misaligned access
              SvSTASH_set(io, MUTABLE_HV(SvREFCNT_inc(GvHV(iogv))));
              ^

"../../../../sv_inline.h", line 468: warning #4276-D: relational operator ">" always evaluates to 'false'
              Zero(new_body, type_details->body_size, char);
              ^

"../../../../sv_inline.h", line 487: warning #4232-D: conversion from "XPVIO *" to a more strictly aligned type "XPVMG *" may cause misaligned access
              SvSTASH_set(io, MUTABLE_HV(SvREFCNT_inc(GvHV(iogv))));
              ^

"../../../../sv_inline.h", line 468: warning #4276-D: relational operator ">" always evaluates to 'false'
              Zero(new_body, type_details->body_size, char);
              ^

"../../../../sv_inline.h", line 487: warning #4232-D: conversion from "XPVIO *" to a more strictly aligned type "XPVMG *" may cause misaligned access
              SvSTASH_set(io, MUTABLE_HV(SvREFCNT_inc(GvHV(iogv))));
              ^

"../../../../sv_inline.h", line 468: warning #4276-D: relational operator ">" always evaluates to 'false'
              Zero(new_body, type_details->body_size, char);
              ^

"../../../../sv_inline.h", line 487: warning #4232-D: conversion from "XPVIO *" to a more strictly aligned type "XPVMG *" may cause misaligned access
              SvSTASH_set(io, MUTABLE_HV(SvREFCNT_inc(GvHV(iogv))));
              ^

"../../../../sv_inline.h", line 468: warning #4276-D: relational operator ">" always evaluates to 'false'
              Zero(new_body, type_details->body_size, char);
              ^

"/pro/3gl/CPAN/perl-current/sv_inline.h", line 487: warning #4232-D: conversion from "XPVIO *" to a more strictly aligned type "XPVMG *" may cause misaligned access
              SvSTASH_set(io, MUTABLE_HV(SvREFCNT_inc(GvHV(iogv))));
              ^

"XSTest.c", line 249: warning #2111-D: statement is unreachable
  	PUTBACK;
  	^

"/pro/3gl/CPAN/perl-current/sv_inline.h", line 468: warning #4276-D: relational operator ">" always evaluates to 'false'
              Zero(new_body, type_details->body_size, char);
              ^

"/pro/3gl/CPAN/perl-current/sv_inline.h", line 487: warning #4232-D: conversion from "XPVIO *" to a more strictly aligned type "XPVMG *" may cause misaligned access
              SvSTASH_set(io, MUTABLE_HV(SvREFCNT_inc(GvHV(iogv))));
              ^

"/pro/3gl/CPAN/perl-current/sv_inline.h", line 468: warning #4276-D: relational operator ">" always evaluates to 'false'
              Zero(new_body, type_details->body_size, char);
              ^

"XSMore.xs", line 48: warning #4276-D: relational operator ">" always evaluates to 'false'
     Newx(*c, lenc+1, char);
     ^

"XSMore.xs", line 63: warning #4276-D: relational operator ">" always evaluates to 'false'
     Newx(*c, lenc+1, char);
     ^

"/pro/3gl/CPAN/perl-current/sv_inline.h", line 487: warning #4232-D: conversion from "XPVIO *" to a more strictly aligned type "XPVMG *" may cause misaligned access
              SvSTASH_set(io, MUTABLE_HV(SvREFCNT_inc(GvHV(iogv))));
              ^

"/pro/3gl/CPAN/perl-current/sv_inline.h", line 468: warning #4276-D: relational operator ">" always evaluates to 'false'
              Zero(new_body, type_details->body_size, char);
              ^

c++: error: +Z: No such file or directory
c++: error: +O2: No such file or directory
c++: error: +Onolimit: No such file or directory
"../sv_inline.h", line 487: warning #4232-D: conversion from "XPVIO *" to a more strictly aligned type "XPVMG *" may cause misaligned access
              SvSTASH_set(io, MUTABLE_HV(SvREFCNT_inc(GvHV(iogv))));
              ^

"../sv_inline.h", line 468: warning #4276-D: relational operator ">" always evaluates to 'false'
              Zero(new_body, type_details->body_size, char);
              ^

cc: warning 983: The -lc library specified on the command line is also added automatically by the compiler driver.  
# Failed test 1701 - sprintf( "%.54g", 0.3 ) renders correctly at op/sprintf2.t line 1197
#      got "0.299999999999999988897769753748434596"
# expected eq "0.299999999999999988897769753748434595763683319091796875"
# Connected to 127.0.0.1
# Connected to 127.0.0.1
Subroutine Time::HiRes::constant redefined at (eval 37) line 1.
Subroutine Time::HiRes::usleep redefined at (eval 37) line 1.
Subroutine Time::HiRes::nanosleep redefined at (eval 37) line 1.
Subroutine Time::HiRes::sleep redefined at (eval 37) line 1.
Subroutine Time::HiRes::ualarm redefined at (eval 37) line 1.
Subroutine Time::HiRes::alarm redefined at (eval 37) line 1.
Subroutine Time::HiRes::gettimeofday redefined at (eval 37) line 1.
Subroutine Time::HiRes::time redefined at (eval 37) line 1.
Subroutine Time::HiRes::setitimer redefined at (eval 37) line 1.
Subroutine Time::HiRes::getitimer redefined at (eval 37) line 1.
Subroutine Time::HiRes::utime redefined at (eval 37) line 1.
Subroutine Time::HiRes::clock_gettime redefined at (eval 37) line 1.
Subroutine Time::HiRes::clock_getres redefined at (eval 37) line 1.
Subroutine Time::HiRes::clock_nanosleep redefined at (eval 37) line 1.
Subroutine Time::HiRes::clock redefined at (eval 37) line 1.
Subroutine Time::HiRes::lstat redefined at (eval 37) line 1.
Subroutine Time::HiRes::stat redefined at (eval 37) line 1.
Cannot figure out an encoding to use at t/use-Encode-Alias.t line 5.
Integer overflow in hexadecimal number at t/broken_univ_can.t line 13.
make: *** [test_harness] Error 1

error while running harness target 'test_harness': 2 at /pro/3gl/CPAN/smoke/lib/Test/Smoke/App/RunSmoke.pm line 118.
[2022-04-23 10:02:07+0200] 
[2022-04-23 10:02:07+0200] ../dist/Net-Ping/t/450_service.t............................PASSED
[2022-04-23 10:02:07+0200]     9, 18
[2022-04-23 10:02:07+0200] ../t/op/sprintf2.t..........................................FAILED
[2022-04-23 10:02:07+0200]     1701
[2022-04-23 10:02:07+0200] Archived results...
[2022-04-23 10:02:07+0200] TSTENV = locale:en_US.utf8	
"../../../../sv_inline.h", line 487: warning #4232-D: conversion from "XPVIO *" to a more strictly aligned type "XPVMG *" may cause misaligned access
              SvSTASH_set(io, MUTABLE_HV(SvREFCNT_inc(GvHV(iogv))));
              ^

"../../../../sv_inline.h", line 468: warning #4276-D: relational operator ">" always evaluates to 'false'
              Zero(new_body, type_details->body_size, char);
              ^

"../../../../sv_inline.h", line 487: warning #4232-D: conversion from "XPVIO *" to a more strictly aligned type "XPVMG *" may cause misaligned access
              SvSTASH_set(io, MUTABLE_HV(SvREFCNT_inc(GvHV(iogv))));
              ^

"../../../../sv_inline.h", line 468: warning #4276-D: relational operator ">" always evaluates to 'false'
              Zero(new_body, type_details->body_size, char);
              ^

"../../../../sv_inline.h", line 487: warning #4232-D: conversion from "XPVIO *" to a more strictly aligned type "XPVMG *" may cause misaligned access
              SvSTASH_set(io, MUTABLE_HV(SvREFCNT_inc(GvHV(iogv))));
              ^

"../../../../sv_inline.h", line 468: warning #4276-D: relational operator ">" always evaluates to 'false'
              Zero(new_body, type_details->body_size, char);
              ^

"../../../../sv_inline.h", line 487: warning #4232-D: conversion from "XPVIO *" to a more strictly aligned type "XPVMG *" may cause misaligned access
              SvSTASH_set(io, MUTABLE_HV(SvREFCNT_inc(GvHV(iogv))));
              ^

"../../../../sv_inline.h", line 468: warning #4276-D: relational operator ">" always evaluates to 'false'
              Zero(new_body, type_details->body_size, char);
              ^

"../../../../sv_inline.h", line 487: warning #4232-D: conversion from "XPVIO *" to a more strictly aligned type "XPVMG *" may cause misaligned access
              SvSTASH_set(io, MUTABLE_HV(SvREFCNT_inc(GvHV(iogv))));
              ^

"../../../../sv_inline.h", line 468: warning #4276-D: relational operator ">" always evaluates to 'false'
              Zero(new_body, type_details->body_size, char);
              ^

"../../../../sv_inline.h", line 487: warning #4232-D: conversion from "XPVIO *" to a more strictly aligned type "XPVMG *" may cause misaligned access
              SvSTASH_set(io, MUTABLE_HV(SvREFCNT_inc(GvHV(iogv))));
              ^

"../../../../sv_inline.h", line 468: warning #4276-D: relational operator ">" always evaluates to 'false'
              Zero(new_body, type_details->body_size, char);
              ^

"../../../../sv_inline.h", line 487: warning #4232-D: conversion from "XPVIO *" to a more strictly aligned type "XPVMG *" may cause misaligned access
              SvSTASH_set(io, MUTABLE_HV(SvREFCNT_inc(GvHV(iogv))));
              ^

"../../../../sv_inline.h", line 468: warning #4276-D: relational operator ">" always evaluates to 'false'
              Zero(new_body, type_details->body_size, char);
              ^

"/pro/3gl/CPAN/perl-current/sv_inline.h", line 487: warning #4232-D: conversion from "XPVIO *" to a more strictly aligned type "XPVMG *" may cause misaligned access
              SvSTASH_set(io, MUTABLE_HV(SvREFCNT_inc(GvHV(iogv))));
              ^

"XSTest.c", line 249: warning #2111-D: statement is unreachable
  	PUTBACK;
  	^

"/pro/3gl/CPAN/perl-current/sv_inline.h", line 468: warning #4276-D: relational operator ">" always evaluates to 'false'
              Zero(new_body, type_details->body_size, char);
              ^

"/pro/3gl/CPAN/perl-current/sv_inline.h", line 487: warning #4232-D: conversion from "XPVIO *" to a more strictly aligned type "XPVMG *" may cause misaligned access
              SvSTASH_set(io, MUTABLE_HV(SvREFCNT_inc(GvHV(iogv))));
              ^

"/pro/3gl/CPAN/perl-current/sv_inline.h", line 468: warning #4276-D: relational operator ">" always evaluates to 'false'
              Zero(new_body, type_details->body_size, char);
              ^

"XSMore.xs", line 48: warning #4276-D: relational operator ">" always evaluates to 'false'
     Newx(*c, lenc+1, char);
     ^

"XSMore.xs", line 63: warning #4276-D: relational operator ">" always evaluates to 'false'
     Newx(*c, lenc+1, char);
     ^

"/pro/3gl/CPAN/perl-current/sv_inline.h", line 487: warning #4232-D: conversion from "XPVIO *" to a more strictly aligned type "XPVMG *" may cause misaligned access
              SvSTASH_set(io, MUTABLE_HV(SvREFCNT_inc(GvHV(iogv))));
              ^

"/pro/3gl/CPAN/perl-current/sv_inline.h", line 468: warning #4276-D: relational operator ">" always evaluates to 'false'
              Zero(new_body, type_details->body_size, char);
              ^

c++: error: +Z: No such file or directory
c++: error: +O2: No such file or directory
c++: error: +Onolimit: No such file or directory
"../sv_inline.h", line 487: warning #4232-D: conversion from "XPVIO *" to a more strictly aligned type "XPVMG *" may cause misaligned access
              SvSTASH_set(io, MUTABLE_HV(SvREFCNT_inc(GvHV(iogv))));
              ^

"../sv_inline.h", line 468: warning #4276-D: relational operator ">" always evaluates to 'false'
              Zero(new_body, type_details->body_size, char);
              ^

cc: warning 983: The -lc library specified on the command line is also added automatically by the compiler driver.  
# Failed test 1701 - sprintf( "%.54g", 0.3 ) renders correctly at op/sprintf2.t line 1197
#      got "0.299999999999999988897769753748434596"
# expected eq "0.299999999999999988897769753748434595763683319091796875"
Subroutine Time::HiRes::constant redefined at (eval 37) line 1.
Subroutine Time::HiRes::usleep redefined at (eval 37) line 1.
Subroutine Time::HiRes::nanosleep redefined at (eval 37) line 1.
Subroutine Time::HiRes::sleep redefined at (eval 37) line 1.
Subroutine Time::HiRes::ualarm redefined at (eval 37) line 1.
Subroutine Time::HiRes::alarm redefined at (eval 37) line 1.
Subroutine Time::HiRes::gettimeofday redefined at (eval 37) line 1.
Subroutine Time::HiRes::time redefined at (eval 37) line 1.
Subroutine Time::HiRes::setitimer redefined at (eval 37) line 1.
Subroutine Time::HiRes::getitimer redefined at (eval 37) line 1.
Subroutine Time::HiRes::utime redefined at (eval 37) line 1.
Subroutine Time::HiRes::clock_gettime redefined at (eval 37) line 1.
Subroutine Time::HiRes::clock_getres redefined at (eval 37) line 1.
Subroutine Time::HiRes::clock_nanosleep redefined at (eval 37) line 1.
Subroutine Time::HiRes::clock redefined at (eval 37) line 1.
Subroutine Time::HiRes::lstat redefined at (eval 37) line 1.
Subroutine Time::HiRes::stat redefined at (eval 37) line 1.
# Connected to 127.0.0.1
# Connected to 127.0.0.1
Integer overflow in hexadecimal number at t/broken_univ_can.t line 13.
make: *** [test_harness] Error 1

error while running harness target 'test_harness': 2 at /pro/3gl/CPAN/smoke/lib/Test/Smoke/App/RunSmoke.pm line 118.
[2022-04-23 10:18:01+0200] 
[2022-04-23 10:18:01+0200] ../dist/Net-Ping/t/450_service.t............................PASSED
[2022-04-23 10:18:01+0200]     9, 18
[2022-04-23 10:18:01+0200] ../t/op/sprintf2.t..........................................FAILED
[2022-04-23 10:18:01+0200]     1701
[2022-04-23 10:18:01+0200] Archived results...
[2022-04-23 10:18:01+0200] Unskip tests from '/pro/3gl/CPAN/smoke/p59.skip'
[2022-04-23 10:18:01+0200] 
[2022-04-23 10:18:01+0200] Configuration: -Dusedevel -Duse64bitall
[2022-04-23 10:18:01+0200] ------------------------------------------------------------------------------
[2022-04-23 10:18:01+0200] make distclean ...
[2022-04-23 10:18:45+0200] 
[2022-04-23 10:18:45+0200] Copy Policy.sh ...
[2022-04-23 10:18:45+0200] 
[2022-04-23 10:18:45+0200] Configure ...
[2022-04-23 10:20:17+0200] 
[2022-04-23 10:20:17+0200] make ...
[2022-04-23 10:33:16+0200] Skip tests from '/pro/3gl/CPAN/smoke/p59.skip'
[2022-04-23 10:33:16+0200] 	cpan/Sys-Syslog/t/syslog.t
[2022-04-23 10:33:16+0200] 
[2022-04-23 10:33:16+0200]  Tests start here:
[2022-04-23 10:33:16+0200] TSTENV = stdio	
No saved state, selection will be empty
Cannot figure out an encoding to use at t/use-Encode-Alias.t line 5.
"../../../../sv_inline.h", line 468: warning #4276-D: relational operator ">" always evaluates to 'false'
              Zero(new_body, type_details->body_size, char);
              ^

"../../../../sv_inline.h", line 468: warning #4276-D: relational operator ">" always evaluates to 'false'
              Zero(new_body, type_details->body_size, char);
              ^

"../../../../sv_inline.h", line 468: warning #4276-D: relational operator ">" always evaluates to 'false'
              Zero(new_body, type_details->body_size, char);
              ^

"../../../../sv_inline.h", line 468: warning #4276-D: relational operator ">" always evaluates to 'false'
              Zero(new_body, type_details->body_size, char);
              ^

"../../../../sv_inline.h", line 468: warning #4276-D: relational operator ">" always evaluates to 'false'
              Zero(new_body, type_details->body_size, char);
              ^

"../../../../sv_inline.h", line 468: warning #4276-D: relational operator ">" always evaluates to 'false'
              Zero(new_body, type_details->body_size, char);
              ^

"../../../../sv_inline.h", line 468: warning #4276-D: relational operator ">" always evaluates to 'false'
              Zero(new_body, type_details->body_size, char);
              ^

# Connected to 127.0.0.1
# Connected to 127.0.0.1
Redefining sub xChild::foo at xChild--14023 line 2.
Redefining sub Data::ok at -e line 1.
"XSTest.c", line 249: warning #2111-D: statement is unreachable
  	PUTBACK;
  	^

"/pro/3gl/CPAN/perl-current/sv_inline.h", line 468: warning #4276-D: relational operator ">" always evaluates to 'false'
              Zero(new_body, type_details->body_size, char);
              ^

c++: error: +Z: No such file or directory
c++: error: +O2: No such file or directory
c++: error: +Onolimit: No such file or directory
"/pro/3gl/CPAN/perl-current/sv_inline.h", line 468: warning #4276-D: relational operator ">" always evaluates to 'false'
              Zero(new_body, type_details->body_size, char);
              ^

"XSMore.xs", line 48: warning #4276-D: relational operator ">" always evaluates to 'false'
     Newx(*c, lenc+1, char);
     ^

"XSMore.xs", line 63: warning #4276-D: relational operator ">" always evaluates to 'false'
     Newx(*c, lenc+1, char);
     ^

"/pro/3gl/CPAN/perl-current/sv_inline.h", line 468: warning #4276-D: relational operator ">" always evaluates to 'false'
              Zero(new_body, type_details->body_size, char);
              ^

Subroutine Time::HiRes::constant redefined at (eval 37) line 1.
Subroutine Time::HiRes::usleep redefined at (eval 37) line 1.
Subroutine Time::HiRes::nanosleep redefined at (eval 37) line 1.
Subroutine Time::HiRes::sleep redefined at (eval 37) line 1.
Subroutine Time::HiRes::ualarm redefined at (eval 37) line 1.
Subroutine Time::HiRes::alarm redefined at (eval 37) line 1.
Subroutine Time::HiRes::gettimeofday redefined at (eval 37) line 1.
Subroutine Time::HiRes::time redefined at (eval 37) line 1.
Subroutine Time::HiRes::setitimer redefined at (eval 37) line 1.
Subroutine Time::HiRes::getitimer redefined at (eval 37) line 1.
Subroutine Time::HiRes::utime redefined at (eval 37) line 1.
Subroutine Time::HiRes::clock_gettime redefined at (eval 37) line 1.
Subroutine Time::HiRes::clock_getres redefined at (eval 37) line 1.
Subroutine Time::HiRes::clock_nanosleep redefined at (eval 37) line 1.
Subroutine Time::HiRes::clock redefined at (eval 37) line 1.
Subroutine Time::HiRes::lstat redefined at (eval 37) line 1.
Subroutine Time::HiRes::stat redefined at (eval 37) line 1.
"../sv_inline.h", line 468: warning #4276-D: relational operator ">" always evaluates to 'false'
              Zero(new_body, type_details->body_size, char);
              ^

cc: warning 983: The -lc library specified on the command line is also added automatically by the compiler driver.  
# Failed test 1704 - sprintf( "%.54g", 0.3 ) renders correctly at op/sprintf2.t line 1197
#      got "0.299999999999999988897769753748434596"
# expected eq "0.299999999999999988897769753748434595763683319091796875"
make: *** [test_harness] Error 1

error while running harness target 'test_harness': 2 at /pro/3gl/CPAN/smoke/lib/Test/Smoke/App/RunSmoke.pm line 118.
[2022-04-23 10:50:15+0200] 
[2022-04-23 10:50:15+0200] ../dist/Net-Ping/t/450_service.t............................PASSED
[2022-04-23 10:50:15+0200]     9, 18
[2022-04-23 10:50:15+0200] ../t/op/sprintf2.t..........................................FAILED
[2022-04-23 10:50:15+0200]     1704
[2022-04-23 10:50:15+0200] ../t/re/reg_mesg.t..........................................FAILED
[2022-04-23 10:50:15+0200]     No plan found in TAP output
[2022-04-23 10:50:15+0200] ../t/re/regex_sets.t........................................FAILED
[2022-04-23 10:50:15+0200]     No plan found in TAP output
[2022-04-23 10:50:15+0200] Archived results...
[2022-04-23 10:50:15+0200] TSTENV = perlio	
"../../../../sv_inline.h", line 468: warning #4276-D: relational operator ">" always evaluates to 'false'
              Zero(new_body, type_details->body_size, char);
              ^

"../../../../sv_inline.h", line 468: warning #4276-D: relational operator ">" always evaluates to 'false'
              Zero(new_body, type_details->body_size, char);
              ^

"../../../../sv_inline.h", line 468: warning #4276-D: relational operator ">" always evaluates to 'false'
              Zero(new_body, type_details->body_size, char);
              ^

"../../../../sv_inline.h", line 468: warning #4276-D: relational operator ">" always evaluates to 'false'
              Zero(new_body, type_details->body_size, char);
              ^

"../../../../sv_inline.h", line 468: warning #4276-D: relational operator ">" always evaluates to 'false'
              Zero(new_body, type_details->body_size, char);
              ^

"../../../../sv_inline.h", line 468: warning #4276-D: relational operator ">" always evaluates to 'false'
              Zero(new_body, type_details->body_size, char);
              ^

"../../../../sv_inline.h", line 468: warning #4276-D: relational operator ">" always evaluates to 'false'
              Zero(new_body, type_details->body_size, char);
              ^

"XSTest.c", line 249: warning #2111-D: statement is unreachable
  	PUTBACK;
  	^

"/pro/3gl/CPAN/perl-current/sv_inline.h", line 468: warning #4276-D: relational operator ">" always evaluates to 'false'
              Zero(new_body, type_details->body_size, char);
              ^

"/pro/3gl/CPAN/perl-current/sv_inline.h", line 468: warning #4276-D: relational operator ">" always evaluates to 'false'
              Zero(new_body, type_details->body_size, char);
              ^

"XSMore.xs", line 48: warning #4276-D: relational operator ">" always evaluates to 'false'
     Newx(*c, lenc+1, char);
     ^

"XSMore.xs", line 63: warning #4276-D: relational operator ">" always evaluates to 'false'
     Newx(*c, lenc+1, char);
     ^

"/pro/3gl/CPAN/perl-current/sv_inline.h", line 468: warning #4276-D: relational operator ">" always evaluates to 'false'
              Zero(new_body, type_details->body_size, char);
              ^

c++: error: +Z: No such file or directory
c++: error: +O2: No such file or directory
c++: error: +Onolimit: No such file or directory
"../sv_inline.h", line 468: warning #4276-D: relational operator ">" always evaluates to 'false'
              Zero(new_body, type_details->body_size, char);
              ^

cc: warning 983: The -lc library specified on the command line is also added automatically by the compiler driver.  
# Failed test 1704 - sprintf( "%.54g", 0.3 ) renders correctly at op/sprintf2.t line 1197
#      got "0.299999999999999988897769753748434596"
# expected eq "0.299999999999999988897769753748434595763683319091796875"
# Connected to 127.0.0.1
# Connected to 127.0.0.1
Subroutine Time::HiRes::constant redefined at (eval 37) line 1.
Subroutine Time::HiRes::usleep redefined at (eval 37) line 1.
Subroutine Time::HiRes::nanosleep redefined at (eval 37) line 1.
Subroutine Time::HiRes::sleep redefined at (eval 37) line 1.
Subroutine Time::HiRes::ualarm redefined at (eval 37) line 1.
Subroutine Time::HiRes::alarm redefined at (eval 37) line 1.
Subroutine Time::HiRes::gettimeofday redefined at (eval 37) line 1.
Subroutine Time::HiRes::time redefined at (eval 37) line 1.
Subroutine Time::HiRes::setitimer redefined at (eval 37) line 1.
Subroutine Time::HiRes::getitimer redefined at (eval 37) line 1.
Subroutine Time::HiRes::utime redefined at (eval 37) line 1.
Subroutine Time::HiRes::clock_gettime redefined at (eval 37) line 1.
Subroutine Time::HiRes::clock_getres redefined at (eval 37) line 1.
Subroutine Time::HiRes::clock_nanosleep redefined at (eval 37) line 1.
Subroutine Time::HiRes::clock redefined at (eval 37) line 1.
Subroutine Time::HiRes::lstat redefined at (eval 37) line 1.
Subroutine Time::HiRes::stat redefined at (eval 37) line 1.
Cannot figure out an encoding to use at t/use-Encode-Alias.t line 5.
make: *** [test_harness] Error 1

error while running harness target 'test_harness': 2 at /pro/3gl/CPAN/smoke/lib/Test/Smoke/App/RunSmoke.pm line 118.
[2022-04-23 11:04:52+0200] 
[2022-04-23 11:04:52+0200] ../dist/Net-Ping/t/450_service.t............................PASSED
[2022-04-23 11:04:52+0200]     9, 18
[2022-04-23 11:04:52+0200] ../t/op/sprintf2.t..........................................FAILED
[2022-04-23 11:04:52+0200]     1704
[2022-04-23 11:04:52+0200] ../t/re/reg_mesg.t..........................................FAILED
[2022-04-23 11:04:52+0200]     No plan found in TAP output
[2022-04-23 11:04:52+0200] ../t/re/regex_sets.t........................................FAILED
[2022-04-23 11:04:52+0200]     No plan found in TAP output
[2022-04-23 11:04:52+0200] Archived results...
[2022-04-23 11:04:52+0200] TSTENV = locale:en_US.utf8	
"../../../../sv_inline.h", line 468: warning #4276-D: relational operator ">" always evaluates to 'false'
              Zero(new_body, type_details->body_size, char);
              ^

"../../../../sv_inline.h", line 468: warning #4276-D: relational operator ">" always evaluates to 'false'
              Zero(new_body, type_details->body_size, char);
              ^

"../../../../sv_inline.h", line 468: warning #4276-D: relational operator ">" always evaluates to 'false'
              Zero(new_body, type_details->body_size, char);
              ^

"../../../../sv_inline.h", line 468: warning #4276-D: relational operator ">" always evaluates to 'false'
              Zero(new_body, type_details->body_size, char);
              ^

"../../../../sv_inline.h", line 468: warning #4276-D: relational operator ">" always evaluates to 'false'
              Zero(new_body, type_details->body_size, char);
              ^

"../../../../sv_inline.h", line 468: warning #4276-D: relational operator ">" always evaluates to 'false'
              Zero(new_body, type_details->body_size, char);
              ^

"../../../../sv_inline.h", line 468: warning #4276-D: relational operator ">" always evaluates to 'false'
              Zero(new_body, type_details->body_size, char);
              ^

"XSTest.c", line 249: warning #2111-D: statement is unreachable
  	PUTBACK;
  	^

"/pro/3gl/CPAN/perl-current/sv_inline.h", line 468: warning #4276-D: relational operator ">" always evaluates to 'false'
              Zero(new_body, type_details->body_size, char);
              ^

"/pro/3gl/CPAN/perl-current/sv_inline.h", line 468: warning #4276-D: relational operator ">" always evaluates to 'false'
              Zero(new_body, type_details->body_size, char);
              ^

"XSMore.xs", line 48: warning #4276-D: relational operator ">" always evaluates to 'false'
     Newx(*c, lenc+1, char);
     ^

"XSMore.xs", line 63: warning #4276-D: relational operator ">" always evaluates to 'false'
     Newx(*c, lenc+1, char);
     ^

"/pro/3gl/CPAN/perl-current/sv_inline.h", line 468: warning #4276-D: relational operator ">" always evaluates to 'false'
              Zero(new_body, type_details->body_size, char);
              ^

c++: error: +Z: No such file or directory
c++: error: +O2: No such file or directory
c++: error: +Onolimit: No such file or directory
"../sv_inline.h", line 468: warning #4276-D: relational operator ">" always evaluates to 'false'
              Zero(new_body, type_details->body_size, char);
              ^

cc: warning 983: The -lc library specified on the command line is also added automatically by the compiler driver.  
# Failed test 1704 - sprintf( "%.54g", 0.3 ) renders correctly at op/sprintf2.t line 1197
#      got "0.299999999999999988897769753748434596"
# expected eq "0.299999999999999988897769753748434595763683319091796875"
Subroutine Time::HiRes::constant redefined at (eval 37) line 1.
Subroutine Time::HiRes::usleep redefined at (eval 37) line 1.
Subroutine Time::HiRes::nanosleep redefined at (eval 37) line 1.
Subroutine Time::HiRes::sleep redefined at (eval 37) line 1.
Subroutine Time::HiRes::ualarm redefined at (eval 37) line 1.
Subroutine Time::HiRes::alarm redefined at (eval 37) line 1.
Subroutine Time::HiRes::gettimeofday redefined at (eval 37) line 1.
Subroutine Time::HiRes::time redefined at (eval 37) line 1.
Subroutine Time::HiRes::setitimer redefined at (eval 37) line 1.
Subroutine Time::HiRes::getitimer redefined at (eval 37) line 1.
Subroutine Time::HiRes::utime redefined at (eval 37) line 1.
Subroutine Time::HiRes::clock_gettime redefined at (eval 37) line 1.
Subroutine Time::HiRes::clock_getres redefined at (eval 37) line 1.
Subroutine Time::HiRes::clock_nanosleep redefined at (eval 37) line 1.
Subroutine Time::HiRes::clock redefined at (eval 37) line 1.
Subroutine Time::HiRes::lstat redefined at (eval 37) line 1.
Subroutine Time::HiRes::stat redefined at (eval 37) line 1.
# Connected to 127.0.0.1
# Connected to 127.0.0.1
make: *** [test_harness] Error 1

error while running harness target 'test_harness': 2 at /pro/3gl/CPAN/smoke/lib/Test/Smoke/App/RunSmoke.pm line 118.
[2022-04-23 11:19:48+0200] 
[2022-04-23 11:19:48+0200] ../dist/Net-Ping/t/450_service.t............................PASSED
[2022-04-23 11:19:48+0200]     9, 18
[2022-04-23 11:19:48+0200] ../t/op/sprintf2.t..........................................FAILED
[2022-04-23 11:19:48+0200]     1704
[2022-04-23 11:19:48+0200] ../t/re/reg_mesg.t..........................................FAILED
[2022-04-23 11:19:48+0200]     No plan found in TAP output
[2022-04-23 11:19:48+0200] ../t/re/regex_sets.t........................................FAILED
[2022-04-23 11:19:48+0200]     No plan found in TAP output
[2022-04-23 11:19:48+0200] Archived results...
[2022-04-23 11:19:48+0200] Unskip tests from '/pro/3gl/CPAN/smoke/p59.skip'
[2022-04-23 11:19:48+0200] 
[2022-04-23 11:19:48+0200] Configuration: -Dusedevel -Duse64bitall -DDEBUGGING
[2022-04-23 11:19:48+0200] ------------------------------------------------------------------------------
[2022-04-23 11:19:48+0200] make distclean ...
[2022-04-23 11:20:28+0200] 
[2022-04-23 11:20:28+0200] Copy Policy.sh ...
[2022-04-23 11:20:28+0200] 
[2022-04-23 11:20:28+0200] Configure ...
[2022-04-23 11:22:02+0200] 
[2022-04-23 11:22:02+0200] make ...
[2022-04-23 11:37:21+0200] Skip tests from '/pro/3gl/CPAN/smoke/p59.skip'
[2022-04-23 11:37:21+0200] 	cpan/Sys-Syslog/t/syslog.t
[2022-04-23 11:37:22+0200] 
[2022-04-23 11:37:22+0200]  Tests start here:
[2022-04-23 11:37:22+0200] TSTENV = stdio	
No saved state, selection will be empty
Cannot figure out an encoding to use at t/use-Encode-Alias.t line 5.
"../../../../sv_inline.h", line 468: warning #4276-D: relational operator ">" always evaluates to 'false'
              Zero(new_body, type_details->body_size, char);
              ^

"../../../../sv_inline.h", line 468: warning #4276-D: relational operator ">" always evaluates to 'false'
              Zero(new_body, type_details->body_size, char);
              ^

"../../../../sv_inline.h", line 468: warning #4276-D: relational operator ">" always evaluates to 'false'
              Zero(new_body, type_details->body_size, char);
              ^

"../../../../sv_inline.h", line 468: warning #4276-D: relational operator ">" always evaluates to 'false'
              Zero(new_body, type_details->body_size, char);
              ^

"../../../../sv_inline.h", line 468: warning #4276-D: relational operator ">" always evaluates to 'false'
              Zero(new_body, type_details->body_size, char);
              ^

"../../../../sv_inline.h", line 468: warning #4276-D: relational operator ">" always evaluates to 'false'
              Zero(new_body, type_details->body_size, char);
              ^

"../../../../sv_inline.h", line 468: warning #4276-D: relational operator ">" always evaluates to 'false'
              Zero(new_body, type_details->body_size, char);
              ^

# Connected to 127.0.0.1
# Connected to 127.0.0.1
Redefining sub xChild::foo at xChild--21991 line 2.
Redefining sub Data::ok at -e line 1.
"XSTest.c", line 249: warning #2111-D: statement is unreachable
  	PUTBACK;
  	^

"/pro/3gl/CPAN/perl-current/sv_inline.h", line 468: warning #4276-D: relational operator ">" always evaluates to 'false'
              Zero(new_body, type_details->body_size, char);
              ^

c++: error: +Z: No such file or directory
c++: error: +O2: No such file or directory
c++: error: +Onolimit: No such file or directory
"/pro/3gl/CPAN/perl-current/sv_inline.h", line 468: warning #4276-D: relational operator ">" always evaluates to 'false'
              Zero(new_body, type_details->body_size, char);
              ^

"XSMore.xs", line 48: warning #4276-D: relational operator ">" always evaluates to 'false'
     Newx(*c, lenc+1, char);
     ^

"XSMore.xs", line 63: warning #4276-D: relational operator ">" always evaluates to 'false'
     Newx(*c, lenc+1, char);
     ^

"/pro/3gl/CPAN/perl-current/sv_inline.h", line 468: warning #4276-D: relational operator ">" always evaluates to 'false'
              Zero(new_body, type_details->body_size, char);
              ^

Subroutine Time::HiRes::constant redefined at (eval 37) line 1.
Subroutine Time::HiRes::usleep redefined at (eval 37) line 1.
Subroutine Time::HiRes::nanosleep redefined at (eval 37) line 1.
Subroutine Time::HiRes::sleep redefined at (eval 37) line 1.
Subroutine Time::HiRes::ualarm redefined at (eval 37) line 1.
Subroutine Time::HiRes::alarm redefined at (eval 37) line 1.
Subroutine Time::HiRes::gettimeofday redefined at (eval 37) line 1.
Subroutine Time::HiRes::time redefined at (eval 37) line 1.
Subroutine Time::HiRes::setitimer redefined at (eval 37) line 1.
Subroutine Time::HiRes::getitimer redefined at (eval 37) line 1.
Subroutine Time::HiRes::utime redefined at (eval 37) line 1.
Subroutine Time::HiRes::clock_gettime redefined at (eval 37) line 1.
Subroutine Time::HiRes::clock_getres redefined at (eval 37) line 1.
Subroutine Time::HiRes::clock_nanosleep redefined at (eval 37) line 1.
Subroutine Time::HiRes::clock redefined at (eval 37) line 1.
Subroutine Time::HiRes::lstat redefined at (eval 37) line 1.
Subroutine Time::HiRes::stat redefined at (eval 37) line 1.
"../sv_inline.h", line 468: warning #4276-D: relational operator ">" always evaluates to 'false'
              Zero(new_body, type_details->body_size, char);
              ^

cc: warning 983: The -lc library specified on the command line is also added automatically by the compiler driver.  
# Failed test 1704 - sprintf( "%.54g", 0.3 ) renders correctly at op/sprintf2.t line 1197
#      got "0.299999999999999988897769753748434596"
# expected eq "0.299999999999999988897769753748434595763683319091796875"
make: *** [test_harness] Error 1

error while running harness target 'test_harness': 2 at /pro/3gl/CPAN/smoke/lib/Test/Smoke/App/RunSmoke.pm line 118.
[2022-04-23 11:56:18+0200] 
[2022-04-23 11:56:18+0200] ../dist/Net-Ping/t/450_service.t............................PASSED
[2022-04-23 11:56:18+0200]     9, 18
[2022-04-23 11:56:18+0200] ../t/op/sprintf2.t..........................................FAILED
[2022-04-23 11:56:18+0200]     1704
[2022-04-23 11:56:18+0200] ../t/re/reg_mesg.t..........................................FAILED
[2022-04-23 11:56:18+0200]     No plan found in TAP output
[2022-04-23 11:56:18+0200] ../t/re/regex_sets.t........................................FAILED
[2022-04-23 11:56:18+0200]     No plan found in TAP output
[2022-04-23 11:56:18+0200] Archived results...
[2022-04-23 11:56:18+0200] TSTENV = perlio	
"../../../../sv_inline.h", line 468: warning #4276-D: relational operator ">" always evaluates to 'false'
              Zero(new_body, type_details->body_size, char);
              ^

"../../../../sv_inline.h", line 468: warning #4276-D: relational operator ">" always evaluates to 'false'
              Zero(new_body, type_details->body_size, char);
              ^

"../../../../sv_inline.h", line 468: warning #4276-D: relational operator ">" always evaluates to 'false'
              Zero(new_body, type_details->body_size, char);
              ^

"../../../../sv_inline.h", line 468: warning #4276-D: relational operator ">" always evaluates to 'false'
              Zero(new_body, type_details->body_size, char);
              ^

"../../../../sv_inline.h", line 468: warning #4276-D: relational operator ">" always evaluates to 'false'
              Zero(new_body, type_details->body_size, char);
              ^

"../../../../sv_inline.h", line 468: warning #4276-D: relational operator ">" always evaluates to 'false'
              Zero(new_body, type_details->body_size, char);
              ^

"../../../../sv_inline.h", line 468: warning #4276-D: relational operator ">" always evaluates to 'false'
              Zero(new_body, type_details->body_size, char);
              ^

"XSTest.c", line 249: warning #2111-D: statement is unreachable
  	PUTBACK;
  	^

"/pro/3gl/CPAN/perl-current/sv_inline.h", line 468: warning #4276-D: relational operator ">" always evaluates to 'false'
              Zero(new_body, type_details->body_size, char);
              ^

"/pro/3gl/CPAN/perl-current/sv_inline.h", line 468: warning #4276-D: relational operator ">" always evaluates to 'false'
              Zero(new_body, type_details->body_size, char);
              ^

"XSMore.xs", line 48: warning #4276-D: relational operator ">" always evaluates to 'false'
     Newx(*c, lenc+1, char);
     ^

"XSMore.xs", line 63: warning #4276-D: relational operator ">" always evaluates to 'false'
     Newx(*c, lenc+1, char);
     ^

"/pro/3gl/CPAN/perl-current/sv_inline.h", line 468: warning #4276-D: relational operator ">" always evaluates to 'false'
              Zero(new_body, type_details->body_size, char);
              ^

c++: error: +Z: No such file or directory
c++: error: +O2: No such file or directory
c++: error: +Onolimit: No such file or directory
"../sv_inline.h", line 468: warning #4276-D: relational operator ">" always evaluates to 'false'
              Zero(new_body, type_details->body_size, char);
              ^

cc: warning 983: The -lc library specified on the command line is also added automatically by the compiler driver.  
# Failed test 1704 - sprintf( "%.54g", 0.3 ) renders correctly at op/sprintf2.t line 1197
#      got "0.299999999999999988897769753748434596"
# expected eq "0.299999999999999988897769753748434595763683319091796875"
# Connected to 127.0.0.1
# Connected to 127.0.0.1
Subroutine Time::HiRes::constant redefined at (eval 37) line 1.
Subroutine Time::HiRes::usleep redefined at (eval 37) line 1.
Subroutine Time::HiRes::nanosleep redefined at (eval 37) line 1.
Subroutine Time::HiRes::sleep redefined at (eval 37) line 1.
Subroutine Time::HiRes::ualarm redefined at (eval 37) line 1.
Subroutine Time::HiRes::alarm redefined at (eval 37) line 1.
Subroutine Time::HiRes::gettimeofday redefined at (eval 37) line 1.
Subroutine Time::HiRes::time redefined at (eval 37) line 1.
Subroutine Time::HiRes::setitimer redefined at (eval 37) line 1.
Subroutine Time::HiRes::getitimer redefined at (eval 37) line 1.
Subroutine Time::HiRes::utime redefined at (eval 37) line 1.
Subroutine Time::HiRes::clock_gettime redefined at (eval 37) line 1.
Subroutine Time::HiRes::clock_getres redefined at (eval 37) line 1.
Subroutine Time::HiRes::clock_nanosleep redefined at (eval 37) line 1.
Subroutine Time::HiRes::clock redefined at (eval 37) line 1.
Subroutine Time::HiRes::lstat redefined at (eval 37) line 1.
Subroutine Time::HiRes::stat redefined at (eval 37) line 1.
Cannot figure out an encoding to use at t/use-Encode-Alias.t line 5.
make: *** [test_harness] Error 1

error while running harness target 'test_harness': 2 at /pro/3gl/CPAN/smoke/lib/Test/Smoke/App/RunSmoke.pm line 118.
[2022-04-23 12:12:58+0200] 
[2022-04-23 12:12:58+0200] ../dist/Net-Ping/t/450_service.t............................PASSED
[2022-04-23 12:12:58+0200]     9, 18
[2022-04-23 12:12:58+0200] ../t/op/sprintf2.t..........................................FAILED
[2022-04-23 12:12:58+0200]     1704
[2022-04-23 12:12:58+0200] ../t/re/regex_sets.t........................................FAILED
[2022-04-23 12:12:58+0200]     No plan found in TAP output
[2022-04-23 12:12:58+0200] ../t/re/reg_mesg.t..........................................FAILED
[2022-04-23 12:12:58+0200]     No plan found in TAP output
[2022-04-23 12:12:58+0200] Archived results...
[2022-04-23 12:12:58+0200] TSTENV = locale:en_US.utf8	
"../../../../sv_inline.h", line 468: warning #4276-D: relational operator ">" always evaluates to 'false'
              Zero(new_body, type_details->body_size, char);
              ^

"../../../../sv_inline.h", line 468: warning #4276-D: relational operator ">" always evaluates to 'false'
              Zero(new_body, type_details->body_size, char);
              ^

"../../../../sv_inline.h", line 468: warning #4276-D: relational operator ">" always evaluates to 'false'
              Zero(new_body, type_details->body_size, char);
              ^

"../../../../sv_inline.h", line 468: warning #4276-D: relational operator ">" always evaluates to 'false'
              Zero(new_body, type_details->body_size, char);
              ^

"../../../../sv_inline.h", line 468: warning #4276-D: relational operator ">" always evaluates to 'false'
              Zero(new_body, type_details->body_size, char);
              ^

"../../../../sv_inline.h", line 468: warning #4276-D: relational operator ">" always evaluates to 'false'
              Zero(new_body, type_details->body_size, char);
              ^

"../../../../sv_inline.h", line 468: warning #4276-D: relational operator ">" always evaluates to 'false'
              Zero(new_body, type_details->body_size, char);
              ^

"XSTest.c", line 249: warning #2111-D: statement is unreachable
  	PUTBACK;
  	^

"/pro/3gl/CPAN/perl-current/sv_inline.h", line 468: warning #4276-D: relational operator ">" always evaluates to 'false'
              Zero(new_body, type_details->body_size, char);
              ^

"/pro/3gl/CPAN/perl-current/sv_inline.h", line 468: warning #4276-D: relational operator ">" always evaluates to 'false'
              Zero(new_body, type_details->body_size, char);
              ^

"XSMore.xs", line 48: warning #4276-D: relational operator ">" always evaluates to 'false'
     Newx(*c, lenc+1, char);
     ^

"XSMore.xs", line 63: warning #4276-D: relational operator ">" always evaluates to 'false'
     Newx(*c, lenc+1, char);
     ^

"/pro/3gl/CPAN/perl-current/sv_inline.h", line 468: warning #4276-D: relational operator ">" always evaluates to 'false'
              Zero(new_body, type_details->body_size, char);
              ^

c++: error: +Z: No such file or directory
c++: error: +O2: No such file or directory
c++: error: +Onolimit: No such file or directory
"../sv_inline.h", line 468: warning #4276-D: relational operator ">" always evaluates to 'false'
              Zero(new_body, type_details->body_size, char);
              ^

cc: warning 983: The -lc library specified on the command line is also added automatically by the compiler driver.  
# Failed test 1704 - sprintf( "%.54g", 0.3 ) renders correctly at op/sprintf2.t line 1197
#      got "0.299999999999999988897769753748434596"
# expected eq "0.299999999999999988897769753748434595763683319091796875"
Subroutine Time::HiRes::constant redefined at (eval 37) line 1.
Subroutine Time::HiRes::usleep redefined at (eval 37) line 1.
Subroutine Time::HiRes::nanosleep redefined at (eval 37) line 1.
Subroutine Time::HiRes::sleep redefined at (eval 37) line 1.
Subroutine Time::HiRes::ualarm redefined at (eval 37) line 1.
Subroutine Time::HiRes::alarm redefined at (eval 37) line 1.
Subroutine Time::HiRes::gettimeofday redefined at (eval 37) line 1.
Subroutine Time::HiRes::time redefined at (eval 37) line 1.
Subroutine Time::HiRes::setitimer redefined at (eval 37) line 1.
Subroutine Time::HiRes::getitimer redefined at (eval 37) line 1.
Subroutine Time::HiRes::utime redefined at (eval 37) line 1.
Subroutine Time::HiRes::clock_gettime redefined at (eval 37) line 1.
Subroutine Time::HiRes::clock_getres redefined at (eval 37) line 1.
Subroutine Time::HiRes::clock_nanosleep redefined at (eval 37) line 1.
Subroutine Time::HiRes::clock redefined at (eval 37) line 1.
Subroutine Time::HiRes::lstat redefined at (eval 37) line 1.
Subroutine Time::HiRes::stat redefined at (eval 37) line 1.
# Connected to 127.0.0.1
# Connected to 127.0.0.1
make: *** [test_harness] Error 1

error while running harness target 'test_harness': 2 at /pro/3gl/CPAN/smoke/lib/Test/Smoke/App/RunSmoke.pm line 118.
[2022-04-23 12:30:11+0200] 
[2022-04-23 12:30:11+0200] ../dist/Net-Ping/t/450_service.t............................PASSED
[2022-04-23 12:30:11+0200]     9, 18
[2022-04-23 12:30:11+0200] ../t/op/sprintf2.t..........................................FAILED
[2022-04-23 12:30:11+0200]     1704
[2022-04-23 12:30:11+0200] ../t/re/reg_mesg.t..........................................FAILED
[2022-04-23 12:30:11+0200]     No plan found in TAP output
[2022-04-23 12:30:11+0200] ../t/re/regex_sets.t........................................FAILED
[2022-04-23 12:30:11+0200]     No plan found in TAP output
[2022-04-23 12:30:11+0200] Archived results...
[2022-04-23 12:30:11+0200] Unskip tests from '/pro/3gl/CPAN/smoke/p59.skip'
[2022-04-23 12:30:11+0200] 
[2022-04-23 12:30:11+0200] Configuration: -Dusedevel -Duseithreads
[2022-04-23 12:30:11+0200] ------------------------------------------------------------------------------
[2022-04-23 12:30:11+0200] make distclean ...
[2022-04-23 12:30:58+0200] 
[2022-04-23 12:30:58+0200] Copy Policy.sh ...
[2022-04-23 12:30:58+0200] 
[2022-04-23 12:30:58+0200] Configure ...
[2022-04-23 12:32:39+0200] 
[2022-04-23 12:32:39+0200] make ...
[2022-04-23 12:46:07+0200] Skip tests from '/pro/3gl/CPAN/smoke/p59.skip'
[2022-04-23 12:46:07+0200] 	cpan/Sys-Syslog/t/syslog.t
[2022-04-23 12:46:07+0200] 
[2022-04-23 12:46:07+0200]  Tests start here:
[2022-04-23 12:46:07+0200] TSTENV = stdio	
No saved state, selection will be empty
Cannot figure out an encoding to use at t/use-Encode-Alias.t line 5.
"../../../../sv_inline.h", line 487: warning #4232-D: conversion from "XPVIO *" to a more strictly aligned type "XPVMG *" may cause misaligned access
              SvSTASH_set(io, MUTABLE_HV(SvREFCNT_inc(GvHV(iogv))));
              ^

"../../../../sv_inline.h", line 468: warning #4276-D: relational operator ">" always evaluates to 'false'
              Zero(new_body, type_details->body_size, char);
              ^

"../../../../sv_inline.h", line 487: warning #4232-D: conversion from "XPVIO *" to a more strictly aligned type "XPVMG *" may cause misaligned access
              SvSTASH_set(io, MUTABLE_HV(SvREFCNT_inc(GvHV(iogv))));
              ^

"../../../../sv_inline.h", line 468: warning #4276-D: relational operator ">" always evaluates to 'false'
              Zero(new_body, type_details->body_size, char);
              ^

"../../../../sv_inline.h", line 487: warning #4232-D: conversion from "XPVIO *" to a more strictly aligned type "XPVMG *" may cause misaligned access
              SvSTASH_set(io, MUTABLE_HV(SvREFCNT_inc(GvHV(iogv))));
              ^

"../../../../sv_inline.h", line 468: warning #4276-D: relational operator ">" always evaluates to 'false'
              Zero(new_body, type_details->body_size, char);
              ^

"../../../../sv_inline.h", line 487: warning #4232-D: conversion from "XPVIO *" to a more strictly aligned type "XPVMG *" may cause misaligned access
              SvSTASH_set(io, MUTABLE_HV(SvREFCNT_inc(GvHV(iogv))));
              ^

"../../../../sv_inline.h", line 468: warning #4276-D: relational operator ">" always evaluates to 'false'
              Zero(new_body, type_details->body_size, char);
              ^

"../../../../sv_inline.h", line 487: warning #4232-D: conversion from "XPVIO *" to a more strictly aligned type "XPVMG *" may cause misaligned access
              SvSTASH_set(io, MUTABLE_HV(SvREFCNT_inc(GvHV(iogv))));
              ^

"../../../../sv_inline.h", line 468: warning #4276-D: relational operator ">" always evaluates to 'false'
              Zero(new_body, type_details->body_size, char);
              ^

"../../../../sv_inline.h", line 487: warning #4232-D: conversion from "XPVIO *" to a more strictly aligned type "XPVMG *" may cause misaligned access
              SvSTASH_set(io, MUTABLE_HV(SvREFCNT_inc(GvHV(iogv))));
              ^

"../../../../sv_inline.h", line 468: warning #4276-D: relational operator ">" always evaluates to 'false'
              Zero(new_body, type_details->body_size, char);
              ^

"../../../../sv_inline.h", line 487: warning #4232-D: conversion from "XPVIO *" to a more strictly aligned type "XPVMG *" may cause misaligned access
              SvSTASH_set(io, MUTABLE_HV(SvREFCNT_inc(GvHV(iogv))));
              ^

"../../../../sv_inline.h", line 468: warning #4276-D: relational operator ">" always evaluates to 'false'
              Zero(new_body, type_details->body_size, char);
              ^

# Connected to 127.0.0.1
# Connected to 127.0.0.1
Integer overflow in hexadecimal number at t/broken_univ_can.t line 13.
Redefining sub xChild::foo at xChild--24648 line 2.
Redefining sub Data::ok at -e line 1.
"/pro/3gl/CPAN/perl-current/sv_inline.h", line 487: warning #4232-D: conversion from "XPVIO *" to a more strictly aligned type "XPVMG *" may cause misaligned access
              SvSTASH_set(io, MUTABLE_HV(SvREFCNT_inc(GvHV(iogv))));
              ^

"XSTest.c", line 249: warning #2111-D: statement is unreachable
  	PUTBACK;
  	^

"/pro/3gl/CPAN/perl-current/sv_inline.h", line 468: warning #4276-D: relational operator ">" always evaluates to 'false'
              Zero(new_body, type_details->body_size, char);
              ^

c++: error: +Z: No such file or directory
c++: error: +O2: No such file or directory
c++: error: +Onolimit: No such file or directory
"/pro/3gl/CPAN/perl-current/sv_inline.h", line 487: warning #4232-D: conversion from "XPVIO *" to a more strictly aligned type "XPVMG *" may cause misaligned access
              SvSTASH_set(io, MUTABLE_HV(SvREFCNT_inc(GvHV(iogv))));
              ^

"/pro/3gl/CPAN/perl-current/sv_inline.h", line 468: warning #4276-D: relational operator ">" always evaluates to 'false'
              Zero(new_body, type_details->body_size, char);
              ^

"XSMore.xs", line 48: warning #4276-D: relational operator ">" always evaluates to 'false'
     Newx(*c, lenc+1, char);
     ^

"XSMore.xs", line 63: warning #4276-D: relational operator ">" always evaluates to 'false'
     Newx(*c, lenc+1, char);
     ^

"/pro/3gl/CPAN/perl-current/sv_inline.h", line 487: warning #4232-D: conversion from "XPVIO *" to a more strictly aligned type "XPVMG *" may cause misaligned access
              SvSTASH_set(io, MUTABLE_HV(SvREFCNT_inc(GvHV(iogv))));
              ^

"/pro/3gl/CPAN/perl-current/sv_inline.h", line 468: warning #4276-D: relational operator ">" always evaluates to 'false'
              Zero(new_body, type_details->body_size, char);
              ^

Subroutine Time::HiRes::constant redefined at (eval 37) line 1.
Subroutine Time::HiRes::usleep redefined at (eval 37) line 1.
Subroutine Time::HiRes::nanosleep redefined at (eval 37) line 1.
Subroutine Time::HiRes::sleep redefined at (eval 37) line 1.
Subroutine Time::HiRes::ualarm redefined at (eval 37) line 1.
Subroutine Time::HiRes::alarm redefined at (eval 37) line 1.
Subroutine Time::HiRes::gettimeofday redefined at (eval 37) line 1.
Subroutine Time::HiRes::time redefined at (eval 37) line 1.
Subroutine Time::HiRes::setitimer redefined at (eval 37) line 1.
Subroutine Time::HiRes::getitimer redefined at (eval 37) line 1.
Subroutine Time::HiRes::utime redefined at (eval 37) line 1.
Subroutine Time::HiRes::clock_gettime redefined at (eval 37) line 1.
Subroutine Time::HiRes::clock_getres redefined at (eval 37) line 1.
Subroutine Time::HiRes::clock_nanosleep redefined at (eval 37) line 1.
Subroutine Time::HiRes::clock redefined at (eval 37) line 1.
Subroutine Time::HiRes::lstat redefined at (eval 37) line 1.
Subroutine Time::HiRes::stat redefined at (eval 37) line 1.
"../sv_inline.h", line 487: warning #4232-D: conversion from "XPVIO *" to a more strictly aligned type "XPVMG *" may cause misaligned access
              SvSTASH_set(io, MUTABLE_HV(SvREFCNT_inc(GvHV(iogv))));
              ^

"../sv_inline.h", line 468: warning #4276-D: relational operator ">" always evaluates to 'false'
              Zero(new_body, type_details->body_size, char);
              ^

cc: warning 983: The -lc library specified on the command line is also added automatically by the compiler driver.  
# Failed test 1701 - sprintf( "%.54g", 0.3 ) renders correctly at op/sprintf2.t line 1197
#      got "0.299999999999999988897769753748434596"
# expected eq "0.299999999999999988897769753748434595763683319091796875"
make: *** [test_harness] Error 1

error while running harness target 'test_harness': 2 at /pro/3gl/CPAN/smoke/lib/Test/Smoke/App/RunSmoke.pm line 118.
[2022-04-23 13:07:47+0200] 
[2022-04-23 13:07:47+0200] ../dist/Net-Ping/t/450_service.t............................PASSED
[2022-04-23 13:07:47+0200]     9, 18
[2022-04-23 13:07:47+0200] ../t/op/sprintf2.t..........................................FAILED
[2022-04-23 13:07:47+0200]     1701
[2022-04-23 13:07:47+0200] Archived results...
[2022-04-23 13:07:47+0200] TSTENV = perlio	
"../../../../sv_inline.h", line 487: warning #4232-D: conversion from "XPVIO *" to a more strictly aligned type "XPVMG *" may cause misaligned access
              SvSTASH_set(io, MUTABLE_HV(SvREFCNT_inc(GvHV(iogv))));
              ^

"../../../../sv_inline.h", line 468: warning #4276-D: relational operator ">" always evaluates to 'false'
              Zero(new_body, type_details->body_size, char);
              ^

"../../../../sv_inline.h", line 487: warning #4232-D: conversion from "XPVIO *" to a more strictly aligned type "XPVMG *" may cause misaligned access
              SvSTASH_set(io, MUTABLE_HV(SvREFCNT_inc(GvHV(iogv))));
              ^

"../../../../sv_inline.h", line 468: warning #4276-D: relational operator ">" always evaluates to 'false'
              Zero(new_body, type_details->body_size, char);
              ^

"../../../../sv_inline.h", line 487: warning #4232-D: conversion from "XPVIO *" to a more strictly aligned type "XPVMG *" may cause misaligned access
              SvSTASH_set(io, MUTABLE_HV(SvREFCNT_inc(GvHV(iogv))));
              ^

"../../../../sv_inline.h", line 468: warning #4276-D: relational operator ">" always evaluates to 'false'
              Zero(new_body, type_details->body_size, char);
              ^

"../../../../sv_inline.h", line 487: warning #4232-D: conversion from "XPVIO *" to a more strictly aligned type "XPVMG *" may cause misaligned access
              SvSTASH_set(io, MUTABLE_HV(SvREFCNT_inc(GvHV(iogv))));
              ^

"../../../../sv_inline.h", line 468: warning #4276-D: relational operator ">" always evaluates to 'false'
              Zero(new_body, type_details->body_size, char);
              ^

"../../../../sv_inline.h", line 487: warning #4232-D: conversion from "XPVIO *" to a more strictly aligned type "XPVMG *" may cause misaligned access
              SvSTASH_set(io, MUTABLE_HV(SvREFCNT_inc(GvHV(iogv))));
              ^

"../../../../sv_inline.h", line 468: warning #4276-D: relational operator ">" always evaluates to 'false'
              Zero(new_body, type_details->body_size, char);
              ^

"../../../../sv_inline.h", line 487: warning #4232-D: conversion from "XPVIO *" to a more strictly aligned type "XPVMG *" may cause misaligned access
              SvSTASH_set(io, MUTABLE_HV(SvREFCNT_inc(GvHV(iogv))));
              ^

"../../../../sv_inline.h", line 468: warning #4276-D: relational operator ">" always evaluates to 'false'
              Zero(new_body, type_details->body_size, char);
              ^

"../../../../sv_inline.h", line 487: warning #4232-D: conversion from "XPVIO *" to a more strictly aligned type "XPVMG *" may cause misaligned access
              SvSTASH_set(io, MUTABLE_HV(SvREFCNT_inc(GvHV(iogv))));
              ^

"../../../../sv_inline.h", line 468: warning #4276-D: relational operator ">" always evaluates to 'false'
              Zero(new_body, type_details->body_size, char);
              ^

"/pro/3gl/CPAN/perl-current/sv_inline.h", line 487: warning #4232-D: conversion from "XPVIO *" to a more strictly aligned type "XPVMG *" may cause misaligned access
              SvSTASH_set(io, MUTABLE_HV(SvREFCNT_inc(GvHV(iogv))));
              ^

"XSTest.c", line 249: warning #2111-D: statement is unreachable
  	PUTBACK;
  	^

"/pro/3gl/CPAN/perl-current/sv_inline.h", line 468: warning #4276-D: relational operator ">" always evaluates to 'false'
              Zero(new_body, type_details->body_size, char);
              ^

"/pro/3gl/CPAN/perl-current/sv_inline.h", line 487: warning #4232-D: conversion from "XPVIO *" to a more strictly aligned type "XPVMG *" may cause misaligned access
              SvSTASH_set(io, MUTABLE_HV(SvREFCNT_inc(GvHV(iogv))));
              ^

"/pro/3gl/CPAN/perl-current/sv_inline.h", line 468: warning #4276-D: relational operator ">" always evaluates to 'false'
              Zero(new_body, type_details->body_size, char);
              ^

"XSMore.xs", line 48: warning #4276-D: relational operator ">" always evaluates to 'false'
     Newx(*c, lenc+1, char);
     ^

"XSMore.xs", line 63: warning #4276-D: relational operator ">" always evaluates to 'false'
     Newx(*c, lenc+1, char);
     ^

"/pro/3gl/CPAN/perl-current/sv_inline.h", line 487: warning #4232-D: conversion from "XPVIO *" to a more strictly aligned type "XPVMG *" may cause misaligned access
              SvSTASH_set(io, MUTABLE_HV(SvREFCNT_inc(GvHV(iogv))));
              ^

"/pro/3gl/CPAN/perl-current/sv_inline.h", line 468: warning #4276-D: relational operator ">" always evaluates to 'false'
              Zero(new_body, type_details->body_size, char);
              ^

c++: error: +Z: No such file or directory
c++: error: +O2: No such file or directory
c++: error: +Onolimit: No such file or directory
"../sv_inline.h", line 487: warning #4232-D: conversion from "XPVIO *" to a more strictly aligned type "XPVMG *" may cause misaligned access
              SvSTASH_set(io, MUTABLE_HV(SvREFCNT_inc(GvHV(iogv))));
              ^

"../sv_inline.h", line 468: warning #4276-D: relational operator ">" always evaluates to 'false'
              Zero(new_body, type_details->body_size, char);
              ^

cc: warning 983: The -lc library specified on the command line is also added automatically by the compiler driver.  
# Failed test 1701 - sprintf( "%.54g", 0.3 ) renders correctly at op/sprintf2.t line 1197
#      got "0.299999999999999988897769753748434596"
# expected eq "0.299999999999999988897769753748434595763683319091796875"
# Connected to 127.0.0.1
# Connected to 127.0.0.1
Cannot figure out an encoding to use at t/use-Encode-Alias.t line 5.
Subroutine Time::HiRes::constant redefined at (eval 37) line 1.
Subroutine Time::HiRes::usleep redefined at (eval 37) line 1.
Subroutine Time::HiRes::nanosleep redefined at (eval 37) line 1.
Subroutine Time::HiRes::sleep redefined at (eval 37) line 1.
Subroutine Time::HiRes::ualarm redefined at (eval 37) line 1.
Subroutine Time::HiRes::alarm redefined at (eval 37) line 1.
Subroutine Time::HiRes::gettimeofday redefined at (eval 37) line 1.
Subroutine Time::HiRes::time redefined at (eval 37) line 1.
Subroutine Time::HiRes::setitimer redefined at (eval 37) line 1.
Subroutine Time::HiRes::getitimer redefined at (eval 37) line 1.
Subroutine Time::HiRes::utime redefined at (eval 37) line 1.
Subroutine Time::HiRes::clock_gettime redefined at (eval 37) line 1.
Subroutine Time::HiRes::clock_getres redefined at (eval 37) line 1.
Subroutine Time::HiRes::clock_nanosleep redefined at (eval 37) line 1.
Subroutine Time::HiRes::clock redefined at (eval 37) line 1.
Subroutine Time::HiRes::lstat redefined at (eval 37) line 1.
Subroutine Time::HiRes::stat redefined at (eval 37) line 1.
Integer overflow in hexadecimal number at t/broken_univ_can.t line 13.
make: *** [test_harness] Error 1

error while running harness target 'test_harness': 2 at /pro/3gl/CPAN/smoke/lib/Test/Smoke/App/RunSmoke.pm line 118.
[2022-04-23 13:24:33+0200] 
[2022-04-23 13:24:33+0200] ../dist/Net-Ping/t/450_service.t............................PASSED
[2022-04-23 13:24:33+0200]     9, 18
[2022-04-23 13:24:33+0200] ../t/op/sprintf2.t..........................................FAILED
[2022-04-23 13:24:33+0200]     1701
[2022-04-23 13:24:33+0200] Archived results...
[2022-04-23 13:24:33+0200] TSTENV = locale:en_US.utf8	
"../../../../sv_inline.h", line 487: warning #4232-D: conversion from "XPVIO *" to a more strictly aligned type "XPVMG *" may cause misaligned access
              SvSTASH_set(io, MUTABLE_HV(SvREFCNT_inc(GvHV(iogv))));
              ^

"../../../../sv_inline.h", line 468: warning #4276-D: relational operator ">" always evaluates to 'false'
              Zero(new_body, type_details->body_size, char);
              ^

"../../../../sv_inline.h", line 487: warning #4232-D: conversion from "XPVIO *" to a more strictly aligned type "XPVMG *" may cause misaligned access
              SvSTASH_set(io, MUTABLE_HV(SvREFCNT_inc(GvHV(iogv))));
              ^

"../../../../sv_inline.h", line 468: warning #4276-D: relational operator ">" always evaluates to 'false'
              Zero(new_body, type_details->body_size, char);
              ^

"../../../../sv_inline.h", line 487: warning #4232-D: conversion from "XPVIO *" to a more strictly aligned type "XPVMG *" may cause misaligned access
              SvSTASH_set(io, MUTABLE_HV(SvREFCNT_inc(GvHV(iogv))));
              ^

"../../../../sv_inline.h", line 468: warning #4276-D: relational operator ">" always evaluates to 'false'
              Zero(new_body, type_details->body_size, char);
              ^

"../../../../sv_inline.h", line 487: warning #4232-D: conversion from "XPVIO *" to a more strictly aligned type "XPVMG *" may cause misaligned access
              SvSTASH_set(io, MUTABLE_HV(SvREFCNT_inc(GvHV(iogv))));
              ^

"../../../../sv_inline.h", line 468: warning #4276-D: relational operator ">" always evaluates to 'false'
              Zero(new_body, type_details->body_size, char);
              ^

"../../../../sv_inline.h", line 487: warning #4232-D: conversion from "XPVIO *" to a more strictly aligned type "XPVMG *" may cause misaligned access
              SvSTASH_set(io, MUTABLE_HV(SvREFCNT_inc(GvHV(iogv))));
              ^

"../../../../sv_inline.h", line 468: warning #4276-D: relational operator ">" always evaluates to 'false'
              Zero(new_body, type_details->body_size, char);
              ^

"../../../../sv_inline.h", line 487: warning #4232-D: conversion from "XPVIO *" to a more strictly aligned type "XPVMG *" may cause misaligned access
              SvSTASH_set(io, MUTABLE_HV(SvREFCNT_inc(GvHV(iogv))));
              ^

"../../../../sv_inline.h", line 468: warning #4276-D: relational operator ">" always evaluates to 'false'
              Zero(new_body, type_details->body_size, char);
              ^

"../../../../sv_inline.h", line 487: warning #4232-D: conversion from "XPVIO *" to a more strictly aligned type "XPVMG *" may cause misaligned access
              SvSTASH_set(io, MUTABLE_HV(SvREFCNT_inc(GvHV(iogv))));
              ^

"../../../../sv_inline.h", line 468: warning #4276-D: relational operator ">" always evaluates to 'false'
              Zero(new_body, type_details->body_size, char);
              ^

"/pro/3gl/CPAN/perl-current/sv_inline.h", line 487: warning #4232-D: conversion from "XPVIO *" to a more strictly aligned type "XPVMG *" may cause misaligned access
              SvSTASH_set(io, MUTABLE_HV(SvREFCNT_inc(GvHV(iogv))));
              ^

"XSTest.c", line 249: warning #2111-D: statement is unreachable
  	PUTBACK;
  	^

"/pro/3gl/CPAN/perl-current/sv_inline.h", line 468: warning #4276-D: relational operator ">" always evaluates to 'false'
              Zero(new_body, type_details->body_size, char);
              ^

"/pro/3gl/CPAN/perl-current/sv_inline.h", line 487: warning #4232-D: conversion from "XPVIO *" to a more strictly aligned type "XPVMG *" may cause misaligned access
              SvSTASH_set(io, MUTABLE_HV(SvREFCNT_inc(GvHV(iogv))));
              ^

"/pro/3gl/CPAN/perl-current/sv_inline.h", line 468: warning #4276-D: relational operator ">" always evaluates to 'false'
              Zero(new_body, type_details->body_size, char);
              ^

"XSMore.xs", line 48: warning #4276-D: relational operator ">" always evaluates to 'false'
     Newx(*c, lenc+1, char);
     ^

"XSMore.xs", line 63: warning #4276-D: relational operator ">" always evaluates to 'false'
     Newx(*c, lenc+1, char);
     ^

"/pro/3gl/CPAN/perl-current/sv_inline.h", line 487: warning #4232-D: conversion from "XPVIO *" to a more strictly aligned type "XPVMG *" may cause misaligned access
              SvSTASH_set(io, MUTABLE_HV(SvREFCNT_inc(GvHV(iogv))));
              ^

"/pro/3gl/CPAN/perl-current/sv_inline.h", line 468: warning #4276-D: relational operator ">" always evaluates to 'false'
              Zero(new_body, type_details->body_size, char);
              ^

c++: error: +Z: No such file or directory
c++: error: +O2: No such file or directory
c++: error: +Onolimit: No such file or directory
"../sv_inline.h", line 487: warning #4232-D: conversion from "XPVIO *" to a more strictly aligned type "XPVMG *" may cause misaligned access
              SvSTASH_set(io, MUTABLE_HV(SvREFCNT_inc(GvHV(iogv))));
              ^

"../sv_inline.h", line 468: warning #4276-D: relational operator ">" always evaluates to 'false'
              Zero(new_body, type_details->body_size, char);
              ^

cc: warning 983: The -lc library specified on the command line is also added automatically by the compiler driver.  
# Failed test 1701 - sprintf( "%.54g", 0.3 ) renders correctly at op/sprintf2.t line 1197
#      got "0.299999999999999988897769753748434596"
# expected eq "0.299999999999999988897769753748434595763683319091796875"
Subroutine Time::HiRes::constant redefined at (eval 37) line 1.
Subroutine Time::HiRes::usleep redefined at (eval 37) line 1.
Subroutine Time::HiRes::nanosleep redefined at (eval 37) line 1.
Subroutine Time::HiRes::sleep redefined at (eval 37) line 1.
Subroutine Time::HiRes::ualarm redefined at (eval 37) line 1.
Subroutine Time::HiRes::alarm redefined at (eval 37) line 1.
Subroutine Time::HiRes::gettimeofday redefined at (eval 37) line 1.
Subroutine Time::HiRes::time redefined at (eval 37) line 1.
Subroutine Time::HiRes::setitimer redefined at (eval 37) line 1.
Subroutine Time::HiRes::getitimer redefined at (eval 37) line 1.
Subroutine Time::HiRes::utime redefined at (eval 37) line 1.
Subroutine Time::HiRes::clock_gettime redefined at (eval 37) line 1.
Subroutine Time::HiRes::clock_getres redefined at (eval 37) line 1.
Subroutine Time::HiRes::clock_nanosleep redefined at (eval 37) line 1.
Subroutine Time::HiRes::clock redefined at (eval 37) line 1.
Subroutine Time::HiRes::lstat redefined at (eval 37) line 1.
Subroutine Time::HiRes::stat redefined at (eval 37) line 1.
# Connected to 127.0.0.1
# Connected to 127.0.0.1
Integer overflow in hexadecimal number at t/broken_univ_can.t line 13.
make: *** [test_harness] Error 1

error while running harness target 'test_harness': 2 at /pro/3gl/CPAN/smoke/lib/Test/Smoke/App/RunSmoke.pm line 118.
[2022-04-23 13:40:38+0200] 
[2022-04-23 13:40:38+0200] ../dist/Net-Ping/t/450_service.t............................PASSED
[2022-04-23 13:40:38+0200]     9, 18
[2022-04-23 13:40:38+0200] ../t/op/sprintf2.t..........................................FAILED
[2022-04-23 13:40:38+0200]     1701
[2022-04-23 13:40:38+0200] Archived results...
[2022-04-23 13:40:38+0200] Unskip tests from '/pro/3gl/CPAN/smoke/p59.skip'
[2022-04-23 13:40:38+0200] 
[2022-04-23 13:40:38+0200] Configuration: -Dusedevel -Duseithreads -DDEBUGGING
[2022-04-23 13:40:38+0200] ------------------------------------------------------------------------------
[2022-04-23 13:40:38+0200] make distclean ...
[2022-04-23 13:41:20+0200] 
[2022-04-23 13:41:20+0200] Copy Policy.sh ...
[2022-04-23 13:41:20+0200] 
[2022-04-23 13:41:20+0200] Configure ...
[2022-04-23 13:42:59+0200] 
[2022-04-23 13:42:59+0200] make ...
[2022-04-23 13:58:50+0200] Skip tests from '/pro/3gl/CPAN/smoke/p59.skip'
[2022-04-23 13:58:50+0200] 	cpan/Sys-Syslog/t/syslog.t
[2022-04-23 13:58:51+0200] 
[2022-04-23 13:58:51+0200]  Tests start here:
[2022-04-23 13:58:51+0200] TSTENV = stdio	
No saved state, selection will be empty
Cannot figure out an encoding to use at t/use-Encode-Alias.t line 5.
"../../../../sv_inline.h", line 487: warning #4232-D: conversion from "XPVIO *" to a more strictly aligned type "XPVMG *" may cause misaligned access
              SvSTASH_set(io, MUTABLE_HV(SvREFCNT_inc(GvHV(iogv))));
              ^

"../../../../sv_inline.h", line 468: warning #4276-D: relational operator ">" always evaluates to 'false'
              Zero(new_body, type_details->body_size, char);
              ^

"../../../../sv_inline.h", line 487: warning #4232-D: conversion from "XPVIO *" to a more strictly aligned type "XPVMG *" may cause misaligned access
              SvSTASH_set(io, MUTABLE_HV(SvREFCNT_inc(GvHV(iogv))));
              ^

"../../../../sv_inline.h", line 468: warning #4276-D: relational operator ">" always evaluates to 'false'
              Zero(new_body, type_details->body_size, char);
              ^

"../../../../sv_inline.h", line 487: warning #4232-D: conversion from "XPVIO *" to a more strictly aligned type "XPVMG *" may cause misaligned access
              SvSTASH_set(io, MUTABLE_HV(SvREFCNT_inc(GvHV(iogv))));
              ^

"../../../../sv_inline.h", line 468: warning #4276-D: relational operator ">" always evaluates to 'false'
              Zero(new_body, type_details->body_size, char);
              ^

"../../../../sv_inline.h", line 487: warning #4232-D: conversion from "XPVIO *" to a more strictly aligned type "XPVMG *" may cause misaligned access
              SvSTASH_set(io, MUTABLE_HV(SvREFCNT_inc(GvHV(iogv))));
              ^

"../../../../sv_inline.h", line 468: warning #4276-D: relational operator ">" always evaluates to 'false'
              Zero(new_body, type_details->body_size, char);
              ^

"../../../../sv_inline.h", line 487: warning #4232-D: conversion from "XPVIO *" to a more strictly aligned type "XPVMG *" may cause misaligned access
              SvSTASH_set(io, MUTABLE_HV(SvREFCNT_inc(GvHV(iogv))));
              ^

"../../../../sv_inline.h", line 468: warning #4276-D: relational operator ">" always evaluates to 'false'
              Zero(new_body, type_details->body_size, char);
              ^

"../../../../sv_inline.h", line 487: warning #4232-D: conversion from "XPVIO *" to a more strictly aligned type "XPVMG *" may cause misaligned access
              SvSTASH_set(io, MUTABLE_HV(SvREFCNT_inc(GvHV(iogv))));
              ^

"../../../../sv_inline.h", line 468: warning #4276-D: relational operator ">" always evaluates to 'false'
              Zero(new_body, type_details->body_size, char);
              ^

"../../../../sv_inline.h", line 487: warning #4232-D: conversion from "XPVIO *" to a more strictly aligned type "XPVMG *" may cause misaligned access
              SvSTASH_set(io, MUTABLE_HV(SvREFCNT_inc(GvHV(iogv))));
              ^

"../../../../sv_inline.h", line 468: warning #4276-D: relational operator ">" always evaluates to 'false'
              Zero(new_body, type_details->body_size, char);
              ^

# Connected to 127.0.0.1
# Connected to 127.0.0.1
Integer overflow in hexadecimal number at t/broken_univ_can.t line 13.
Redefining sub xChild::foo at xChild--7182 line 2.
Redefining sub Data::ok at -e line 1.
"/pro/3gl/CPAN/perl-current/sv_inline.h", line 487: warning #4232-D: conversion from "XPVIO *" to a more strictly aligned type "XPVMG *" may cause misaligned access
              SvSTASH_set(io, MUTABLE_HV(SvREFCNT_inc(GvHV(iogv))));
              ^

"XSTest.c", line 249: warning #2111-D: statement is unreachable
  	PUTBACK;
  	^

"/pro/3gl/CPAN/perl-current/sv_inline.h", line 468: warning #4276-D: relational operator ">" always evaluates to 'false'
              Zero(new_body, type_details->body_size, char);
              ^

c++: error: +Z: No such file or directory
c++: error: +O2: No such file or directory
c++: error: +Onolimit: No such file or directory
"/pro/3gl/CPAN/perl-current/sv_inline.h", line 487: warning #4232-D: conversion from "XPVIO *" to a more strictly aligned type "XPVMG *" may cause misaligned access
              SvSTASH_set(io, MUTABLE_HV(SvREFCNT_inc(GvHV(iogv))));
              ^

"/pro/3gl/CPAN/perl-current/sv_inline.h", line 468: warning #4276-D: relational operator ">" always evaluates to 'false'
              Zero(new_body, type_details->body_size, char);
              ^

"XSMore.xs", line 48: warning #4276-D: relational operator ">" always evaluates to 'false'
     Newx(*c, lenc+1, char);
     ^

"XSMore.xs", line 63: warning #4276-D: relational operator ">" always evaluates to 'false'
     Newx(*c, lenc+1, char);
     ^

"/pro/3gl/CPAN/perl-current/sv_inline.h", line 487: warning #4232-D: conversion from "XPVIO *" to a more strictly aligned type "XPVMG *" may cause misaligned access
              SvSTASH_set(io, MUTABLE_HV(SvREFCNT_inc(GvHV(iogv))));
              ^

"/pro/3gl/CPAN/perl-current/sv_inline.h", line 468: warning #4276-D: relational operator ">" always evaluates to 'false'
              Zero(new_body, type_details->body_size, char);
              ^

Subroutine Time::HiRes::constant redefined at (eval 37) line 1.
Subroutine Time::HiRes::usleep redefined at (eval 37) line 1.
Subroutine Time::HiRes::nanosleep redefined at (eval 37) line 1.
Subroutine Time::HiRes::sleep redefined at (eval 37) line 1.
Subroutine Time::HiRes::ualarm redefined at (eval 37) line 1.
Subroutine Time::HiRes::alarm redefined at (eval 37) line 1.
Subroutine Time::HiRes::gettimeofday redefined at (eval 37) line 1.
Subroutine Time::HiRes::time redefined at (eval 37) line 1.
Subroutine Time::HiRes::setitimer redefined at (eval 37) line 1.
Subroutine Time::HiRes::getitimer redefined at (eval 37) line 1.
Subroutine Time::HiRes::utime redefined at (eval 37) line 1.
Subroutine Time::HiRes::clock_gettime redefined at (eval 37) line 1.
Subroutine Time::HiRes::clock_getres redefined at (eval 37) line 1.
Subroutine Time::HiRes::clock_nanosleep redefined at (eval 37) line 1.
Subroutine Time::HiRes::clock redefined at (eval 37) line 1.
Subroutine Time::HiRes::lstat redefined at (eval 37) line 1.
Subroutine Time::HiRes::stat redefined at (eval 37) line 1.
"../sv_inline.h", line 487: warning #4232-D: conversion from "XPVIO *" to a more strictly aligned type "XPVMG *" may cause misaligned access
              SvSTASH_set(io, MUTABLE_HV(SvREFCNT_inc(GvHV(iogv))));
              ^

"../sv_inline.h", line 468: warning #4276-D: relational operator ">" always evaluates to 'false'
              Zero(new_body, type_details->body_size, char);
              ^

cc: warning 983: The -lc library specified on the command line is also added automatically by the compiler driver.  
# Failed test 1701 - sprintf( "%.54g", 0.3 ) renders correctly at op/sprintf2.t line 1197
#      got "0.299999999999999988897769753748434596"
# expected eq "0.299999999999999988897769753748434595763683319091796875"
make: *** [test_harness] Error 1

error while running harness target 'test_harness': 2 at /pro/3gl/CPAN/smoke/lib/Test/Smoke/App/RunSmoke.pm line 118.
[2022-04-23 14:19:44+0200] 
[2022-04-23 14:19:44+0200] ../dist/Net-Ping/t/450_service.t............................PASSED
[2022-04-23 14:19:44+0200]     9, 18
[2022-04-23 14:19:44+0200] ../t/op/sprintf2.t..........................................FAILED
[2022-04-23 14:19:44+0200]     1701
[2022-04-23 14:19:44+0200] Archived results...
[2022-04-23 14:19:44+0200] TSTENV = perlio	
"../../../../sv_inline.h", line 487: warning #4232-D: conversion from "XPVIO *" to a more strictly aligned type "XPVMG *" may cause misaligned access
              SvSTASH_set(io, MUTABLE_HV(SvREFCNT_inc(GvHV(iogv))));
              ^

"../../../../sv_inline.h", line 468: warning #4276-D: relational operator ">" always evaluates to 'false'
              Zero(new_body, type_details->body_size, char);
              ^

"../../../../sv_inline.h", line 487: warning #4232-D: conversion from "XPVIO *" to a more strictly aligned type "XPVMG *" may cause misaligned access
              SvSTASH_set(io, MUTABLE_HV(SvREFCNT_inc(GvHV(iogv))));
              ^

"../../../../sv_inline.h", line 468: warning #4276-D: relational operator ">" always evaluates to 'false'
              Zero(new_body, type_details->body_size, char);
              ^

"../../../../sv_inline.h", line 487: warning #4232-D: conversion from "XPVIO *" to a more strictly aligned type "XPVMG *" may cause misaligned access
              SvSTASH_set(io, MUTABLE_HV(SvREFCNT_inc(GvHV(iogv))));
              ^

"../../../../sv_inline.h", line 468: warning #4276-D: relational operator ">" always evaluates to 'false'
              Zero(new_body, type_details->body_size, char);
              ^

"../../../../sv_inline.h", line 487: warning #4232-D: conversion from "XPVIO *" to a more strictly aligned type "XPVMG *" may cause misaligned access
              SvSTASH_set(io, MUTABLE_HV(SvREFCNT_inc(GvHV(iogv))));
              ^

"../../../../sv_inline.h", line 468: warning #4276-D: relational operator ">" always evaluates to 'false'
              Zero(new_body, type_details->body_size, char);
              ^

"../../../../sv_inline.h", line 487: warning #4232-D: conversion from "XPVIO *" to a more strictly aligned type "XPVMG *" may cause misaligned access
              SvSTASH_set(io, MUTABLE_HV(SvREFCNT_inc(GvHV(iogv))));
              ^

"../../../../sv_inline.h", line 468: warning #4276-D: relational operator ">" always evaluates to 'false'
              Zero(new_body, type_details->body_size, char);
              ^

"../../../../sv_inline.h", line 487: warning #4232-D: conversion from "XPVIO *" to a more strictly aligned type "XPVMG *" may cause misaligned access
              SvSTASH_set(io, MUTABLE_HV(SvREFCNT_inc(GvHV(iogv))));
              ^

"../../../../sv_inline.h", line 468: warning #4276-D: relational operator ">" always evaluates to 'false'
              Zero(new_body, type_details->body_size, char);
              ^

"../../../../sv_inline.h", line 487: warning #4232-D: conversion from "XPVIO *" to a more strictly aligned type "XPVMG *" may cause misaligned access
              SvSTASH_set(io, MUTABLE_HV(SvREFCNT_inc(GvHV(iogv))));
              ^

"../../../../sv_inline.h", line 468: warning #4276-D: relational operator ">" always evaluates to 'false'
              Zero(new_body, type_details->body_size, char);
              ^

"/pro/3gl/CPAN/perl-current/sv_inline.h", line 487: warning #4232-D: conversion from "XPVIO *" to a more strictly aligned type "XPVMG *" may cause misaligned access
              SvSTASH_set(io, MUTABLE_HV(SvREFCNT_inc(GvHV(iogv))));
              ^

"XSTest.c", line 249: warning #2111-D: statement is unreachable
  	PUTBACK;
  	^

"/pro/3gl/CPAN/perl-current/sv_inline.h", line 468: warning #4276-D: relational operator ">" always evaluates to 'false'
              Zero(new_body, type_details->body_size, char);
              ^

"/pro/3gl/CPAN/perl-current/sv_inline.h", line 487: warning #4232-D: conversion from "XPVIO *" to a more strictly aligned type "XPVMG *" may cause misaligned access
              SvSTASH_set(io, MUTABLE_HV(SvREFCNT_inc(GvHV(iogv))));
              ^

"/pro/3gl/CPAN/perl-current/sv_inline.h", line 468: warning #4276-D: relational operator ">" always evaluates to 'false'
              Zero(new_body, type_details->body_size, char);
              ^

"XSMore.xs", line 48: warning #4276-D: relational operator ">" always evaluates to 'false'
     Newx(*c, lenc+1, char);
     ^

"XSMore.xs", line 63: warning #4276-D: relational operator ">" always evaluates to 'false'
     Newx(*c, lenc+1, char);
     ^

"/pro/3gl/CPAN/perl-current/sv_inline.h", line 487: warning #4232-D: conversion from "XPVIO *" to a more strictly aligned type "XPVMG *" may cause misaligned access
              SvSTASH_set(io, MUTABLE_HV(SvREFCNT_inc(GvHV(iogv))));
              ^

"/pro/3gl/CPAN/perl-current/sv_inline.h", line 468: warning #4276-D: relational operator ">" always evaluates to 'false'
              Zero(new_body, type_details->body_size, char);
              ^

c++: error: +Z: No such file or directory
c++: error: +O2: No such file or directory
c++: error: +Onolimit: No such file or directory
"../sv_inline.h", line 487: warning #4232-D: conversion from "XPVIO *" to a more strictly aligned type "XPVMG *" may cause misaligned access
              SvSTASH_set(io, MUTABLE_HV(SvREFCNT_inc(GvHV(iogv))));
              ^

"../sv_inline.h", line 468: warning #4276-D: relational operator ">" always evaluates to 'false'
              Zero(new_body, type_details->body_size, char);
              ^

cc: warning 983: The -lc library specified on the command line is also added automatically by the compiler driver.  
# Failed test 1701 - sprintf( "%.54g", 0.3 ) renders correctly at op/sprintf2.t line 1197
#      got "0.299999999999999988897769753748434596"
# expected eq "0.299999999999999988897769753748434595763683319091796875"
# Connected to 127.0.0.1
# Connected to 127.0.0.1
Subroutine Time::HiRes::constant redefined at (eval 37) line 1.
Subroutine Time::HiRes::usleep redefined at (eval 37) line 1.
Subroutine Time::HiRes::nanosleep redefined at (eval 37) line 1.
Subroutine Time::HiRes::sleep redefined at (eval 37) line 1.
Subroutine Time::HiRes::ualarm redefined at (eval 37) line 1.
Subroutine Time::HiRes::alarm redefined at (eval 37) line 1.
Subroutine Time::HiRes::gettimeofday redefined at (eval 37) line 1.
Subroutine Time::HiRes::time redefined at (eval 37) line 1.
Subroutine Time::HiRes::setitimer redefined at (eval 37) line 1.
Subroutine Time::HiRes::getitimer redefined at (eval 37) line 1.
Subroutine Time::HiRes::utime redefined at (eval 37) line 1.
Subroutine Time::HiRes::clock_gettime redefined at (eval 37) line 1.
Subroutine Time::HiRes::clock_getres redefined at (eval 37) line 1.
Subroutine Time::HiRes::clock_nanosleep redefined at (eval 37) line 1.
Subroutine Time::HiRes::clock redefined at (eval 37) line 1.
Subroutine Time::HiRes::lstat redefined at (eval 37) line 1.
Subroutine Time::HiRes::stat redefined at (eval 37) line 1.
Cannot figure out an encoding to use at t/use-Encode-Alias.t line 5.
Integer overflow in hexadecimal number at t/broken_univ_can.t line 13.
make: *** [test_harness] Error 1

error while running harness target 'test_harness': 2 at /pro/3gl/CPAN/smoke/lib/Test/Smoke/App/RunSmoke.pm line 118.
[2022-04-23 14:38:09+0200] 
[2022-04-23 14:38:09+0200] ../dist/Net-Ping/t/450_service.t............................PASSED
[2022-04-23 14:38:09+0200]     9, 18
[2022-04-23 14:38:09+0200] ../t/op/sprintf2.t..........................................FAILED
[2022-04-23 14:38:09+0200]     1701
[2022-04-23 14:38:09+0200] Archived results...
[2022-04-23 14:38:09+0200] TSTENV = locale:en_US.utf8	
"../../../../sv_inline.h", line 487: warning #4232-D: conversion from "XPVIO *" to a more strictly aligned type "XPVMG *" may cause misaligned access
              SvSTASH_set(io, MUTABLE_HV(SvREFCNT_inc(GvHV(iogv))));
              ^

"../../../../sv_inline.h", line 468: warning #4276-D: relational operator ">" always evaluates to 'false'
              Zero(new_body, type_details->body_size, char);
              ^

"../../../../sv_inline.h", line 487: warning #4232-D: conversion from "XPVIO *" to a more strictly aligned type "XPVMG *" may cause misaligned access
              SvSTASH_set(io, MUTABLE_HV(SvREFCNT_inc(GvHV(iogv))));
              ^

"../../../../sv_inline.h", line 468: warning #4276-D: relational operator ">" always evaluates to 'false'
              Zero(new_body, type_details->body_size, char);
              ^

"../../../../sv_inline.h", line 487: warning #4232-D: conversion from "XPVIO *" to a more strictly aligned type "XPVMG *" may cause misaligned access
              SvSTASH_set(io, MUTABLE_HV(SvREFCNT_inc(GvHV(iogv))));
              ^

"../../../../sv_inline.h", line 468: warning #4276-D: relational operator ">" always evaluates to 'false'
              Zero(new_body, type_details->body_size, char);
              ^

"../../../../sv_inline.h", line 487: warning #4232-D: conversion from "XPVIO *" to a more strictly aligned type "XPVMG *" may cause misaligned access
              SvSTASH_set(io, MUTABLE_HV(SvREFCNT_inc(GvHV(iogv))));
              ^

"../../../../sv_inline.h", line 468: warning #4276-D: relational operator ">" always evaluates to 'false'
              Zero(new_body, type_details->body_size, char);
              ^

"../../../../sv_inline.h", line 487: warning #4232-D: conversion from "XPVIO *" to a more strictly aligned type "XPVMG *" may cause misaligned access
              SvSTASH_set(io, MUTABLE_HV(SvREFCNT_inc(GvHV(iogv))));
              ^

"../../../../sv_inline.h", line 468: warning #4276-D: relational operator ">" always evaluates to 'false'
              Zero(new_body, type_details->body_size, char);
              ^

"../../../../sv_inline.h", line 487: warning #4232-D: conversion from "XPVIO *" to a more strictly aligned type "XPVMG *" may cause misaligned access
              SvSTASH_set(io, MUTABLE_HV(SvREFCNT_inc(GvHV(iogv))));
              ^

"../../../../sv_inline.h", line 468: warning #4276-D: relational operator ">" always evaluates to 'false'
              Zero(new_body, type_details->body_size, char);
              ^

"../../../../sv_inline.h", line 487: warning #4232-D: conversion from "XPVIO *" to a more strictly aligned type "XPVMG *" may cause misaligned access
              SvSTASH_set(io, MUTABLE_HV(SvREFCNT_inc(GvHV(iogv))));
              ^

"../../../../sv_inline.h", line 468: warning #4276-D: relational operator ">" always evaluates to 'false'
              Zero(new_body, type_details->body_size, char);
              ^

"/pro/3gl/CPAN/perl-current/sv_inline.h", line 487: warning #4232-D: conversion from "XPVIO *" to a more strictly aligned type "XPVMG *" may cause misaligned access
              SvSTASH_set(io, MUTABLE_HV(SvREFCNT_inc(GvHV(iogv))));
              ^

"XSTest.c", line 249: warning #2111-D: statement is unreachable
  	PUTBACK;
  	^

"/pro/3gl/CPAN/perl-current/sv_inline.h", line 468: warning #4276-D: relational operator ">" always evaluates to 'false'
              Zero(new_body, type_details->body_size, char);
              ^

"/pro/3gl/CPAN/perl-current/sv_inline.h", line 487: warning #4232-D: conversion from "XPVIO *" to a more strictly aligned type "XPVMG *" may cause misaligned access
              SvSTASH_set(io, MUTABLE_HV(SvREFCNT_inc(GvHV(iogv))));
              ^

"/pro/3gl/CPAN/perl-current/sv_inline.h", line 468: warning #4276-D: relational operator ">" always evaluates to 'false'
              Zero(new_body, type_details->body_size, char);
              ^

"XSMore.xs", line 48: warning #4276-D: relational operator ">" always evaluates to 'false'
     Newx(*c, lenc+1, char);
     ^

"XSMore.xs", line 63: warning #4276-D: relational operator ">" always evaluates to 'false'
     Newx(*c, lenc+1, char);
     ^

"/pro/3gl/CPAN/perl-current/sv_inline.h", line 487: warning #4232-D: conversion from "XPVIO *" to a more strictly aligned type "XPVMG *" may cause misaligned access
              SvSTASH_set(io, MUTABLE_HV(SvREFCNT_inc(GvHV(iogv))));
              ^

"/pro/3gl/CPAN/perl-current/sv_inline.h", line 468: warning #4276-D: relational operator ">" always evaluates to 'false'
              Zero(new_body, type_details->body_size, char);
              ^

c++: error: +Z: No such file or directory
c++: error: +O2: No such file or directory
c++: error: +Onolimit: No such file or directory
"../sv_inline.h", line 487: warning #4232-D: conversion from "XPVIO *" to a more strictly aligned type "XPVMG *" may cause misaligned access
              SvSTASH_set(io, MUTABLE_HV(SvREFCNT_inc(GvHV(iogv))));
              ^

"../sv_inline.h", line 468: warning #4276-D: relational operator ">" always evaluates to 'false'
              Zero(new_body, type_details->body_size, char);
              ^

cc: warning 983: The -lc library specified on the command line is also added automatically by the compiler driver.  
# Failed test 1701 - sprintf( "%.54g", 0.3 ) renders correctly at op/sprintf2.t line 1197
#      got "0.299999999999999988897769753748434596"
# expected eq "0.299999999999999988897769753748434595763683319091796875"
Subroutine Time::HiRes::constant redefined at (eval 37) line 1.
Subroutine Time::HiRes::usleep redefined at (eval 37) line 1.
Subroutine Time::HiRes::nanosleep redefined at (eval 37) line 1.
Subroutine Time::HiRes::sleep redefined at (eval 37) line 1.
Subroutine Time::HiRes::ualarm redefined at (eval 37) line 1.
Subroutine Time::HiRes::alarm redefined at (eval 37) line 1.
Subroutine Time::HiRes::gettimeofday redefined at (eval 37) line 1.
Subroutine Time::HiRes::time redefined at (eval 37) line 1.
Subroutine Time::HiRes::setitimer redefined at (eval 37) line 1.
Subroutine Time::HiRes::getitimer redefined at (eval 37) line 1.
Subroutine Time::HiRes::utime redefined at (eval 37) line 1.
Subroutine Time::HiRes::clock_gettime redefined at (eval 37) line 1.
Subroutine Time::HiRes::clock_getres redefined at (eval 37) line 1.
Subroutine Time::HiRes::clock_nanosleep redefined at (eval 37) line 1.
Subroutine Time::HiRes::clock redefined at (eval 37) line 1.
Subroutine Time::HiRes::lstat redefined at (eval 37) line 1.
Subroutine Time::HiRes::stat redefined at (eval 37) line 1.
# Connected to 127.0.0.1
# Connected to 127.0.0.1
Integer overflow in hexadecimal number at t/broken_univ_can.t line 13.
make: *** [test_harness] Error 1

error while running harness target 'test_harness': 2 at /pro/3gl/CPAN/smoke/lib/Test/Smoke/App/RunSmoke.pm line 118.
[2022-04-23 14:56:45+0200] 
[2022-04-23 14:56:45+0200] ../dist/Net-Ping/t/450_service.t............................PASSED
[2022-04-23 14:56:45+0200]     9, 18
[2022-04-23 14:56:45+0200] ../t/op/sprintf2.t..........................................FAILED
[2022-04-23 14:56:45+0200]     1701
[2022-04-23 14:56:45+0200] Archived results...
[2022-04-23 14:56:45+0200] Unskip tests from '/pro/3gl/CPAN/smoke/p59.skip'
[2022-04-23 14:56:45+0200] 
[2022-04-23 14:56:45+0200] Configuration: -Dusedevel -Duseithreads -Duse64bitall
[2022-04-23 14:56:45+0200] ------------------------------------------------------------------------------
[2022-04-23 14:56:45+0200] make distclean ...
[2022-04-23 14:57:32+0200] 
[2022-04-23 14:57:32+0200] Copy Policy.sh ...
[2022-04-23 14:57:32+0200] 
[2022-04-23 14:57:32+0200] Configure ...
[2022-04-23 14:59:09+0200] 
[2022-04-23 14:59:09+0200] make ...
[2022-04-23 15:12:36+0200] Skip tests from '/pro/3gl/CPAN/smoke/p59.skip'
[2022-04-23 15:12:36+0200] 	cpan/Sys-Syslog/t/syslog.t
[2022-04-23 15:12:36+0200] 
[2022-04-23 15:12:36+0200]  Tests start here:
[2022-04-23 15:12:36+0200] TSTENV = stdio	
No saved state, selection will be empty
Cannot figure out an encoding to use at t/use-Encode-Alias.t line 5.
"../../../../sv_inline.h", line 468: warning #4276-D: relational operator ">" always evaluates to 'false'
              Zero(new_body, type_details->body_size, char);
              ^

"../../../../sv_inline.h", line 468: warning #4276-D: relational operator ">" always evaluates to 'false'
              Zero(new_body, type_details->body_size, char);
              ^

"../../../../sv_inline.h", line 468: warning #4276-D: relational operator ">" always evaluates to 'false'
              Zero(new_body, type_details->body_size, char);
              ^

"../../../../sv_inline.h", line 468: warning #4276-D: relational operator ">" always evaluates to 'false'
              Zero(new_body, type_details->body_size, char);
              ^

"../../../../sv_inline.h", line 468: warning #4276-D: relational operator ">" always evaluates to 'false'
              Zero(new_body, type_details->body_size, char);
              ^

"../../../../sv_inline.h", line 468: warning #4276-D: relational operator ">" always evaluates to 'false'
              Zero(new_body, type_details->body_size, char);
              ^

"../../../../sv_inline.h", line 468: warning #4276-D: relational operator ">" always evaluates to 'false'
              Zero(new_body, type_details->body_size, char);
              ^

# Connected to 127.0.0.1
# Connected to 127.0.0.1
Redefining sub xChild::foo at xChild--17013 line 2.
Redefining sub Data::ok at -e line 1.
"XSTest.c", line 249: warning #2111-D: statement is unreachable
  	PUTBACK;
  	^

"/pro/3gl/CPAN/perl-current/sv_inline.h", line 468: warning #4276-D: relational operator ">" always evaluates to 'false'
              Zero(new_body, type_details->body_size, char);
              ^

c++: error: +Z: No such file or directory
c++: error: +O2: No such file or directory
c++: error: +Onolimit: No such file or directory
"/pro/3gl/CPAN/perl-current/sv_inline.h", line 468: warning #4276-D: relational operator ">" always evaluates to 'false'
              Zero(new_body, type_details->body_size, char);
              ^

"XSMore.xs", line 48: warning #4276-D: relational operator ">" always evaluates to 'false'
     Newx(*c, lenc+1, char);
     ^

"XSMore.xs", line 63: warning #4276-D: relational operator ">" always evaluates to 'false'
     Newx(*c, lenc+1, char);
     ^

"/pro/3gl/CPAN/perl-current/sv_inline.h", line 468: warning #4276-D: relational operator ">" always evaluates to 'false'
              Zero(new_body, type_details->body_size, char);
              ^

Subroutine Time::HiRes::constant redefined at (eval 37) line 1.
Subroutine Time::HiRes::usleep redefined at (eval 37) line 1.
Subroutine Time::HiRes::nanosleep redefined at (eval 37) line 1.
Subroutine Time::HiRes::sleep redefined at (eval 37) line 1.
Subroutine Time::HiRes::ualarm redefined at (eval 37) line 1.
Subroutine Time::HiRes::alarm redefined at (eval 37) line 1.
Subroutine Time::HiRes::gettimeofday redefined at (eval 37) line 1.
Subroutine Time::HiRes::time redefined at (eval 37) line 1.
Subroutine Time::HiRes::setitimer redefined at (eval 37) line 1.
Subroutine Time::HiRes::getitimer redefined at (eval 37) line 1.
Subroutine Time::HiRes::utime redefined at (eval 37) line 1.
Subroutine Time::HiRes::clock_gettime redefined at (eval 37) line 1.
Subroutine Time::HiRes::clock_getres redefined at (eval 37) line 1.
Subroutine Time::HiRes::clock_nanosleep redefined at (eval 37) line 1.
Subroutine Time::HiRes::clock redefined at (eval 37) line 1.
Subroutine Time::HiRes::lstat redefined at (eval 37) line 1.
Subroutine Time::HiRes::stat redefined at (eval 37) line 1.
"../sv_inline.h", line 468: warning #4276-D: relational operator ">" always evaluates to 'false'
              Zero(new_body, type_details->body_size, char);
              ^

cc: warning 983: The -lc library specified on the command line is also added automatically by the compiler driver.  
# Failed test 1704 - sprintf( "%.54g", 0.3 ) renders correctly at op/sprintf2.t line 1197
#      got "0.299999999999999988897769753748434596"
# expected eq "0.299999999999999988897769753748434595763683319091796875"
make: *** [test_harness] Error 1

error while running harness target 'test_harness': 2 at /pro/3gl/CPAN/smoke/lib/Test/Smoke/App/RunSmoke.pm line 118.
[2022-04-23 15:32:00+0200] 
[2022-04-23 15:32:00+0200] ../dist/Net-Ping/t/450_service.t............................PASSED
[2022-04-23 15:32:00+0200]     9, 18
[2022-04-23 15:32:00+0200] ../t/op/sprintf2.t..........................................FAILED
[2022-04-23 15:32:00+0200]     1704
[2022-04-23 15:32:00+0200] ../t/re/reg_mesg.t..........................................FAILED
[2022-04-23 15:32:00+0200]     No plan found in TAP output
[2022-04-23 15:32:00+0200] ../t/re/regex_sets.t........................................FAILED
[2022-04-23 15:32:00+0200]     No plan found in TAP output
[2022-04-23 15:32:00+0200] Archived results...
[2022-04-23 15:32:00+0200] TSTENV = perlio	
"../../../../sv_inline.h", line 468: warning #4276-D: relational operator ">" always evaluates to 'false'
              Zero(new_body, type_details->body_size, char);
              ^

"../../../../sv_inline.h", line 468: warning #4276-D: relational operator ">" always evaluates to 'false'
              Zero(new_body, type_details->body_size, char);
              ^

"../../../../sv_inline.h", line 468: warning #4276-D: relational operator ">" always evaluates to 'false'
              Zero(new_body, type_details->body_size, char);
              ^

"../../../../sv_inline.h", line 468: warning #4276-D: relational operator ">" always evaluates to 'false'
              Zero(new_body, type_details->body_size, char);
              ^

"../../../../sv_inline.h", line 468: warning #4276-D: relational operator ">" always evaluates to 'false'
              Zero(new_body, type_details->body_size, char);
              ^

"../../../../sv_inline.h", line 468: warning #4276-D: relational operator ">" always evaluates to 'false'
              Zero(new_body, type_details->body_size, char);
              ^

"../../../../sv_inline.h", line 468: warning #4276-D: relational operator ">" always evaluates to 'false'
              Zero(new_body, type_details->body_size, char);
              ^

"XSTest.c", line 249: warning #2111-D: statement is unreachable
  	PUTBACK;
  	^

"/pro/3gl/CPAN/perl-current/sv_inline.h", line 468: warning #4276-D: relational operator ">" always evaluates to 'false'
              Zero(new_body, type_details->body_size, char);
              ^

"/pro/3gl/CPAN/perl-current/sv_inline.h", line 468: warning #4276-D: relational operator ">" always evaluates to 'false'
              Zero(new_body, type_details->body_size, char);
              ^

"XSMore.xs", line 48: warning #4276-D: relational operator ">" always evaluates to 'false'
     Newx(*c, lenc+1, char);
     ^

"XSMore.xs", line 63: warning #4276-D: relational operator ">" always evaluates to 'false'
     Newx(*c, lenc+1, char);
     ^

"/pro/3gl/CPAN/perl-current/sv_inline.h", line 468: warning #4276-D: relational operator ">" always evaluates to 'false'
              Zero(new_body, type_details->body_size, char);
              ^

c++: error: +Z: No such file or directory
c++: error: +O2: No such file or directory
c++: error: +Onolimit: No such file or directory
"../sv_inline.h", line 468: warning #4276-D: relational operator ">" always evaluates to 'false'
              Zero(new_body, type_details->body_size, char);
              ^

cc: warning 983: The -lc library specified on the command line is also added automatically by the compiler driver.  
# Failed test 1704 - sprintf( "%.54g", 0.3 ) renders correctly at op/sprintf2.t line 1197
#      got "0.299999999999999988897769753748434596"
# expected eq "0.299999999999999988897769753748434595763683319091796875"
Subroutine Time::HiRes::constant redefined at (eval 37) line 1.
Subroutine Time::HiRes::usleep redefined at (eval 37) line 1.
Subroutine Time::HiRes::nanosleep redefined at (eval 37) line 1.
Subroutine Time::HiRes::sleep redefined at (eval 37) line 1.
Subroutine Time::HiRes::ualarm redefined at (eval 37) line 1.
Subroutine Time::HiRes::alarm redefined at (eval 37) line 1.
Subroutine Time::HiRes::gettimeofday redefined at (eval 37) line 1.
Subroutine Time::HiRes::time redefined at (eval 37) line 1.
Subroutine Time::HiRes::setitimer redefined at (eval 37) line 1.
Subroutine Time::HiRes::getitimer redefined at (eval 37) line 1.
Subroutine Time::HiRes::utime redefined at (eval 37) line 1.
Subroutine Time::HiRes::clock_gettime redefined at (eval 37) line 1.
Subroutine Time::HiRes::clock_getres redefined at (eval 37) line 1.
Subroutine Time::HiRes::clock_nanosleep redefined at (eval 37) line 1.
Subroutine Time::HiRes::clock redefined at (eval 37) line 1.
Subroutine Time::HiRes::lstat redefined at (eval 37) line 1.
Subroutine Time::HiRes::stat redefined at (eval 37) line 1.
# Connected to 127.0.0.1
# Connected to 127.0.0.1
Cannot figure out an encoding to use at t/use-Encode-Alias.t line 5.
make: *** [test_harness] Error 1

error while running harness target 'test_harness': 2 at /pro/3gl/CPAN/smoke/lib/Test/Smoke/App/RunSmoke.pm line 118.
[2022-04-23 15:48:45+0200] 
[2022-04-23 15:48:45+0200] ../dist/Net-Ping/t/450_service.t............................PASSED
[2022-04-23 15:48:45+0200]     9, 18
[2022-04-23 15:48:45+0200] ../t/op/sprintf2.t..........................................FAILED
[2022-04-23 15:48:45+0200]     1704
[2022-04-23 15:48:45+0200] ../t/re/regex_sets.t........................................FAILED
[2022-04-23 15:48:45+0200]     No plan found in TAP output
[2022-04-23 15:48:45+0200] ../t/re/reg_mesg.t..........................................FAILED
[2022-04-23 15:48:45+0200]     No plan found in TAP output
[2022-04-23 15:48:45+0200] Archived results...
[2022-04-23 15:48:45+0200] TSTENV = locale:en_US.utf8	
"../../../../sv_inline.h", line 468: warning #4276-D: relational operator ">" always evaluates to 'false'
              Zero(new_body, type_details->body_size, char);
              ^

"../../../../sv_inline.h", line 468: warning #4276-D: relational operator ">" always evaluates to 'false'
              Zero(new_body, type_details->body_size, char);
              ^

"../../../../sv_inline.h", line 468: warning #4276-D: relational operator ">" always evaluates to 'false'
              Zero(new_body, type_details->body_size, char);
              ^

"../../../../sv_inline.h", line 468: warning #4276-D: relational operator ">" always evaluates to 'false'
              Zero(new_body, type_details->body_size, char);
              ^

"../../../../sv_inline.h", line 468: warning #4276-D: relational operator ">" always evaluates to 'false'
              Zero(new_body, type_details->body_size, char);
              ^

"../../../../sv_inline.h", line 468: warning #4276-D: relational operator ">" always evaluates to 'false'
              Zero(new_body, type_details->body_size, char);
              ^

"../../../../sv_inline.h", line 468: warning #4276-D: relational operator ">" always evaluates to 'false'
              Zero(new_body, type_details->body_size, char);
              ^

"XSTest.c", line 249: warning #2111-D: statement is unreachable
  	PUTBACK;
  	^

"/pro/3gl/CPAN/perl-current/sv_inline.h", line 468: warning #4276-D: relational operator ">" always evaluates to 'false'
              Zero(new_body, type_details->body_size, char);
              ^

"/pro/3gl/CPAN/perl-current/sv_inline.h", line 468: warning #4276-D: relational operator ">" always evaluates to 'false'
              Zero(new_body, type_details->body_size, char);
              ^

"XSMore.xs", line 48: warning #4276-D: relational operator ">" always evaluates to 'false'
     Newx(*c, lenc+1, char);
     ^

"XSMore.xs", line 63: warning #4276-D: relational operator ">" always evaluates to 'false'
     Newx(*c, lenc+1, char);
     ^

"/pro/3gl/CPAN/perl-current/sv_inline.h", line 468: warning #4276-D: relational operator ">" always evaluates to 'false'
              Zero(new_body, type_details->body_size, char);
              ^

c++: error: +Z: No such file or directory
c++: error: +O2: No such file or directory
c++: error: +Onolimit: No such file or directory
"../sv_inline.h", line 468: warning #4276-D: relational operator ">" always evaluates to 'false'
              Zero(new_body, type_details->body_size, char);
              ^

cc: warning 983: The -lc library specified on the command line is also added automatically by the compiler driver.  
# Failed test 1704 - sprintf( "%.54g", 0.3 ) renders correctly at op/sprintf2.t line 1197
#      got "0.299999999999999988897769753748434596"
# expected eq "0.299999999999999988897769753748434595763683319091796875"
Subroutine Time::HiRes::constant redefined at (eval 37) line 1.
Subroutine Time::HiRes::usleep redefined at (eval 37) line 1.
Subroutine Time::HiRes::nanosleep redefined at (eval 37) line 1.
Subroutine Time::HiRes::sleep redefined at (eval 37) line 1.
Subroutine Time::HiRes::ualarm redefined at (eval 37) line 1.
Subroutine Time::HiRes::alarm redefined at (eval 37) line 1.
Subroutine Time::HiRes::gettimeofday redefined at (eval 37) line 1.
Subroutine Time::HiRes::time redefined at (eval 37) line 1.
Subroutine Time::HiRes::setitimer redefined at (eval 37) line 1.
Subroutine Time::HiRes::getitimer redefined at (eval 37) line 1.
Subroutine Time::HiRes::utime redefined at (eval 37) line 1.
Subroutine Time::HiRes::clock_gettime redefined at (eval 37) line 1.
Subroutine Time::HiRes::clock_getres redefined at (eval 37) line 1.
Subroutine Time::HiRes::clock_nanosleep redefined at (eval 37) line 1.
Subroutine Time::HiRes::clock redefined at (eval 37) line 1.
Subroutine Time::HiRes::lstat redefined at (eval 37) line 1.
Subroutine Time::HiRes::stat redefined at (eval 37) line 1.
# Connected to 127.0.0.1
# Connected to 127.0.0.1
make: *** [test_harness] Error 1

error while running harness target 'test_harness': 2 at /pro/3gl/CPAN/smoke/lib/Test/Smoke/App/RunSmoke.pm line 118.
[2022-04-23 16:05:43+0200] 
[2022-04-23 16:05:43+0200] ../dist/Net-Ping/t/450_service.t............................PASSED
[2022-04-23 16:05:43+0200]     9, 18
[2022-04-23 16:05:43+0200] ../t/op/sprintf2.t..........................................FAILED
[2022-04-23 16:05:43+0200]     1704
[2022-04-23 16:05:43+0200] ../t/re/reg_mesg.t..........................................FAILED
[2022-04-23 16:05:43+0200]     No plan found in TAP output
[2022-04-23 16:05:43+0200] ../t/re/regex_sets.t........................................FAILED
[2022-04-23 16:05:43+0200]     No plan found in TAP output
[2022-04-23 16:05:43+0200] Archived results...
[2022-04-23 16:05:43+0200] Unskip tests from '/pro/3gl/CPAN/smoke/p59.skip'
[2022-04-23 16:05:43+0200] 
[2022-04-23 16:05:43+0200] Configuration: -Dusedevel -Duseithreads -Duse64bitall -DDEBUGGING
[2022-04-23 16:05:43+0200] ------------------------------------------------------------------------------
[2022-04-23 16:05:43+0200] make distclean ...
[2022-04-23 16:06:26+0200] 
[2022-04-23 16:06:26+0200] Copy Policy.sh ...
[2022-04-23 16:06:26+0200] 
[2022-04-23 16:06:26+0200] Configure ...
[2022-04-23 16:08:04+0200] 
[2022-04-23 16:08:04+0200] make ...
[2022-04-23 16:24:13+0200] Skip tests from '/pro/3gl/CPAN/smoke/p59.skip'
[2022-04-23 16:24:13+0200] 	cpan/Sys-Syslog/t/syslog.t
[2022-04-23 16:24:13+0200] 
[2022-04-23 16:24:13+0200]  Tests start here:
[2022-04-23 16:24:13+0200] TSTENV = stdio	
No saved state, selection will be empty
Cannot figure out an encoding to use at t/use-Encode-Alias.t line 5.
"../../../../sv_inline.h", line 468: warning #4276-D: relational operator ">" always evaluates to 'false'
              Zero(new_body, type_details->body_size, char);
              ^

"../../../../sv_inline.h", line 468: warning #4276-D: relational operator ">" always evaluates to 'false'
              Zero(new_body, type_details->body_size, char);
              ^

"../../../../sv_inline.h", line 468: warning #4276-D: relational operator ">" always evaluates to 'false'
              Zero(new_body, type_details->body_size, char);
              ^

"../../../../sv_inline.h", line 468: warning #4276-D: relational operator ">" always evaluates to 'false'
              Zero(new_body, type_details->body_size, char);
              ^

"../../../../sv_inline.h", line 468: warning #4276-D: relational operator ">" always evaluates to 'false'
              Zero(new_body, type_details->body_size, char);
              ^

"../../../../sv_inline.h", line 468: warning #4276-D: relational operator ">" always evaluates to 'false'
              Zero(new_body, type_details->body_size, char);
              ^

"../../../../sv_inline.h", line 468: warning #4276-D: relational operator ">" always evaluates to 'false'
              Zero(new_body, type_details->body_size, char);
              ^

# Connected to 127.0.0.1
# Connected to 127.0.0.1
Redefining sub xChild::foo at xChild--27149 line 2.
Redefining sub Data::ok at -e line 1.
"XSTest.c", line 249: warning #2111-D: statement is unreachable
  	PUTBACK;
  	^

"/pro/3gl/CPAN/perl-current/sv_inline.h", line 468: warning #4276-D: relational operator ">" always evaluates to 'false'
              Zero(new_body, type_details->body_size, char);
              ^

c++: error: +Z: No such file or directory
c++: error: +O2: No such file or directory
c++: error: +Onolimit: No such file or directory
"/pro/3gl/CPAN/perl-current/sv_inline.h", line 468: warning #4276-D: relational operator ">" always evaluates to 'false'
              Zero(new_body, type_details->body_size, char);
              ^

"XSMore.xs", line 48: warning #4276-D: relational operator ">" always evaluates to 'false'
     Newx(*c, lenc+1, char);
     ^

"XSMore.xs", line 63: warning #4276-D: relational operator ">" always evaluates to 'false'
     Newx(*c, lenc+1, char);
     ^

"/pro/3gl/CPAN/perl-current/sv_inline.h", line 468: warning #4276-D: relational operator ">" always evaluates to 'false'
              Zero(new_body, type_details->body_size, char);
              ^

Subroutine Time::HiRes::constant redefined at (eval 37) line 1.
Subroutine Time::HiRes::usleep redefined at (eval 37) line 1.
Subroutine Time::HiRes::nanosleep redefined at (eval 37) line 1.
Subroutine Time::HiRes::sleep redefined at (eval 37) line 1.
Subroutine Time::HiRes::ualarm redefined at (eval 37) line 1.
Subroutine Time::HiRes::alarm redefined at (eval 37) line 1.
Subroutine Time::HiRes::gettimeofday redefined at (eval 37) line 1.
Subroutine Time::HiRes::time redefined at (eval 37) line 1.
Subroutine Time::HiRes::setitimer redefined at (eval 37) line 1.
Subroutine Time::HiRes::getitimer redefined at (eval 37) line 1.
Subroutine Time::HiRes::utime redefined at (eval 37) line 1.
Subroutine Time::HiRes::clock_gettime redefined at (eval 37) line 1.
Subroutine Time::HiRes::clock_getres redefined at (eval 37) line 1.
Subroutine Time::HiRes::clock_nanosleep redefined at (eval 37) line 1.
Subroutine Time::HiRes::clock redefined at (eval 37) line 1.
Subroutine Time::HiRes::lstat redefined at (eval 37) line 1.
Subroutine Time::HiRes::stat redefined at (eval 37) line 1.
"../sv_inline.h", line 468: warning #4276-D: relational operator ">" always evaluates to 'false'
              Zero(new_body, type_details->body_size, char);
              ^

cc: warning 983: The -lc library specified on the command line is also added automatically by the compiler driver.  
# Failed test 1704 - sprintf( "%.54g", 0.3 ) renders correctly at op/sprintf2.t line 1197
#      got "0.299999999999999988897769753748434596"
# expected eq "0.299999999999999988897769753748434595763683319091796875"
make: *** [test_harness] Error 2

error while running harness target 'test_harness': 2 at /pro/3gl/CPAN/smoke/lib/Test/Smoke/App/RunSmoke.pm line 118.
[2022-04-23 16:46:28+0200] 
[2022-04-23 16:46:28+0200] ../dist/Net-Ping/t/450_service.t............................PASSED
[2022-04-23 16:46:28+0200]     9, 18
[2022-04-23 16:46:28+0200] ../lib/locale.t.............................................FAILED
[2022-04-23 16:46:28+0200]     448
[2022-04-23 16:46:28+0200] ../t/op/sprintf2.t..........................................FAILED
[2022-04-23 16:46:28+0200]     1704
[2022-04-23 16:46:28+0200] ../t/re/reg_mesg.t..........................................FAILED
[2022-04-23 16:46:28+0200]     No plan found in TAP output
[2022-04-23 16:46:28+0200] ../t/re/regex_sets.t........................................FAILED
[2022-04-23 16:46:28+0200]     No plan found in TAP output
[2022-04-23 16:46:28+0200] Archived results...
[2022-04-23 16:46:28+0200] TSTENV = perlio	
"../../../../sv_inline.h", line 468: warning #4276-D: relational operator ">" always evaluates to 'false'
              Zero(new_body, type_details->body_size, char);
              ^

"../../../../sv_inline.h", line 468: warning #4276-D: relational operator ">" always evaluates to 'false'
              Zero(new_body, type_details->body_size, char);
              ^

"../../../../sv_inline.h", line 468: warning #4276-D: relational operator ">" always evaluates to 'false'
              Zero(new_body, type_details->body_size, char);
              ^

"../../../../sv_inline.h", line 468: warning #4276-D: relational operator ">" always evaluates to 'false'
              Zero(new_body, type_details->body_size, char);
              ^

"../../../../sv_inline.h", line 468: warning #4276-D: relational operator ">" always evaluates to 'false'
              Zero(new_body, type_details->body_size, char);
              ^

"../../../../sv_inline.h", line 468: warning #4276-D: relational operator ">" always evaluates to 'false'
              Zero(new_body, type_details->body_size, char);
              ^

"../../../../sv_inline.h", line 468: warning #4276-D: relational operator ">" always evaluates to 'false'
              Zero(new_body, type_details->body_size, char);
              ^

"XSTest.c", line 249: warning #2111-D: statement is unreachable
  	PUTBACK;
  	^

"/pro/3gl/CPAN/perl-current/sv_inline.h", line 468: warning #4276-D: relational operator ">" always evaluates to 'false'
              Zero(new_body, type_details->body_size, char);
              ^

"/pro/3gl/CPAN/perl-current/sv_inline.h", line 468: warning #4276-D: relational operator ">" always evaluates to 'false'
              Zero(new_body, type_details->body_size, char);
              ^

"XSMore.xs", line 48: warning #4276-D: relational operator ">" always evaluates to 'false'
     Newx(*c, lenc+1, char);
     ^

"XSMore.xs", line 63: warning #4276-D: relational operator ">" always evaluates to 'false'
     Newx(*c, lenc+1, char);
     ^

"/pro/3gl/CPAN/perl-current/sv_inline.h", line 468: warning #4276-D: relational operator ">" always evaluates to 'false'
              Zero(new_body, type_details->body_size, char);
              ^

c++: error: +Z: No such file or directory
c++: error: +O2: No such file or directory
c++: error: +Onolimit: No such file or directory
"../sv_inline.h", line 468: warning #4276-D: relational operator ">" always evaluates to 'false'
              Zero(new_body, type_details->body_size, char);
              ^

cc: warning 983: The -lc library specified on the command line is also added automatically by the compiler driver.  
# Failed test 1704 - sprintf( "%.54g", 0.3 ) renders correctly at op/sprintf2.t line 1197
#      got "0.299999999999999988897769753748434596"
# expected eq "0.299999999999999988897769753748434595763683319091796875"
# Connected to 127.0.0.1
# Connected to 127.0.0.1
Subroutine Time::HiRes::constant redefined at (eval 37) line 1.
Subroutine Time::HiRes::usleep redefined at (eval 37) line 1.
Subroutine Time::HiRes::nanosleep redefined at (eval 37) line 1.
Subroutine Time::HiRes::sleep redefined at (eval 37) line 1.
Subroutine Time::HiRes::ualarm redefined at (eval 37) line 1.
Subroutine Time::HiRes::alarm redefined at (eval 37) line 1.
Subroutine Time::HiRes::gettimeofday redefined at (eval 37) line 1.
Subroutine Time::HiRes::time redefined at (eval 37) line 1.
Subroutine Time::HiRes::setitimer redefined at (eval 37) line 1.
Subroutine Time::HiRes::getitimer redefined at (eval 37) line 1.
Subroutine Time::HiRes::utime redefined at (eval 37) line 1.
Subroutine Time::HiRes::clock_gettime redefined at (eval 37) line 1.
Subroutine Time::HiRes::clock_getres redefined at (eval 37) line 1.
Subroutine Time::HiRes::clock_nanosleep redefined at (eval 37) line 1.
Subroutine Time::HiRes::clock redefined at (eval 37) line 1.
Subroutine Time::HiRes::lstat redefined at (eval 37) line 1.
Subroutine Time::HiRes::stat redefined at (eval 37) line 1.
Cannot figure out an encoding to use at t/use-Encode-Alias.t line 5.
make: *** [test_harness] Error 1

error while running harness target 'test_harness': 2 at /pro/3gl/CPAN/smoke/lib/Test/Smoke/App/RunSmoke.pm line 118.
[2022-04-23 17:06:03+0200] 
[2022-04-23 17:06:03+0200] ../dist/Net-Ping/t/450_service.t............................PASSED
[2022-04-23 17:06:03+0200]     9, 18
[2022-04-23 17:06:03+0200] ../t/op/sprintf2.t..........................................FAILED
[2022-04-23 17:06:03+0200]     1704
[2022-04-23 17:06:03+0200] ../t/re/reg_mesg.t..........................................FAILED
[2022-04-23 17:06:03+0200]     No plan found in TAP output
[2022-04-23 17:06:03+0200] ../t/re/regex_sets.t........................................FAILED
[2022-04-23 17:06:03+0200]     No plan found in TAP output
[2022-04-23 17:06:03+0200] Archived results...
[2022-04-23 17:06:03+0200] TSTENV = locale:en_US.utf8	
"../../../../sv_inline.h", line 468: warning #4276-D: relational operator ">" always evaluates to 'false'
              Zero(new_body, type_details->body_size, char);
              ^

"../../../../sv_inline.h", line 468: warning #4276-D: relational operator ">" always evaluates to 'false'
              Zero(new_body, type_details->body_size, char);
              ^

"../../../../sv_inline.h", line 468: warning #4276-D: relational operator ">" always evaluates to 'false'
              Zero(new_body, type_details->body_size, char);
              ^

"../../../../sv_inline.h", line 468: warning #4276-D: relational operator ">" always evaluates to 'false'
              Zero(new_body, type_details->body_size, char);
              ^

"../../../../sv_inline.h", line 468: warning #4276-D: relational operator ">" always evaluates to 'false'
              Zero(new_body, type_details->body_size, char);
              ^

"../../../../sv_inline.h", line 468: warning #4276-D: relational operator ">" always evaluates to 'false'
              Zero(new_body, type_details->body_size, char);
              ^

"../../../../sv_inline.h", line 468: warning #4276-D: relational operator ">" always evaluates to 'false'
              Zero(new_body, type_details->body_size, char);
              ^

"XSTest.c", line 249: warning #2111-D: statement is unreachable
  	PUTBACK;
  	^

"/pro/3gl/CPAN/perl-current/sv_inline.h", line 468: warning #4276-D: relational operator ">" always evaluates to 'false'
              Zero(new_body, type_details->body_size, char);
              ^

"/pro/3gl/CPAN/perl-current/sv_inline.h", line 468: warning #4276-D: relational operator ">" always evaluates to 'false'
              Zero(new_body, type_details->body_size, char);
              ^

"XSMore.xs", line 48: warning #4276-D: relational operator ">" always evaluates to 'false'
     Newx(*c, lenc+1, char);
     ^

"XSMore.xs", line 63: warning #4276-D: relational operator ">" always evaluates to 'false'
     Newx(*c, lenc+1, char);
     ^

"/pro/3gl/CPAN/perl-current/sv_inline.h", line 468: warning #4276-D: relational operator ">" always evaluates to 'false'
              Zero(new_body, type_details->body_size, char);
              ^

c++: error: +Z: No such file or directory
c++: error: +O2: No such file or directory
c++: error: +Onolimit: No such file or directory
"../sv_inline.h", line 468: warning #4276-D: relational operator ">" always evaluates to 'false'
              Zero(new_body, type_details->body_size, char);
              ^

cc: warning 983: The -lc library specified on the command line is also added automatically by the compiler driver.  
# Failed test 1704 - sprintf( "%.54g", 0.3 ) renders correctly at op/sprintf2.t line 1197
#      got "0.299999999999999988897769753748434596"
# expected eq "0.299999999999999988897769753748434595763683319091796875"
Subroutine Time::HiRes::constant redefined at (eval 37) line 1.
Subroutine Time::HiRes::usleep redefined at (eval 37) line 1.
Subroutine Time::HiRes::nanosleep redefined at (eval 37) line 1.
Subroutine Time::HiRes::sleep redefined at (eval 37) line 1.
Subroutine Time::HiRes::ualarm redefined at (eval 37) line 1.
Subroutine Time::HiRes::alarm redefined at (eval 37) line 1.
Subroutine Time::HiRes::gettimeofday redefined at (eval 37) line 1.
Subroutine Time::HiRes::time redefined at (eval 37) line 1.
Subroutine Time::HiRes::setitimer redefined at (eval 37) line 1.
Subroutine Time::HiRes::getitimer redefined at (eval 37) line 1.
Subroutine Time::HiRes::utime redefined at (eval 37) line 1.
Subroutine Time::HiRes::clock_gettime redefined at (eval 37) line 1.
Subroutine Time::HiRes::clock_getres redefined at (eval 37) line 1.
Subroutine Time::HiRes::clock_nanosleep redefined at (eval 37) line 1.
Subroutine Time::HiRes::clock redefined at (eval 37) line 1.
Subroutine Time::HiRes::lstat redefined at (eval 37) line 1.
Subroutine Time::HiRes::stat redefined at (eval 37) line 1.
# Connected to 127.0.0.1
# Connected to 127.0.0.1
make: *** [test_harness] Error 1

error while running harness target 'test_harness': 2 at /pro/3gl/CPAN/smoke/lib/Test/Smoke/App/RunSmoke.pm line 118.
[2022-04-23 17:25:35+0200] 
[2022-04-23 17:25:35+0200] ../dist/Net-Ping/t/450_service.t............................PASSED
[2022-04-23 17:25:35+0200]     9, 18
[2022-04-23 17:25:35+0200] ../t/op/sprintf2.t..........................................FAILED
[2022-04-23 17:25:35+0200]     1704
[2022-04-23 17:25:35+0200] ../t/re/regex_sets.t........................................FAILED
[2022-04-23 17:25:35+0200]     No plan found in TAP output
[2022-04-23 17:25:35+0200] ../t/re/reg_mesg.t..........................................FAILED
[2022-04-23 17:25:35+0200]     No plan found in TAP output
[2022-04-23 17:25:35+0200] Archived results...
[2022-04-23 17:25:35+0200] Unskip tests from '/pro/3gl/CPAN/smoke/p59.skip'
[2022-04-23 17:25:35+0200] Finished smoking 70f5c3e99f92075109e4262faf825fb00ea79bd3 v5.35.11-10-g70f5c3e blead
[2022-04-23 17:25:35+0200] Reading smokeresult from /pro/3gl/CPAN/perl-current/mktest.out
[2022-04-23 17:25:44+0200] Processing []
[2022-04-23 17:25:44+0200] Processing [-DDEBUGGING]
[2022-04-23 17:25:44+0200] Processing [-Duse64bitall]
[2022-04-23 17:25:44+0200] Processing [-DDEBUGGING -Duse64bitall]
[2022-04-23 17:25:44+0200] Processing [-Duseithreads]
[2022-04-23 17:25:44+0200] Processing [-DDEBUGGING -Duseithreads]
[2022-04-23 17:25:44+0200] Processing [-Duseithreads -Duse64bitall]
[2022-04-23 17:25:44+0200] Processing [-DDEBUGGING -Duseithreads -Duse64bitall]
[2022-04-23 17:25:44+0200] ==> Starting reporter
[2022-04-23 17:25:44+0200] Writing report to '/pro/3gl/CPAN/perl-current/mktest.rpt'
[2022-04-23 17:25:44+0200] Locally applied patches from '/pro/3gl/CPAN/perl-current/patchlevel.h'
[2022-04-23 17:25:44+0200] Patches: 'uncommitted-changes'
[2022-04-23 17:25:44+0200] Looking for cc messages: 'hpux'
-- 
Report generated by Test::Smoke::Gateway v0.12