Show report
Skipping synctree
[2022-04-23 07:59:11+0200] Reading build configurations from /pro/3gl/CPAN/smoke/p59.cfg
[2022-04-23 07:59:11+0200] Reading 'Policy.sh' from ../Policy.sh (v=1)
[2022-04-23 07:59:11+0200] Running test suite only with 'harness'.
[2022-04-23 07:59:11+0200] make distclean ...
[2022-04-23 07:59:11+0200] Smoking patch 70f5c3e99f92075109e4262faf825fb00ea79bd3 v5.35.11-10-g70f5c3e
[2022-04-23 07:59:11+0200] Smoking branch blead
[2022-04-23 07:59:12+0200] 
[2022-04-23 07:59:12+0200] Configuration: -Dusedevel
[2022-04-23 07:59:12+0200] ------------------------------------------------------------------------------
[2022-04-23 07:59:12+0200] make distclean ...
[2022-04-23 07:59:12+0200] 
[2022-04-23 07:59:12+0200] Copy Policy.sh ...
[2022-04-23 07:59:12+0200] 
[2022-04-23 07:59:12+0200] Configure ...
[2022-04-23 08:00:11+0200] 
[2022-04-23 08:00:11+0200] make ...
[2022-04-23 08:01:33+0200] Skip tests from '/pro/3gl/CPAN/smoke/p59.skip'
[2022-04-23 08:01:33+0200] 
[2022-04-23 08:01:33+0200]  Tests start here:
[2022-04-23 08:01:33+0200] TSTENV = stdio	
makefile:258: warning: ignoring prerequisites on suffix rule definition
makefile:254: warning: ignoring prerequisites on suffix rule definition
makefile:258: warning: ignoring prerequisites on suffix rule definition
makefile:258: warning: ignoring prerequisites on suffix rule definition
makefile:254: warning: ignoring prerequisites on suffix rule definition
makefile:258: warning: ignoring prerequisites on suffix rule definition
No saved state, selection will be empty

#   Failed test 'ZLIB_VERSION (1.2.12) matches Compress::Raw::Zlib::zlib_version'
#   at t/01version.t line 34.
#          got: '1.2.12'
#     expected: '1.2.11'
# 
# The version of zlib.h does not match the version of libz
# 
# You have zlib.h version 1.2.12
#      and libz   version 1.2.11
# 
# You probably have two versions of zlib installed on your system.
# Try removing the one you don't want to use and rebuild.
# Looks like you failed 1 test of 2.

#   Failed test 'ZLIB_VERSION matches Compress::Raw::Zlib::zlib_version'
#   at t/02zlib.t line 56.
#          got: '1.2.11'
#     expected: '1.2.12'

#   Failed test at t/02zlib.t line 495.
#          got: -3
#     expected: 1

#   Failed test at t/02zlib.t line 529.
#          got: -3
#     expected: 1
# Looks like you failed 3 tests of 349.

#   Failed test 'ZLIB_VERSION matches Compress::Raw::Zlib::zlib_version'
#   at t/18lvalue.t line 44.
#          got: '1.2.11'
#     expected: '1.2.12'
# Looks like you failed 1 test of 10.

#   Failed test 'ZLIB_VERSION matches Compress::Raw::Zlib::zlib_version'
#   at t/19nonpv.t line 40.
#          got: '1.2.11'
#     expected: '1.2.12'
# Looks like you failed 1 test of 38.

#   Failed test 'ZLIB_VERSION (1.2.12) matches Compress::Zlib::zlib_version'
#   at t/cz-01version.t line 34.
#          got: '1.2.12'
#     expected: '1.2.11'
# 
# The version of zlib.h does not match the version of libz
# 
# You have zlib.h version 1.2.12
# 	 and libz   version 1.2.11
# 
# You probably have two versions of zlib installed on your system.
# Try removing the one you don't want to use and rebuild.
# Looks like you failed 1 test of 2.

#   Failed test 'ZLIB_VERSION matches Compress::Zlib::zlib_version'
#   at t/cz-03zlib-v1.t line 55.
#          got: '1.2.11'
#     expected: '1.2.12'

#   Failed test at t/cz-03zlib-v1.t line 706.
#          got: -3
#     expected: 1
# Looks like you failed 2 tests of 471.

#   Failed test 'ZLIB_VERSION matches Compress::Zlib::zlib_version'
#   at t/cz-06gzsetp.t line 48.
#          got: '1.2.11'
#     expected: '1.2.12'
# Looks like you failed 1 test of 51.

#   Failed test 'ZLIB_VERSION matches Compress::Zlib::zlib_version'
#   at t/cz-08encoding.t line 43.
#          got: '1.2.11'
#     expected: '1.2.12'
# Looks like you failed 1 test of 29.

#   Failed test 'ZLIB_VERSION matches Compress::Zlib::zlib_version'
#   at t/cz-14gzopen.t line 34.
#          got: '1.2.11'
#     expected: '1.2.12'
# Looks like you failed 1 test of 264.
Subroutine Time::HiRes::constant redefined at (eval 37) line 1.
Subroutine Time::HiRes::usleep redefined at (eval 37) line 1.
Subroutine Time::HiRes::nanosleep redefined at (eval 37) line 1.
Subroutine Time::HiRes::sleep redefined at (eval 37) line 1.
Subroutine Time::HiRes::ualarm redefined at (eval 37) line 1.
Subroutine Time::HiRes::alarm redefined at (eval 37) line 1.
Subroutine Time::HiRes::gettimeofday redefined at (eval 37) line 1.
Subroutine Time::HiRes::time redefined at (eval 37) line 1.
Subroutine Time::HiRes::setitimer redefined at (eval 37) line 1.
Subroutine Time::HiRes::getitimer redefined at (eval 37) line 1.
Subroutine Time::HiRes::utime redefined at (eval 37) line 1.
Subroutine Time::HiRes::clock_gettime redefined at (eval 37) line 1.
Subroutine Time::HiRes::clock_getres redefined at (eval 37) line 1.
Subroutine Time::HiRes::clock_nanosleep redefined at (eval 37) line 1.
Subroutine Time::HiRes::clock redefined at (eval 37) line 1.
Subroutine Time::HiRes::lstat redefined at (eval 37) line 1.
Subroutine Time::HiRes::stat redefined at (eval 37) line 1.
No such file or directory
No such file or directory
No such file or directory
No such file or directory
No such file or directory
No such file or directory
No such file or directory
make: *** [makefile:856: test_harness] Error 12

error while running harness target 'test_harness': 2 at /data/pro/3gl/CPAN/smoke/lib/Test/Smoke.pm line 194.
[2022-04-23 08:05:56+0200] 
[2022-04-23 08:05:56+0200] ../cpan/Compress-Raw-Zlib/t/01version.t.....................FAILED
[2022-04-23 08:05:56+0200]     2
[2022-04-23 08:05:56+0200] ../cpan/Compress-Raw-Zlib/t/01version.t.....................FAILED
[2022-04-23 08:05:56+0200]     Non-zero exit status: 1
[2022-04-23 08:05:56+0200] ../cpan/Compress-Raw-Zlib/t/02zlib.t........................FAILED
[2022-04-23 08:05:56+0200]     2, 126, 134
[2022-04-23 08:05:56+0200] ../cpan/Compress-Raw-Zlib/t/02zlib.t........................FAILED
[2022-04-23 08:05:56+0200]     Non-zero exit status: 3
[2022-04-23 08:05:56+0200] ../cpan/Compress-Raw-Zlib/t/18lvalue.t......................FAILED
[2022-04-23 08:05:56+0200]     2
[2022-04-23 08:05:56+0200] ../cpan/Compress-Raw-Zlib/t/18lvalue.t......................FAILED
[2022-04-23 08:05:56+0200]     Non-zero exit status: 1
[2022-04-23 08:05:56+0200] ../cpan/Compress-Raw-Zlib/t/19nonpv.t.......................FAILED
[2022-04-23 08:05:56+0200]     2
[2022-04-23 08:05:56+0200] ../cpan/Compress-Raw-Zlib/t/19nonpv.t.......................FAILED
[2022-04-23 08:05:56+0200]     Non-zero exit status: 1
[2022-04-23 08:05:56+0200] ../cpan/IO-Compress/t/cz-01version.t........................FAILED
[2022-04-23 08:05:56+0200]     2
[2022-04-23 08:05:56+0200] ../cpan/IO-Compress/t/cz-01version.t........................FAILED
[2022-04-23 08:05:56+0200]     Non-zero exit status: 1
[2022-04-23 08:05:56+0200] ../cpan/IO-Compress/t/cz-03zlib-v1.t........................FAILED
[2022-04-23 08:05:56+0200]     4, 196
[2022-04-23 08:05:56+0200] ../cpan/IO-Compress/t/cz-03zlib-v1.t........................FAILED
[2022-04-23 08:05:56+0200]     Non-zero exit status: 2
[2022-04-23 08:05:56+0200] ../cpan/IO-Compress/t/cz-06gzsetp.t.........................FAILED
[2022-04-23 08:05:56+0200]     1
[2022-04-23 08:05:56+0200] ../cpan/IO-Compress/t/cz-06gzsetp.t.........................FAILED
[2022-04-23 08:05:56+0200]     Non-zero exit status: 1
[2022-04-23 08:05:56+0200] ../cpan/IO-Compress/t/cz-08encoding.t.......................FAILED
[2022-04-23 08:05:56+0200]     2
[2022-04-23 08:05:56+0200] ../cpan/IO-Compress/t/cz-08encoding.t.......................FAILED
[2022-04-23 08:05:56+0200]     Non-zero exit status: 1
[2022-04-23 08:05:56+0200] ../cpan/IO-Compress/t/cz-14gzopen.t.........................FAILED
[2022-04-23 08:05:56+0200]     3
[2022-04-23 08:05:56+0200] ../cpan/IO-Compress/t/cz-14gzopen.t.........................FAILED
[2022-04-23 08:05:56+0200]     Non-zero exit status: 1
[2022-04-23 08:05:56+0200] Archived results...
[2022-04-23 08:05:56+0200] TSTENV = perlio	
makefile:258: warning: ignoring prerequisites on suffix rule definition
makefile:254: warning: ignoring prerequisites on suffix rule definition
makefile:258: warning: ignoring prerequisites on suffix rule definition
makefile:258: warning: ignoring prerequisites on suffix rule definition
makefile:254: warning: ignoring prerequisites on suffix rule definition
makefile:258: warning: ignoring prerequisites on suffix rule definition

#   Failed test 'ZLIB_VERSION (1.2.12) matches Compress::Zlib::zlib_version'
#   at t/cz-01version.t line 34.
#          got: '1.2.12'
#     expected: '1.2.11'
# 
# The version of zlib.h does not match the version of libz
# 
# You have zlib.h version 1.2.12
# 	 and libz   version 1.2.11
# 
# You probably have two versions of zlib installed on your system.
# Try removing the one you don't want to use and rebuild.
# Looks like you failed 1 test of 2.

#   Failed test 'ZLIB_VERSION matches Compress::Zlib::zlib_version'
#   at t/cz-03zlib-v1.t line 55.
#          got: '1.2.11'
#     expected: '1.2.12'

#   Failed test at t/cz-03zlib-v1.t line 706.
#          got: -3
#     expected: 1
# Looks like you failed 2 tests of 471.

#   Failed test 'ZLIB_VERSION matches Compress::Zlib::zlib_version'
#   at t/cz-06gzsetp.t line 48.
#          got: '1.2.11'
#     expected: '1.2.12'
# Looks like you failed 1 test of 51.

#   Failed test 'ZLIB_VERSION matches Compress::Zlib::zlib_version'
#   at t/cz-08encoding.t line 43.
#          got: '1.2.11'
#     expected: '1.2.12'
# Looks like you failed 1 test of 29.

#   Failed test 'ZLIB_VERSION matches Compress::Zlib::zlib_version'
#   at t/cz-14gzopen.t line 34.
#          got: '1.2.11'
#     expected: '1.2.12'
# Looks like you failed 1 test of 264.

#   Failed test 'ZLIB_VERSION (1.2.12) matches Compress::Raw::Zlib::zlib_version'
#   at t/01version.t line 34.
#          got: '1.2.12'
#     expected: '1.2.11'
# 
# The version of zlib.h does not match the version of libz
# 
# You have zlib.h version 1.2.12
#      and libz   version 1.2.11
# 
# You probably have two versions of zlib installed on your system.
# Try removing the one you don't want to use and rebuild.
# Looks like you failed 1 test of 2.

#   Failed test 'ZLIB_VERSION matches Compress::Raw::Zlib::zlib_version'
#   at t/02zlib.t line 56.
#          got: '1.2.11'
#     expected: '1.2.12'

#   Failed test at t/02zlib.t line 495.
#          got: -3
#     expected: 1

#   Failed test at t/02zlib.t line 529.
#          got: -3
#     expected: 1
# Looks like you failed 3 tests of 349.

#   Failed test 'ZLIB_VERSION matches Compress::Raw::Zlib::zlib_version'
#   at t/18lvalue.t line 44.
#          got: '1.2.11'
#     expected: '1.2.12'
# Looks like you failed 1 test of 10.

#   Failed test 'ZLIB_VERSION matches Compress::Raw::Zlib::zlib_version'
#   at t/19nonpv.t line 40.
#          got: '1.2.11'
#     expected: '1.2.12'
# Looks like you failed 1 test of 38.
Subroutine Time::HiRes::constant redefined at (eval 37) line 1.
Subroutine Time::HiRes::usleep redefined at (eval 37) line 1.
Subroutine Time::HiRes::nanosleep redefined at (eval 37) line 1.
Subroutine Time::HiRes::sleep redefined at (eval 37) line 1.
Subroutine Time::HiRes::ualarm redefined at (eval 37) line 1.
Subroutine Time::HiRes::alarm redefined at (eval 37) line 1.
Subroutine Time::HiRes::gettimeofday redefined at (eval 37) line 1.
Subroutine Time::HiRes::time redefined at (eval 37) line 1.
Subroutine Time::HiRes::setitimer redefined at (eval 37) line 1.
Subroutine Time::HiRes::getitimer redefined at (eval 37) line 1.
Subroutine Time::HiRes::utime redefined at (eval 37) line 1.
Subroutine Time::HiRes::clock_gettime redefined at (eval 37) line 1.
Subroutine Time::HiRes::clock_getres redefined at (eval 37) line 1.
Subroutine Time::HiRes::clock_nanosleep redefined at (eval 37) line 1.
Subroutine Time::HiRes::clock redefined at (eval 37) line 1.
Subroutine Time::HiRes::lstat redefined at (eval 37) line 1.
Subroutine Time::HiRes::stat redefined at (eval 37) line 1.
make: *** [makefile:856: test_harness] Error 12

error while running harness target 'test_harness': 2 at /data/pro/3gl/CPAN/smoke/lib/Test/Smoke.pm line 194.
[2022-04-23 08:10:03+0200] 
[2022-04-23 08:10:03+0200] ../cpan/IO-Compress/t/cz-01version.t........................FAILED
[2022-04-23 08:10:03+0200]     2
[2022-04-23 08:10:03+0200] ../cpan/IO-Compress/t/cz-01version.t........................FAILED
[2022-04-23 08:10:03+0200]     Non-zero exit status: 1
[2022-04-23 08:10:03+0200] ../cpan/IO-Compress/t/cz-03zlib-v1.t........................FAILED
[2022-04-23 08:10:03+0200]     4, 196
[2022-04-23 08:10:03+0200] ../cpan/IO-Compress/t/cz-03zlib-v1.t........................FAILED
[2022-04-23 08:10:03+0200]     Non-zero exit status: 2
[2022-04-23 08:10:03+0200] ../cpan/IO-Compress/t/cz-06gzsetp.t.........................FAILED
[2022-04-23 08:10:03+0200]     1
[2022-04-23 08:10:03+0200] ../cpan/IO-Compress/t/cz-06gzsetp.t.........................FAILED
[2022-04-23 08:10:03+0200]     Non-zero exit status: 1
[2022-04-23 08:10:03+0200] ../cpan/IO-Compress/t/cz-08encoding.t.......................FAILED
[2022-04-23 08:10:03+0200]     2
[2022-04-23 08:10:03+0200] ../cpan/IO-Compress/t/cz-08encoding.t.......................FAILED
[2022-04-23 08:10:03+0200]     Non-zero exit status: 1
[2022-04-23 08:10:03+0200] ../cpan/IO-Compress/t/cz-14gzopen.t.........................FAILED
[2022-04-23 08:10:03+0200]     3
[2022-04-23 08:10:03+0200] ../cpan/IO-Compress/t/cz-14gzopen.t.........................FAILED
[2022-04-23 08:10:03+0200]     Non-zero exit status: 1
[2022-04-23 08:10:03+0200] ../cpan/Compress-Raw-Zlib/t/01version.t.....................FAILED
[2022-04-23 08:10:03+0200]     2
[2022-04-23 08:10:03+0200] ../cpan/Compress-Raw-Zlib/t/01version.t.....................FAILED
[2022-04-23 08:10:03+0200]     Non-zero exit status: 1
[2022-04-23 08:10:03+0200] ../cpan/Compress-Raw-Zlib/t/02zlib.t........................FAILED
[2022-04-23 08:10:03+0200]     2, 126, 134
[2022-04-23 08:10:03+0200] ../cpan/Compress-Raw-Zlib/t/02zlib.t........................FAILED
[2022-04-23 08:10:03+0200]     Non-zero exit status: 3
[2022-04-23 08:10:03+0200] ../cpan/Compress-Raw-Zlib/t/18lvalue.t......................FAILED
[2022-04-23 08:10:03+0200]     2
[2022-04-23 08:10:03+0200] ../cpan/Compress-Raw-Zlib/t/18lvalue.t......................FAILED
[2022-04-23 08:10:03+0200]     Non-zero exit status: 1
[2022-04-23 08:10:03+0200] ../cpan/Compress-Raw-Zlib/t/19nonpv.t.......................FAILED
[2022-04-23 08:10:03+0200]     2
[2022-04-23 08:10:03+0200] ../cpan/Compress-Raw-Zlib/t/19nonpv.t.......................FAILED
[2022-04-23 08:10:03+0200]     Non-zero exit status: 1
[2022-04-23 08:10:03+0200] Archived results...
[2022-04-23 08:10:03+0200] TSTENV = locale:en_US.utf8	
makefile:258: warning: ignoring prerequisites on suffix rule definition
makefile:254: warning: ignoring prerequisites on suffix rule definition
makefile:258: warning: ignoring prerequisites on suffix rule definition
makefile:258: warning: ignoring prerequisites on suffix rule definition
makefile:254: warning: ignoring prerequisites on suffix rule definition
makefile:258: warning: ignoring prerequisites on suffix rule definition

#   Failed test 'ZLIB_VERSION (1.2.12) matches Compress::Zlib::zlib_version'
#   at t/cz-01version.t line 34.
#          got: '1.2.12'
#     expected: '1.2.11'
# 
# The version of zlib.h does not match the version of libz
# 
# You have zlib.h version 1.2.12
# 	 and libz   version 1.2.11
# 
# You probably have two versions of zlib installed on your system.
# Try removing the one you don't want to use and rebuild.
# Looks like you failed 1 test of 2.

#   Failed test 'ZLIB_VERSION matches Compress::Zlib::zlib_version'
#   at t/cz-03zlib-v1.t line 55.
#          got: '1.2.11'
#     expected: '1.2.12'

#   Failed test at t/cz-03zlib-v1.t line 706.
#          got: -3
#     expected: 1
# Looks like you failed 2 tests of 471.

#   Failed test 'ZLIB_VERSION matches Compress::Zlib::zlib_version'
#   at t/cz-06gzsetp.t line 48.
#          got: '1.2.11'
#     expected: '1.2.12'
# Looks like you failed 1 test of 51.

#   Failed test 'ZLIB_VERSION matches Compress::Zlib::zlib_version'
#   at t/cz-08encoding.t line 43.
#          got: '1.2.11'
#     expected: '1.2.12'
# Looks like you failed 1 test of 29.

#   Failed test 'ZLIB_VERSION matches Compress::Zlib::zlib_version'
#   at t/cz-14gzopen.t line 34.
#          got: '1.2.11'
#     expected: '1.2.12'
# Looks like you failed 1 test of 264.

#   Failed test 'ZLIB_VERSION (1.2.12) matches Compress::Raw::Zlib::zlib_version'
#   at t/01version.t line 34.
#          got: '1.2.12'
#     expected: '1.2.11'
# 
# The version of zlib.h does not match the version of libz
# 
# You have zlib.h version 1.2.12
#      and libz   version 1.2.11
# 
# You probably have two versions of zlib installed on your system.
# Try removing the one you don't want to use and rebuild.
# Looks like you failed 1 test of 2.

#   Failed test 'ZLIB_VERSION matches Compress::Raw::Zlib::zlib_version'
#   at t/02zlib.t line 56.
#          got: '1.2.11'
#     expected: '1.2.12'

#   Failed test at t/02zlib.t line 495.
#          got: -3
#     expected: 1

#   Failed test at t/02zlib.t line 529.
#          got: -3
#     expected: 1
# Looks like you failed 3 tests of 349.

#   Failed test 'ZLIB_VERSION matches Compress::Raw::Zlib::zlib_version'
#   at t/18lvalue.t line 44.
#          got: '1.2.11'
#     expected: '1.2.12'
# Looks like you failed 1 test of 10.

#   Failed test 'ZLIB_VERSION matches Compress::Raw::Zlib::zlib_version'
#   at t/19nonpv.t line 40.
#          got: '1.2.11'
#     expected: '1.2.12'
# Looks like you failed 1 test of 38.
Unable to flush stdout: Broken pipe
Subroutine Time::HiRes::constant redefined at (eval 37) line 1.
Subroutine Time::HiRes::usleep redefined at (eval 37) line 1.
Subroutine Time::HiRes::nanosleep redefined at (eval 37) line 1.
Subroutine Time::HiRes::sleep redefined at (eval 37) line 1.
Subroutine Time::HiRes::ualarm redefined at (eval 37) line 1.
Subroutine Time::HiRes::alarm redefined at (eval 37) line 1.
Subroutine Time::HiRes::gettimeofday redefined at (eval 37) line 1.
Subroutine Time::HiRes::time redefined at (eval 37) line 1.
Subroutine Time::HiRes::setitimer redefined at (eval 37) line 1.
Subroutine Time::HiRes::getitimer redefined at (eval 37) line 1.
Subroutine Time::HiRes::utime redefined at (eval 37) line 1.
Subroutine Time::HiRes::clock_gettime redefined at (eval 37) line 1.
Subroutine Time::HiRes::clock_getres redefined at (eval 37) line 1.
Subroutine Time::HiRes::clock_nanosleep redefined at (eval 37) line 1.
Subroutine Time::HiRes::clock redefined at (eval 37) line 1.
Subroutine Time::HiRes::lstat redefined at (eval 37) line 1.
Subroutine Time::HiRes::stat redefined at (eval 37) line 1.
make: *** [makefile:856: test_harness] Error 12

error while running harness target 'test_harness': 2 at /data/pro/3gl/CPAN/smoke/lib/Test/Smoke.pm line 194.
[2022-04-23 08:14:05+0200] 
[2022-04-23 08:14:05+0200] ../cpan/IO-Compress/t/cz-01version.t........................FAILED
[2022-04-23 08:14:05+0200]     2
[2022-04-23 08:14:05+0200] ../cpan/IO-Compress/t/cz-01version.t........................FAILED
[2022-04-23 08:14:05+0200]     Non-zero exit status: 1
[2022-04-23 08:14:05+0200] ../cpan/IO-Compress/t/cz-03zlib-v1.t........................FAILED
[2022-04-23 08:14:05+0200]     4, 196
[2022-04-23 08:14:05+0200] ../cpan/IO-Compress/t/cz-03zlib-v1.t........................FAILED
[2022-04-23 08:14:05+0200]     Non-zero exit status: 2
[2022-04-23 08:14:05+0200] ../cpan/IO-Compress/t/cz-06gzsetp.t.........................FAILED
[2022-04-23 08:14:05+0200]     1
[2022-04-23 08:14:05+0200] ../cpan/IO-Compress/t/cz-06gzsetp.t.........................FAILED
[2022-04-23 08:14:05+0200]     Non-zero exit status: 1
[2022-04-23 08:14:05+0200] ../cpan/IO-Compress/t/cz-08encoding.t.......................FAILED
[2022-04-23 08:14:05+0200]     2
[2022-04-23 08:14:05+0200] ../cpan/IO-Compress/t/cz-08encoding.t.......................FAILED
[2022-04-23 08:14:05+0200]     Non-zero exit status: 1
[2022-04-23 08:14:05+0200] ../cpan/IO-Compress/t/cz-14gzopen.t.........................FAILED
[2022-04-23 08:14:05+0200]     3
[2022-04-23 08:14:05+0200] ../cpan/IO-Compress/t/cz-14gzopen.t.........................FAILED
[2022-04-23 08:14:05+0200]     Non-zero exit status: 1
[2022-04-23 08:14:05+0200] ../cpan/Compress-Raw-Zlib/t/01version.t.....................FAILED
[2022-04-23 08:14:05+0200]     2
[2022-04-23 08:14:05+0200] ../cpan/Compress-Raw-Zlib/t/01version.t.....................FAILED
[2022-04-23 08:14:05+0200]     Non-zero exit status: 1
[2022-04-23 08:14:05+0200] ../cpan/Compress-Raw-Zlib/t/02zlib.t........................FAILED
[2022-04-23 08:14:05+0200]     2, 126, 134
[2022-04-23 08:14:05+0200] ../cpan/Compress-Raw-Zlib/t/02zlib.t........................FAILED
[2022-04-23 08:14:05+0200]     Non-zero exit status: 3
[2022-04-23 08:14:05+0200] ../cpan/Compress-Raw-Zlib/t/18lvalue.t......................FAILED
[2022-04-23 08:14:05+0200]     2
[2022-04-23 08:14:05+0200] ../cpan/Compress-Raw-Zlib/t/18lvalue.t......................FAILED
[2022-04-23 08:14:05+0200]     Non-zero exit status: 1
[2022-04-23 08:14:05+0200] ../cpan/Compress-Raw-Zlib/t/19nonpv.t.......................FAILED
[2022-04-23 08:14:05+0200]     2
[2022-04-23 08:14:05+0200] ../cpan/Compress-Raw-Zlib/t/19nonpv.t.......................FAILED
[2022-04-23 08:14:05+0200]     Non-zero exit status: 1
[2022-04-23 08:14:05+0200] Archived results...
[2022-04-23 08:14:05+0200] Unskip tests from '/pro/3gl/CPAN/smoke/p59.skip'
[2022-04-23 08:14:05+0200] 
[2022-04-23 08:14:05+0200] Configuration: -Dusedevel -DDEBUGGING
[2022-04-23 08:14:05+0200] ------------------------------------------------------------------------------
[2022-04-23 08:14:05+0200] make distclean ...
[2022-04-23 08:14:17+0200] 
[2022-04-23 08:14:17+0200] Copy Policy.sh ...
[2022-04-23 08:14:17+0200] 
[2022-04-23 08:14:17+0200] Configure ...
[2022-04-23 08:15:16+0200] 
[2022-04-23 08:15:16+0200] make ...
[2022-04-23 08:17:11+0200] Skip tests from '/pro/3gl/CPAN/smoke/p59.skip'
[2022-04-23 08:17:11+0200] 
[2022-04-23 08:17:11+0200]  Tests start here:
[2022-04-23 08:17:11+0200] TSTENV = stdio	
makefile:258: warning: ignoring prerequisites on suffix rule definition
makefile:254: warning: ignoring prerequisites on suffix rule definition
makefile:258: warning: ignoring prerequisites on suffix rule definition
makefile:258: warning: ignoring prerequisites on suffix rule definition
makefile:254: warning: ignoring prerequisites on suffix rule definition
makefile:258: warning: ignoring prerequisites on suffix rule definition
No saved state, selection will be empty

#   Failed test 'ZLIB_VERSION (1.2.12) matches Compress::Raw::Zlib::zlib_version'
#   at t/01version.t line 34.
#          got: '1.2.12'
#     expected: '1.2.11'
# 
# The version of zlib.h does not match the version of libz
# 
# You have zlib.h version 1.2.12
#      and libz   version 1.2.11
# 
# You probably have two versions of zlib installed on your system.
# Try removing the one you don't want to use and rebuild.
# Looks like you failed 1 test of 2.

#   Failed test 'ZLIB_VERSION matches Compress::Raw::Zlib::zlib_version'
#   at t/02zlib.t line 56.
#          got: '1.2.11'
#     expected: '1.2.12'

#   Failed test at t/02zlib.t line 495.
#          got: -3
#     expected: 1

#   Failed test at t/02zlib.t line 529.
#          got: -3
#     expected: 1
# Looks like you failed 3 tests of 349.

#   Failed test 'ZLIB_VERSION matches Compress::Raw::Zlib::zlib_version'
#   at t/18lvalue.t line 44.
#          got: '1.2.11'
#     expected: '1.2.12'
# Looks like you failed 1 test of 10.

#   Failed test 'ZLIB_VERSION matches Compress::Raw::Zlib::zlib_version'
#   at t/19nonpv.t line 40.
#          got: '1.2.11'
#     expected: '1.2.12'
# Looks like you failed 1 test of 38.

#   Failed test 'ZLIB_VERSION (1.2.12) matches Compress::Zlib::zlib_version'
#   at t/cz-01version.t line 34.
#          got: '1.2.12'
#     expected: '1.2.11'
# 
# The version of zlib.h does not match the version of libz
# 
# You have zlib.h version 1.2.12
# 	 and libz   version 1.2.11
# 
# You probably have two versions of zlib installed on your system.
# Try removing the one you don't want to use and rebuild.
# Looks like you failed 1 test of 2.

#   Failed test 'ZLIB_VERSION matches Compress::Zlib::zlib_version'
#   at t/cz-03zlib-v1.t line 55.
#          got: '1.2.11'
#     expected: '1.2.12'

#   Failed test at t/cz-03zlib-v1.t line 706.
#          got: -3
#     expected: 1
# Looks like you failed 2 tests of 471.

#   Failed test 'ZLIB_VERSION matches Compress::Zlib::zlib_version'
#   at t/cz-06gzsetp.t line 48.
#          got: '1.2.11'
#     expected: '1.2.12'
# Looks like you failed 1 test of 51.

#   Failed test 'ZLIB_VERSION matches Compress::Zlib::zlib_version'
#   at t/cz-08encoding.t line 43.
#          got: '1.2.11'
#     expected: '1.2.12'
# Looks like you failed 1 test of 29.

#   Failed test 'ZLIB_VERSION matches Compress::Zlib::zlib_version'
#   at t/cz-14gzopen.t line 34.
#          got: '1.2.11'
#     expected: '1.2.12'
# Looks like you failed 1 test of 264.
Subroutine Time::HiRes::constant redefined at (eval 37) line 1.
Subroutine Time::HiRes::usleep redefined at (eval 37) line 1.
Subroutine Time::HiRes::nanosleep redefined at (eval 37) line 1.
Subroutine Time::HiRes::sleep redefined at (eval 37) line 1.
Subroutine Time::HiRes::ualarm redefined at (eval 37) line 1.
Subroutine Time::HiRes::alarm redefined at (eval 37) line 1.
Subroutine Time::HiRes::gettimeofday redefined at (eval 37) line 1.
Subroutine Time::HiRes::time redefined at (eval 37) line 1.
Subroutine Time::HiRes::setitimer redefined at (eval 37) line 1.
Subroutine Time::HiRes::getitimer redefined at (eval 37) line 1.
Subroutine Time::HiRes::utime redefined at (eval 37) line 1.
Subroutine Time::HiRes::clock_gettime redefined at (eval 37) line 1.
Subroutine Time::HiRes::clock_getres redefined at (eval 37) line 1.
Subroutine Time::HiRes::clock_nanosleep redefined at (eval 37) line 1.
Subroutine Time::HiRes::clock redefined at (eval 37) line 1.
Subroutine Time::HiRes::lstat redefined at (eval 37) line 1.
Subroutine Time::HiRes::stat redefined at (eval 37) line 1.
No such file or directory
No such file or directory
No such file or directory
No such file or directory
No such file or directory
No such file or directory
No such file or directory
make: *** [makefile:856: test_harness] Error 12

error while running harness target 'test_harness': 2 at /data/pro/3gl/CPAN/smoke/lib/Test/Smoke.pm line 194.
[2022-04-23 08:22:10+0200] 
[2022-04-23 08:22:10+0200] ../cpan/Compress-Raw-Zlib/t/01version.t.....................FAILED
[2022-04-23 08:22:10+0200]     2
[2022-04-23 08:22:10+0200] ../cpan/Compress-Raw-Zlib/t/01version.t.....................FAILED
[2022-04-23 08:22:10+0200]     Non-zero exit status: 1
[2022-04-23 08:22:10+0200] ../cpan/Compress-Raw-Zlib/t/02zlib.t........................FAILED
[2022-04-23 08:22:10+0200]     2, 126, 134
[2022-04-23 08:22:10+0200] ../cpan/Compress-Raw-Zlib/t/02zlib.t........................FAILED
[2022-04-23 08:22:10+0200]     Non-zero exit status: 3
[2022-04-23 08:22:10+0200] ../cpan/Compress-Raw-Zlib/t/18lvalue.t......................FAILED
[2022-04-23 08:22:10+0200]     2
[2022-04-23 08:22:10+0200] ../cpan/Compress-Raw-Zlib/t/18lvalue.t......................FAILED
[2022-04-23 08:22:10+0200]     Non-zero exit status: 1
[2022-04-23 08:22:10+0200] ../cpan/Compress-Raw-Zlib/t/19nonpv.t.......................FAILED
[2022-04-23 08:22:10+0200]     2
[2022-04-23 08:22:10+0200] ../cpan/Compress-Raw-Zlib/t/19nonpv.t.......................FAILED
[2022-04-23 08:22:10+0200]     Non-zero exit status: 1
[2022-04-23 08:22:10+0200] ../cpan/IO-Compress/t/cz-01version.t........................FAILED
[2022-04-23 08:22:10+0200]     2
[2022-04-23 08:22:10+0200] ../cpan/IO-Compress/t/cz-01version.t........................FAILED
[2022-04-23 08:22:10+0200]     Non-zero exit status: 1
[2022-04-23 08:22:10+0200] ../cpan/IO-Compress/t/cz-03zlib-v1.t........................FAILED
[2022-04-23 08:22:10+0200]     4, 196
[2022-04-23 08:22:10+0200] ../cpan/IO-Compress/t/cz-03zlib-v1.t........................FAILED
[2022-04-23 08:22:10+0200]     Non-zero exit status: 2
[2022-04-23 08:22:10+0200] ../cpan/IO-Compress/t/cz-06gzsetp.t.........................FAILED
[2022-04-23 08:22:10+0200]     1
[2022-04-23 08:22:10+0200] ../cpan/IO-Compress/t/cz-06gzsetp.t.........................FAILED
[2022-04-23 08:22:10+0200]     Non-zero exit status: 1
[2022-04-23 08:22:10+0200] ../cpan/IO-Compress/t/cz-08encoding.t.......................FAILED
[2022-04-23 08:22:10+0200]     2
[2022-04-23 08:22:10+0200] ../cpan/IO-Compress/t/cz-08encoding.t.......................FAILED
[2022-04-23 08:22:10+0200]     Non-zero exit status: 1
[2022-04-23 08:22:10+0200] ../cpan/IO-Compress/t/cz-14gzopen.t.........................FAILED
[2022-04-23 08:22:10+0200]     3
[2022-04-23 08:22:10+0200] ../cpan/IO-Compress/t/cz-14gzopen.t.........................FAILED
[2022-04-23 08:22:10+0200]     Non-zero exit status: 1
[2022-04-23 08:22:10+0200] Archived results...
[2022-04-23 08:22:10+0200] TSTENV = perlio	
makefile:258: warning: ignoring prerequisites on suffix rule definition
makefile:254: warning: ignoring prerequisites on suffix rule definition
makefile:258: warning: ignoring prerequisites on suffix rule definition
makefile:258: warning: ignoring prerequisites on suffix rule definition
makefile:254: warning: ignoring prerequisites on suffix rule definition
makefile:258: warning: ignoring prerequisites on suffix rule definition

#   Failed test 'ZLIB_VERSION (1.2.12) matches Compress::Zlib::zlib_version'
#   at t/cz-01version.t line 34.
#          got: '1.2.12'
#     expected: '1.2.11'
# 
# The version of zlib.h does not match the version of libz
# 
# You have zlib.h version 1.2.12
# 	 and libz   version 1.2.11
# 
# You probably have two versions of zlib installed on your system.
# Try removing the one you don't want to use and rebuild.
# Looks like you failed 1 test of 2.

#   Failed test 'ZLIB_VERSION matches Compress::Zlib::zlib_version'
#   at t/cz-03zlib-v1.t line 55.
#          got: '1.2.11'
#     expected: '1.2.12'

#   Failed test at t/cz-03zlib-v1.t line 706.
#          got: -3
#     expected: 1
# Looks like you failed 2 tests of 471.

#   Failed test 'ZLIB_VERSION matches Compress::Zlib::zlib_version'
#   at t/cz-06gzsetp.t line 48.
#          got: '1.2.11'
#     expected: '1.2.12'
# Looks like you failed 1 test of 51.

#   Failed test 'ZLIB_VERSION matches Compress::Zlib::zlib_version'
#   at t/cz-08encoding.t line 43.
#          got: '1.2.11'
#     expected: '1.2.12'
# Looks like you failed 1 test of 29.

#   Failed test 'ZLIB_VERSION matches Compress::Zlib::zlib_version'
#   at t/cz-14gzopen.t line 34.
#          got: '1.2.11'
#     expected: '1.2.12'
# Looks like you failed 1 test of 264.

#   Failed test 'ZLIB_VERSION (1.2.12) matches Compress::Raw::Zlib::zlib_version'
#   at t/01version.t line 34.
#          got: '1.2.12'
#     expected: '1.2.11'
# 
# The version of zlib.h does not match the version of libz
# 
# You have zlib.h version 1.2.12
#      and libz   version 1.2.11
# 
# You probably have two versions of zlib installed on your system.
# Try removing the one you don't want to use and rebuild.
# Looks like you failed 1 test of 2.

#   Failed test 'ZLIB_VERSION matches Compress::Raw::Zlib::zlib_version'
#   at t/02zlib.t line 56.
#          got: '1.2.11'
#     expected: '1.2.12'

#   Failed test at t/02zlib.t line 495.
#          got: -3
#     expected: 1

#   Failed test at t/02zlib.t line 529.
#          got: -3
#     expected: 1
# Looks like you failed 3 tests of 349.

#   Failed test 'ZLIB_VERSION matches Compress::Raw::Zlib::zlib_version'
#   at t/18lvalue.t line 44.
#          got: '1.2.11'
#     expected: '1.2.12'
# Looks like you failed 1 test of 10.

#   Failed test 'ZLIB_VERSION matches Compress::Raw::Zlib::zlib_version'
#   at t/19nonpv.t line 40.
#          got: '1.2.11'
#     expected: '1.2.12'
# Looks like you failed 1 test of 38.
Unable to flush stdout: Broken pipe
Subroutine Time::HiRes::constant redefined at (eval 37) line 1.
Subroutine Time::HiRes::usleep redefined at (eval 37) line 1.
Subroutine Time::HiRes::nanosleep redefined at (eval 37) line 1.
Subroutine Time::HiRes::sleep redefined at (eval 37) line 1.
Subroutine Time::HiRes::ualarm redefined at (eval 37) line 1.
Subroutine Time::HiRes::alarm redefined at (eval 37) line 1.
Subroutine Time::HiRes::gettimeofday redefined at (eval 37) line 1.
Subroutine Time::HiRes::time redefined at (eval 37) line 1.
Subroutine Time::HiRes::setitimer redefined at (eval 37) line 1.
Subroutine Time::HiRes::getitimer redefined at (eval 37) line 1.
Subroutine Time::HiRes::utime redefined at (eval 37) line 1.
Subroutine Time::HiRes::clock_gettime redefined at (eval 37) line 1.
Subroutine Time::HiRes::clock_getres redefined at (eval 37) line 1.
Subroutine Time::HiRes::clock_nanosleep redefined at (eval 37) line 1.
Subroutine Time::HiRes::clock redefined at (eval 37) line 1.
Subroutine Time::HiRes::lstat redefined at (eval 37) line 1.
Subroutine Time::HiRes::stat redefined at (eval 37) line 1.
make: *** [makefile:856: test_harness] Error 12

error while running harness target 'test_harness': 2 at /data/pro/3gl/CPAN/smoke/lib/Test/Smoke.pm line 194.
[2022-04-23 08:26:59+0200] 
[2022-04-23 08:26:59+0200] ../cpan/IO-Compress/t/cz-01version.t........................FAILED
[2022-04-23 08:26:59+0200]     2
[2022-04-23 08:26:59+0200] ../cpan/IO-Compress/t/cz-01version.t........................FAILED
[2022-04-23 08:26:59+0200]     Non-zero exit status: 1
[2022-04-23 08:26:59+0200] ../cpan/IO-Compress/t/cz-03zlib-v1.t........................FAILED
[2022-04-23 08:26:59+0200]     4, 196
[2022-04-23 08:26:59+0200] ../cpan/IO-Compress/t/cz-03zlib-v1.t........................FAILED
[2022-04-23 08:26:59+0200]     Non-zero exit status: 2
[2022-04-23 08:26:59+0200] ../cpan/IO-Compress/t/cz-06gzsetp.t.........................FAILED
[2022-04-23 08:26:59+0200]     1
[2022-04-23 08:26:59+0200] ../cpan/IO-Compress/t/cz-06gzsetp.t.........................FAILED
[2022-04-23 08:26:59+0200]     Non-zero exit status: 1
[2022-04-23 08:26:59+0200] ../cpan/IO-Compress/t/cz-08encoding.t.......................FAILED
[2022-04-23 08:26:59+0200]     2
[2022-04-23 08:26:59+0200] ../cpan/IO-Compress/t/cz-08encoding.t.......................FAILED
[2022-04-23 08:26:59+0200]     Non-zero exit status: 1
[2022-04-23 08:26:59+0200] ../cpan/IO-Compress/t/cz-14gzopen.t.........................FAILED
[2022-04-23 08:26:59+0200]     3
[2022-04-23 08:26:59+0200] ../cpan/IO-Compress/t/cz-14gzopen.t.........................FAILED
[2022-04-23 08:26:59+0200]     Non-zero exit status: 1
[2022-04-23 08:26:59+0200] ../cpan/Compress-Raw-Zlib/t/01version.t.....................FAILED
[2022-04-23 08:26:59+0200]     2
[2022-04-23 08:26:59+0200] ../cpan/Compress-Raw-Zlib/t/01version.t.....................FAILED
[2022-04-23 08:26:59+0200]     Non-zero exit status: 1
[2022-04-23 08:26:59+0200] ../cpan/Compress-Raw-Zlib/t/02zlib.t........................FAILED
[2022-04-23 08:26:59+0200]     2, 126, 134
[2022-04-23 08:26:59+0200] ../cpan/Compress-Raw-Zlib/t/02zlib.t........................FAILED
[2022-04-23 08:26:59+0200]     Non-zero exit status: 3
[2022-04-23 08:26:59+0200] ../cpan/Compress-Raw-Zlib/t/18lvalue.t......................FAILED
[2022-04-23 08:26:59+0200]     2
[2022-04-23 08:26:59+0200] ../cpan/Compress-Raw-Zlib/t/18lvalue.t......................FAILED
[2022-04-23 08:26:59+0200]     Non-zero exit status: 1
[2022-04-23 08:26:59+0200] ../cpan/Compress-Raw-Zlib/t/19nonpv.t.......................FAILED
[2022-04-23 08:26:59+0200]     2
[2022-04-23 08:26:59+0200] ../cpan/Compress-Raw-Zlib/t/19nonpv.t.......................FAILED
[2022-04-23 08:26:59+0200]     Non-zero exit status: 1
[2022-04-23 08:26:59+0200] Archived results...
[2022-04-23 08:26:59+0200] TSTENV = locale:en_US.utf8	
makefile:258: warning: ignoring prerequisites on suffix rule definition
makefile:254: warning: ignoring prerequisites on suffix rule definition
makefile:258: warning: ignoring prerequisites on suffix rule definition
makefile:258: warning: ignoring prerequisites on suffix rule definition
makefile:254: warning: ignoring prerequisites on suffix rule definition
makefile:258: warning: ignoring prerequisites on suffix rule definition

#   Failed test 'ZLIB_VERSION (1.2.12) matches Compress::Zlib::zlib_version'
#   at t/cz-01version.t line 34.
#          got: '1.2.12'
#     expected: '1.2.11'
# 
# The version of zlib.h does not match the version of libz
# 
# You have zlib.h version 1.2.12
# 	 and libz   version 1.2.11
# 
# You probably have two versions of zlib installed on your system.
# Try removing the one you don't want to use and rebuild.
# Looks like you failed 1 test of 2.

#   Failed test 'ZLIB_VERSION matches Compress::Zlib::zlib_version'
#   at t/cz-03zlib-v1.t line 55.
#          got: '1.2.11'
#     expected: '1.2.12'

#   Failed test at t/cz-03zlib-v1.t line 706.
#          got: -3
#     expected: 1
# Looks like you failed 2 tests of 471.

#   Failed test 'ZLIB_VERSION matches Compress::Zlib::zlib_version'
#   at t/cz-06gzsetp.t line 48.
#          got: '1.2.11'
#     expected: '1.2.12'
# Looks like you failed 1 test of 51.

#   Failed test 'ZLIB_VERSION matches Compress::Zlib::zlib_version'
#   at t/cz-08encoding.t line 43.
#          got: '1.2.11'
#     expected: '1.2.12'
# Looks like you failed 1 test of 29.

#   Failed test 'ZLIB_VERSION matches Compress::Zlib::zlib_version'
#   at t/cz-14gzopen.t line 34.
#          got: '1.2.11'
#     expected: '1.2.12'
# Looks like you failed 1 test of 264.

#   Failed test 'ZLIB_VERSION (1.2.12) matches Compress::Raw::Zlib::zlib_version'
#   at t/01version.t line 34.
#          got: '1.2.12'
#     expected: '1.2.11'
# 
# The version of zlib.h does not match the version of libz
# 
# You have zlib.h version 1.2.12
#      and libz   version 1.2.11
# 
# You probably have two versions of zlib installed on your system.
# Try removing the one you don't want to use and rebuild.
# Looks like you failed 1 test of 2.

#   Failed test 'ZLIB_VERSION matches Compress::Raw::Zlib::zlib_version'
#   at t/02zlib.t line 56.
#          got: '1.2.11'
#     expected: '1.2.12'

#   Failed test at t/02zlib.t line 495.
#          got: -3
#     expected: 1

#   Failed test at t/02zlib.t line 529.
#          got: -3
#     expected: 1
# Looks like you failed 3 tests of 349.

#   Failed test 'ZLIB_VERSION matches Compress::Raw::Zlib::zlib_version'
#   at t/18lvalue.t line 44.
#          got: '1.2.11'
#     expected: '1.2.12'
# Looks like you failed 1 test of 10.

#   Failed test 'ZLIB_VERSION matches Compress::Raw::Zlib::zlib_version'
#   at t/19nonpv.t line 40.
#          got: '1.2.11'
#     expected: '1.2.12'
# Looks like you failed 1 test of 38.
Subroutine Time::HiRes::constant redefined at (eval 37) line 1.
Subroutine Time::HiRes::usleep redefined at (eval 37) line 1.
Subroutine Time::HiRes::nanosleep redefined at (eval 37) line 1.
Subroutine Time::HiRes::sleep redefined at (eval 37) line 1.
Subroutine Time::HiRes::ualarm redefined at (eval 37) line 1.
Subroutine Time::HiRes::alarm redefined at (eval 37) line 1.
Subroutine Time::HiRes::gettimeofday redefined at (eval 37) line 1.
Subroutine Time::HiRes::time redefined at (eval 37) line 1.
Subroutine Time::HiRes::setitimer redefined at (eval 37) line 1.
Subroutine Time::HiRes::getitimer redefined at (eval 37) line 1.
Subroutine Time::HiRes::utime redefined at (eval 37) line 1.
Subroutine Time::HiRes::clock_gettime redefined at (eval 37) line 1.
Subroutine Time::HiRes::clock_getres redefined at (eval 37) line 1.
Subroutine Time::HiRes::clock_nanosleep redefined at (eval 37) line 1.
Subroutine Time::HiRes::clock redefined at (eval 37) line 1.
Subroutine Time::HiRes::lstat redefined at (eval 37) line 1.
Subroutine Time::HiRes::stat redefined at (eval 37) line 1.
make: *** [makefile:856: test_harness] Error 12

error while running harness target 'test_harness': 2 at /data/pro/3gl/CPAN/smoke/lib/Test/Smoke.pm line 194.
[2022-04-23 08:31:45+0200] 
[2022-04-23 08:31:45+0200] ../cpan/IO-Compress/t/cz-01version.t........................FAILED
[2022-04-23 08:31:45+0200]     2
[2022-04-23 08:31:45+0200] ../cpan/IO-Compress/t/cz-01version.t........................FAILED
[2022-04-23 08:31:45+0200]     Non-zero exit status: 1
[2022-04-23 08:31:45+0200] ../cpan/IO-Compress/t/cz-03zlib-v1.t........................FAILED
[2022-04-23 08:31:45+0200]     4, 196
[2022-04-23 08:31:45+0200] ../cpan/IO-Compress/t/cz-03zlib-v1.t........................FAILED
[2022-04-23 08:31:45+0200]     Non-zero exit status: 2
[2022-04-23 08:31:45+0200] ../cpan/IO-Compress/t/cz-06gzsetp.t.........................FAILED
[2022-04-23 08:31:45+0200]     1
[2022-04-23 08:31:45+0200] ../cpan/IO-Compress/t/cz-06gzsetp.t.........................FAILED
[2022-04-23 08:31:45+0200]     Non-zero exit status: 1
[2022-04-23 08:31:45+0200] ../cpan/IO-Compress/t/cz-08encoding.t.......................FAILED
[2022-04-23 08:31:45+0200]     2
[2022-04-23 08:31:45+0200] ../cpan/IO-Compress/t/cz-08encoding.t.......................FAILED
[2022-04-23 08:31:45+0200]     Non-zero exit status: 1
[2022-04-23 08:31:45+0200] ../cpan/IO-Compress/t/cz-14gzopen.t.........................FAILED
[2022-04-23 08:31:45+0200]     3
[2022-04-23 08:31:45+0200] ../cpan/IO-Compress/t/cz-14gzopen.t.........................FAILED
[2022-04-23 08:31:45+0200]     Non-zero exit status: 1
[2022-04-23 08:31:45+0200] ../cpan/Compress-Raw-Zlib/t/01version.t.....................FAILED
[2022-04-23 08:31:45+0200]     2
[2022-04-23 08:31:45+0200] ../cpan/Compress-Raw-Zlib/t/01version.t.....................FAILED
[2022-04-23 08:31:45+0200]     Non-zero exit status: 1
[2022-04-23 08:31:45+0200] ../cpan/Compress-Raw-Zlib/t/02zlib.t........................FAILED
[2022-04-23 08:31:45+0200]     2, 126, 134
[2022-04-23 08:31:45+0200] ../cpan/Compress-Raw-Zlib/t/02zlib.t........................FAILED
[2022-04-23 08:31:45+0200]     Non-zero exit status: 3
[2022-04-23 08:31:45+0200] ../cpan/Compress-Raw-Zlib/t/18lvalue.t......................FAILED
[2022-04-23 08:31:45+0200]     2
[2022-04-23 08:31:45+0200] ../cpan/Compress-Raw-Zlib/t/18lvalue.t......................FAILED
[2022-04-23 08:31:45+0200]     Non-zero exit status: 1
[2022-04-23 08:31:45+0200] ../cpan/Compress-Raw-Zlib/t/19nonpv.t.......................FAILED
[2022-04-23 08:31:45+0200]     2
[2022-04-23 08:31:45+0200] ../cpan/Compress-Raw-Zlib/t/19nonpv.t.......................FAILED
[2022-04-23 08:31:45+0200]     Non-zero exit status: 1
[2022-04-23 08:31:45+0200] Archived results...
[2022-04-23 08:31:45+0200] Unskip tests from '/pro/3gl/CPAN/smoke/p59.skip'
[2022-04-23 08:31:45+0200] 
[2022-04-23 08:31:45+0200] Configuration: -Dusedevel -Duse64bitall -Dusequadmath
[2022-04-23 08:31:45+0200] ------------------------------------------------------------------------------
[2022-04-23 08:31:45+0200] make distclean ...
[2022-04-23 08:31:58+0200] 
[2022-04-23 08:31:58+0200] Copy Policy.sh ...
[2022-04-23 08:31:58+0200] 
[2022-04-23 08:31:58+0200] Configure ...
[2022-04-23 08:32:58+0200] 
[2022-04-23 08:32:58+0200] make ...
[2022-04-23 08:34:17+0200] Skip tests from '/pro/3gl/CPAN/smoke/p59.skip'
[2022-04-23 08:34:17+0200] 
[2022-04-23 08:34:17+0200]  Tests start here:
[2022-04-23 08:34:17+0200] TSTENV = stdio	
makefile:258: warning: ignoring prerequisites on suffix rule definition
makefile:254: warning: ignoring prerequisites on suffix rule definition
makefile:258: warning: ignoring prerequisites on suffix rule definition
makefile:258: warning: ignoring prerequisites on suffix rule definition
makefile:254: warning: ignoring prerequisites on suffix rule definition
makefile:258: warning: ignoring prerequisites on suffix rule definition
No saved state, selection will be empty

#   Failed test 'ZLIB_VERSION (1.2.12) matches Compress::Raw::Zlib::zlib_version'
#   at t/01version.t line 34.
#          got: '1.2.12'
#     expected: '1.2.11'
# 
# The version of zlib.h does not match the version of libz
# 
# You have zlib.h version 1.2.12
#      and libz   version 1.2.11
# 
# You probably have two versions of zlib installed on your system.
# Try removing the one you don't want to use and rebuild.
# Looks like you failed 1 test of 2.

#   Failed test 'ZLIB_VERSION matches Compress::Raw::Zlib::zlib_version'
#   at t/02zlib.t line 56.
#          got: '1.2.11'
#     expected: '1.2.12'

#   Failed test at t/02zlib.t line 495.
#          got: -3
#     expected: 1

#   Failed test at t/02zlib.t line 529.
#          got: -3
#     expected: 1
# Looks like you failed 3 tests of 349.

#   Failed test 'ZLIB_VERSION matches Compress::Raw::Zlib::zlib_version'
#   at t/18lvalue.t line 44.
#          got: '1.2.11'
#     expected: '1.2.12'
# Looks like you failed 1 test of 10.

#   Failed test 'ZLIB_VERSION matches Compress::Raw::Zlib::zlib_version'
#   at t/19nonpv.t line 40.
#          got: '1.2.11'
#     expected: '1.2.12'
# Looks like you failed 1 test of 38.

#   Failed test 'ZLIB_VERSION (1.2.12) matches Compress::Zlib::zlib_version'
#   at t/cz-01version.t line 34.
#          got: '1.2.12'
#     expected: '1.2.11'
# 
# The version of zlib.h does not match the version of libz
# 
# You have zlib.h version 1.2.12
# 	 and libz   version 1.2.11
# 
# You probably have two versions of zlib installed on your system.
# Try removing the one you don't want to use and rebuild.
# Looks like you failed 1 test of 2.

#   Failed test 'ZLIB_VERSION matches Compress::Zlib::zlib_version'
#   at t/cz-03zlib-v1.t line 55.
#          got: '1.2.11'
#     expected: '1.2.12'

#   Failed test at t/cz-03zlib-v1.t line 706.
#          got: -3
#     expected: 1
# Looks like you failed 2 tests of 471.

#   Failed test 'ZLIB_VERSION matches Compress::Zlib::zlib_version'
#   at t/cz-06gzsetp.t line 48.
#          got: '1.2.11'
#     expected: '1.2.12'
# Looks like you failed 1 test of 51.

#   Failed test 'ZLIB_VERSION matches Compress::Zlib::zlib_version'
#   at t/cz-08encoding.t line 43.
#          got: '1.2.11'
#     expected: '1.2.12'
# Looks like you failed 1 test of 29.

#   Failed test 'ZLIB_VERSION matches Compress::Zlib::zlib_version'
#   at t/cz-14gzopen.t line 34.
#          got: '1.2.11'
#     expected: '1.2.12'
# Looks like you failed 1 test of 264.
Subroutine Time::HiRes::constant redefined at (eval 37) line 1.
Subroutine Time::HiRes::usleep redefined at (eval 37) line 1.
Subroutine Time::HiRes::nanosleep redefined at (eval 37) line 1.
Subroutine Time::HiRes::sleep redefined at (eval 37) line 1.
Subroutine Time::HiRes::ualarm redefined at (eval 37) line 1.
Subroutine Time::HiRes::alarm redefined at (eval 37) line 1.
Subroutine Time::HiRes::gettimeofday redefined at (eval 37) line 1.
Subroutine Time::HiRes::time redefined at (eval 37) line 1.
Subroutine Time::HiRes::setitimer redefined at (eval 37) line 1.
Subroutine Time::HiRes::getitimer redefined at (eval 37) line 1.
Subroutine Time::HiRes::utime redefined at (eval 37) line 1.
Subroutine Time::HiRes::clock_gettime redefined at (eval 37) line 1.
Subroutine Time::HiRes::clock_getres redefined at (eval 37) line 1.
Subroutine Time::HiRes::clock_nanosleep redefined at (eval 37) line 1.
Subroutine Time::HiRes::clock redefined at (eval 37) line 1.
Subroutine Time::HiRes::lstat redefined at (eval 37) line 1.
Subroutine Time::HiRes::stat redefined at (eval 37) line 1.
No such file or directory
No such file or directory
No such file or directory
No such file or directory
No such file or directory
No such file or directory
No such file or directory
make: *** [makefile:856: test_harness] Error 12

error while running harness target 'test_harness': 2 at /data/pro/3gl/CPAN/smoke/lib/Test/Smoke.pm line 194.
[2022-04-23 08:38:37+0200] 
[2022-04-23 08:38:37+0200] ../cpan/Compress-Raw-Zlib/t/01version.t.....................FAILED
[2022-04-23 08:38:37+0200]     2
[2022-04-23 08:38:37+0200] ../cpan/Compress-Raw-Zlib/t/01version.t.....................FAILED
[2022-04-23 08:38:37+0200]     Non-zero exit status: 1
[2022-04-23 08:38:37+0200] ../cpan/Compress-Raw-Zlib/t/02zlib.t........................FAILED
[2022-04-23 08:38:37+0200]     2, 126, 134
[2022-04-23 08:38:37+0200] ../cpan/Compress-Raw-Zlib/t/02zlib.t........................FAILED
[2022-04-23 08:38:37+0200]     Non-zero exit status: 3
[2022-04-23 08:38:37+0200] ../cpan/Compress-Raw-Zlib/t/18lvalue.t......................FAILED
[2022-04-23 08:38:37+0200]     2
[2022-04-23 08:38:37+0200] ../cpan/Compress-Raw-Zlib/t/18lvalue.t......................FAILED
[2022-04-23 08:38:37+0200]     Non-zero exit status: 1
[2022-04-23 08:38:37+0200] ../cpan/Compress-Raw-Zlib/t/19nonpv.t.......................FAILED
[2022-04-23 08:38:37+0200]     2
[2022-04-23 08:38:37+0200] ../cpan/Compress-Raw-Zlib/t/19nonpv.t.......................FAILED
[2022-04-23 08:38:37+0200]     Non-zero exit status: 1
[2022-04-23 08:38:37+0200] ../cpan/IO-Compress/t/cz-01version.t........................FAILED
[2022-04-23 08:38:37+0200]     2
[2022-04-23 08:38:37+0200] ../cpan/IO-Compress/t/cz-01version.t........................FAILED
[2022-04-23 08:38:37+0200]     Non-zero exit status: 1
[2022-04-23 08:38:37+0200] ../cpan/IO-Compress/t/cz-03zlib-v1.t........................FAILED
[2022-04-23 08:38:37+0200]     4, 196
[2022-04-23 08:38:37+0200] ../cpan/IO-Compress/t/cz-03zlib-v1.t........................FAILED
[2022-04-23 08:38:37+0200]     Non-zero exit status: 2
[2022-04-23 08:38:37+0200] ../cpan/IO-Compress/t/cz-06gzsetp.t.........................FAILED
[2022-04-23 08:38:37+0200]     1
[2022-04-23 08:38:37+0200] ../cpan/IO-Compress/t/cz-06gzsetp.t.........................FAILED
[2022-04-23 08:38:37+0200]     Non-zero exit status: 1
[2022-04-23 08:38:37+0200] ../cpan/IO-Compress/t/cz-08encoding.t.......................FAILED
[2022-04-23 08:38:37+0200]     2
[2022-04-23 08:38:37+0200] ../cpan/IO-Compress/t/cz-08encoding.t.......................FAILED
[2022-04-23 08:38:37+0200]     Non-zero exit status: 1
[2022-04-23 08:38:37+0200] ../cpan/IO-Compress/t/cz-14gzopen.t.........................FAILED
[2022-04-23 08:38:37+0200]     3
[2022-04-23 08:38:37+0200] ../cpan/IO-Compress/t/cz-14gzopen.t.........................FAILED
[2022-04-23 08:38:37+0200]     Non-zero exit status: 1
[2022-04-23 08:38:37+0200] Archived results...
[2022-04-23 08:38:37+0200] TSTENV = perlio	
makefile:258: warning: ignoring prerequisites on suffix rule definition
makefile:254: warning: ignoring prerequisites on suffix rule definition
makefile:258: warning: ignoring prerequisites on suffix rule definition
makefile:258: warning: ignoring prerequisites on suffix rule definition
makefile:254: warning: ignoring prerequisites on suffix rule definition
makefile:258: warning: ignoring prerequisites on suffix rule definition

#   Failed test 'ZLIB_VERSION (1.2.12) matches Compress::Zlib::zlib_version'
#   at t/cz-01version.t line 34.
#          got: '1.2.12'
#     expected: '1.2.11'
# 
# The version of zlib.h does not match the version of libz
# 
# You have zlib.h version 1.2.12
# 	 and libz   version 1.2.11
# 
# You probably have two versions of zlib installed on your system.
# Try removing the one you don't want to use and rebuild.
# Looks like you failed 1 test of 2.

#   Failed test 'ZLIB_VERSION matches Compress::Zlib::zlib_version'
#   at t/cz-03zlib-v1.t line 55.
#          got: '1.2.11'
#     expected: '1.2.12'

#   Failed test at t/cz-03zlib-v1.t line 706.
#          got: -3
#     expected: 1
# Looks like you failed 2 tests of 471.

#   Failed test 'ZLIB_VERSION matches Compress::Zlib::zlib_version'
#   at t/cz-06gzsetp.t line 48.
#          got: '1.2.11'
#     expected: '1.2.12'
# Looks like you failed 1 test of 51.

#   Failed test 'ZLIB_VERSION matches Compress::Zlib::zlib_version'
#   at t/cz-08encoding.t line 43.
#          got: '1.2.11'
#     expected: '1.2.12'
# Looks like you failed 1 test of 29.

#   Failed test 'ZLIB_VERSION matches Compress::Zlib::zlib_version'
#   at t/cz-14gzopen.t line 34.
#          got: '1.2.11'
#     expected: '1.2.12'
# Looks like you failed 1 test of 264.

#   Failed test 'ZLIB_VERSION (1.2.12) matches Compress::Raw::Zlib::zlib_version'
#   at t/01version.t line 34.
#          got: '1.2.12'
#     expected: '1.2.11'
# 
# The version of zlib.h does not match the version of libz
# 
# You have zlib.h version 1.2.12
#      and libz   version 1.2.11
# 
# You probably have two versions of zlib installed on your system.
# Try removing the one you don't want to use and rebuild.
# Looks like you failed 1 test of 2.

#   Failed test 'ZLIB_VERSION matches Compress::Raw::Zlib::zlib_version'
#   at t/02zlib.t line 56.
#          got: '1.2.11'
#     expected: '1.2.12'

#   Failed test at t/02zlib.t line 495.
#          got: -3
#     expected: 1

#   Failed test at t/02zlib.t line 529.
#          got: -3
#     expected: 1
# Looks like you failed 3 tests of 349.

#   Failed test 'ZLIB_VERSION matches Compress::Raw::Zlib::zlib_version'
#   at t/18lvalue.t line 44.
#          got: '1.2.11'
#     expected: '1.2.12'
# Looks like you failed 1 test of 10.

#   Failed test 'ZLIB_VERSION matches Compress::Raw::Zlib::zlib_version'
#   at t/19nonpv.t line 40.
#          got: '1.2.11'
#     expected: '1.2.12'
# Looks like you failed 1 test of 38.
Subroutine Time::HiRes::constant redefined at (eval 37) line 1.
Subroutine Time::HiRes::usleep redefined at (eval 37) line 1.
Subroutine Time::HiRes::nanosleep redefined at (eval 37) line 1.
Subroutine Time::HiRes::sleep redefined at (eval 37) line 1.
Subroutine Time::HiRes::ualarm redefined at (eval 37) line 1.
Subroutine Time::HiRes::alarm redefined at (eval 37) line 1.
Subroutine Time::HiRes::gettimeofday redefined at (eval 37) line 1.
Subroutine Time::HiRes::time redefined at (eval 37) line 1.
Subroutine Time::HiRes::setitimer redefined at (eval 37) line 1.
Subroutine Time::HiRes::getitimer redefined at (eval 37) line 1.
Subroutine Time::HiRes::utime redefined at (eval 37) line 1.
Subroutine Time::HiRes::clock_gettime redefined at (eval 37) line 1.
Subroutine Time::HiRes::clock_getres redefined at (eval 37) line 1.
Subroutine Time::HiRes::clock_nanosleep redefined at (eval 37) line 1.
Subroutine Time::HiRes::clock redefined at (eval 37) line 1.
Subroutine Time::HiRes::lstat redefined at (eval 37) line 1.
Subroutine Time::HiRes::stat redefined at (eval 37) line 1.
make: *** [makefile:856: test_harness] Error 12

error while running harness target 'test_harness': 2 at /data/pro/3gl/CPAN/smoke/lib/Test/Smoke.pm line 194.
[2022-04-23 08:42:47+0200] 
[2022-04-23 08:42:47+0200] ../cpan/IO-Compress/t/cz-01version.t........................FAILED
[2022-04-23 08:42:47+0200]     2
[2022-04-23 08:42:47+0200] ../cpan/IO-Compress/t/cz-01version.t........................FAILED
[2022-04-23 08:42:47+0200]     Non-zero exit status: 1
[2022-04-23 08:42:47+0200] ../cpan/IO-Compress/t/cz-03zlib-v1.t........................FAILED
[2022-04-23 08:42:47+0200]     4, 196
[2022-04-23 08:42:47+0200] ../cpan/IO-Compress/t/cz-03zlib-v1.t........................FAILED
[2022-04-23 08:42:47+0200]     Non-zero exit status: 2
[2022-04-23 08:42:47+0200] ../cpan/IO-Compress/t/cz-06gzsetp.t.........................FAILED
[2022-04-23 08:42:47+0200]     1
[2022-04-23 08:42:47+0200] ../cpan/IO-Compress/t/cz-06gzsetp.t.........................FAILED
[2022-04-23 08:42:47+0200]     Non-zero exit status: 1
[2022-04-23 08:42:47+0200] ../cpan/IO-Compress/t/cz-08encoding.t.......................FAILED
[2022-04-23 08:42:47+0200]     2
[2022-04-23 08:42:47+0200] ../cpan/IO-Compress/t/cz-08encoding.t.......................FAILED
[2022-04-23 08:42:47+0200]     Non-zero exit status: 1
[2022-04-23 08:42:47+0200] ../cpan/IO-Compress/t/cz-14gzopen.t.........................FAILED
[2022-04-23 08:42:47+0200]     3
[2022-04-23 08:42:47+0200] ../cpan/IO-Compress/t/cz-14gzopen.t.........................FAILED
[2022-04-23 08:42:47+0200]     Non-zero exit status: 1
[2022-04-23 08:42:47+0200] ../cpan/Compress-Raw-Zlib/t/01version.t.....................FAILED
[2022-04-23 08:42:47+0200]     2
[2022-04-23 08:42:47+0200] ../cpan/Compress-Raw-Zlib/t/01version.t.....................FAILED
[2022-04-23 08:42:47+0200]     Non-zero exit status: 1
[2022-04-23 08:42:47+0200] ../cpan/Compress-Raw-Zlib/t/02zlib.t........................FAILED
[2022-04-23 08:42:47+0200]     2, 126, 134
[2022-04-23 08:42:47+0200] ../cpan/Compress-Raw-Zlib/t/02zlib.t........................FAILED
[2022-04-23 08:42:47+0200]     Non-zero exit status: 3
[2022-04-23 08:42:47+0200] ../cpan/Compress-Raw-Zlib/t/18lvalue.t......................FAILED
[2022-04-23 08:42:47+0200]     2
[2022-04-23 08:42:47+0200] ../cpan/Compress-Raw-Zlib/t/18lvalue.t......................FAILED
[2022-04-23 08:42:47+0200]     Non-zero exit status: 1
[2022-04-23 08:42:47+0200] ../cpan/Compress-Raw-Zlib/t/19nonpv.t.......................FAILED
[2022-04-23 08:42:47+0200]     2
[2022-04-23 08:42:47+0200] ../cpan/Compress-Raw-Zlib/t/19nonpv.t.......................FAILED
[2022-04-23 08:42:47+0200]     Non-zero exit status: 1
[2022-04-23 08:42:47+0200] Archived results...
[2022-04-23 08:42:47+0200] TSTENV = locale:en_US.utf8	
makefile:258: warning: ignoring prerequisites on suffix rule definition
makefile:254: warning: ignoring prerequisites on suffix rule definition
makefile:258: warning: ignoring prerequisites on suffix rule definition
makefile:258: warning: ignoring prerequisites on suffix rule definition
makefile:254: warning: ignoring prerequisites on suffix rule definition
makefile:258: warning: ignoring prerequisites on suffix rule definition

#   Failed test 'ZLIB_VERSION (1.2.12) matches Compress::Zlib::zlib_version'
#   at t/cz-01version.t line 34.
#          got: '1.2.12'
#     expected: '1.2.11'
# 
# The version of zlib.h does not match the version of libz
# 
# You have zlib.h version 1.2.12
# 	 and libz   version 1.2.11
# 
# You probably have two versions of zlib installed on your system.
# Try removing the one you don't want to use and rebuild.
# Looks like you failed 1 test of 2.

#   Failed test 'ZLIB_VERSION matches Compress::Zlib::zlib_version'
#   at t/cz-03zlib-v1.t line 55.
#          got: '1.2.11'
#     expected: '1.2.12'

#   Failed test at t/cz-03zlib-v1.t line 706.
#          got: -3
#     expected: 1
# Looks like you failed 2 tests of 471.

#   Failed test 'ZLIB_VERSION matches Compress::Zlib::zlib_version'
#   at t/cz-06gzsetp.t line 48.
#          got: '1.2.11'
#     expected: '1.2.12'
# Looks like you failed 1 test of 51.

#   Failed test 'ZLIB_VERSION matches Compress::Zlib::zlib_version'
#   at t/cz-08encoding.t line 43.
#          got: '1.2.11'
#     expected: '1.2.12'
# Looks like you failed 1 test of 29.

#   Failed test 'ZLIB_VERSION matches Compress::Zlib::zlib_version'
#   at t/cz-14gzopen.t line 34.
#          got: '1.2.11'
#     expected: '1.2.12'
# Looks like you failed 1 test of 264.

#   Failed test 'ZLIB_VERSION (1.2.12) matches Compress::Raw::Zlib::zlib_version'
#   at t/01version.t line 34.
#          got: '1.2.12'
#     expected: '1.2.11'
# 
# The version of zlib.h does not match the version of libz
# 
# You have zlib.h version 1.2.12
#      and libz   version 1.2.11
# 
# You probably have two versions of zlib installed on your system.
# Try removing the one you don't want to use and rebuild.
# Looks like you failed 1 test of 2.

#   Failed test 'ZLIB_VERSION matches Compress::Raw::Zlib::zlib_version'
#   at t/02zlib.t line 56.
#          got: '1.2.11'
#     expected: '1.2.12'

#   Failed test at t/02zlib.t line 495.
#          got: -3
#     expected: 1

#   Failed test at t/02zlib.t line 529.
#          got: -3
#     expected: 1
# Looks like you failed 3 tests of 349.

#   Failed test 'ZLIB_VERSION matches Compress::Raw::Zlib::zlib_version'
#   at t/18lvalue.t line 44.
#          got: '1.2.11'
#     expected: '1.2.12'
# Looks like you failed 1 test of 10.

#   Failed test 'ZLIB_VERSION matches Compress::Raw::Zlib::zlib_version'
#   at t/19nonpv.t line 40.
#          got: '1.2.11'
#     expected: '1.2.12'
# Looks like you failed 1 test of 38.
Subroutine Time::HiRes::constant redefined at (eval 37) line 1.
Subroutine Time::HiRes::usleep redefined at (eval 37) line 1.
Subroutine Time::HiRes::nanosleep redefined at (eval 37) line 1.
Subroutine Time::HiRes::sleep redefined at (eval 37) line 1.
Subroutine Time::HiRes::ualarm redefined at (eval 37) line 1.
Subroutine Time::HiRes::alarm redefined at (eval 37) line 1.
Subroutine Time::HiRes::gettimeofday redefined at (eval 37) line 1.
Subroutine Time::HiRes::time redefined at (eval 37) line 1.
Subroutine Time::HiRes::setitimer redefined at (eval 37) line 1.
Subroutine Time::HiRes::getitimer redefined at (eval 37) line 1.
Subroutine Time::HiRes::utime redefined at (eval 37) line 1.
Subroutine Time::HiRes::clock_gettime redefined at (eval 37) line 1.
Subroutine Time::HiRes::clock_getres redefined at (eval 37) line 1.
Subroutine Time::HiRes::clock_nanosleep redefined at (eval 37) line 1.
Subroutine Time::HiRes::clock redefined at (eval 37) line 1.
Subroutine Time::HiRes::lstat redefined at (eval 37) line 1.
Subroutine Time::HiRes::stat redefined at (eval 37) line 1.
make: *** [makefile:856: test_harness] Error 12

error while running harness target 'test_harness': 2 at /data/pro/3gl/CPAN/smoke/lib/Test/Smoke.pm line 194.
[2022-04-23 08:46:55+0200] 
[2022-04-23 08:46:55+0200] ../cpan/IO-Compress/t/cz-01version.t........................FAILED
[2022-04-23 08:46:55+0200]     2
[2022-04-23 08:46:55+0200] ../cpan/IO-Compress/t/cz-01version.t........................FAILED
[2022-04-23 08:46:55+0200]     Non-zero exit status: 1
[2022-04-23 08:46:55+0200] ../cpan/IO-Compress/t/cz-03zlib-v1.t........................FAILED
[2022-04-23 08:46:55+0200]     4, 196
[2022-04-23 08:46:55+0200] ../cpan/IO-Compress/t/cz-03zlib-v1.t........................FAILED
[2022-04-23 08:46:55+0200]     Non-zero exit status: 2
[2022-04-23 08:46:55+0200] ../cpan/IO-Compress/t/cz-06gzsetp.t.........................FAILED
[2022-04-23 08:46:55+0200]     1
[2022-04-23 08:46:55+0200] ../cpan/IO-Compress/t/cz-06gzsetp.t.........................FAILED
[2022-04-23 08:46:55+0200]     Non-zero exit status: 1
[2022-04-23 08:46:55+0200] ../cpan/IO-Compress/t/cz-08encoding.t.......................FAILED
[2022-04-23 08:46:55+0200]     2
[2022-04-23 08:46:55+0200] ../cpan/IO-Compress/t/cz-08encoding.t.......................FAILED
[2022-04-23 08:46:55+0200]     Non-zero exit status: 1
[2022-04-23 08:46:55+0200] ../cpan/IO-Compress/t/cz-14gzopen.t.........................FAILED
[2022-04-23 08:46:55+0200]     3
[2022-04-23 08:46:55+0200] ../cpan/IO-Compress/t/cz-14gzopen.t.........................FAILED
[2022-04-23 08:46:55+0200]     Non-zero exit status: 1
[2022-04-23 08:46:55+0200] ../cpan/Compress-Raw-Zlib/t/01version.t.....................FAILED
[2022-04-23 08:46:55+0200]     2
[2022-04-23 08:46:55+0200] ../cpan/Compress-Raw-Zlib/t/01version.t.....................FAILED
[2022-04-23 08:46:55+0200]     Non-zero exit status: 1
[2022-04-23 08:46:55+0200] ../cpan/Compress-Raw-Zlib/t/02zlib.t........................FAILED
[2022-04-23 08:46:55+0200]     2, 126, 134
[2022-04-23 08:46:55+0200] ../cpan/Compress-Raw-Zlib/t/02zlib.t........................FAILED
[2022-04-23 08:46:55+0200]     Non-zero exit status: 3
[2022-04-23 08:46:55+0200] ../cpan/Compress-Raw-Zlib/t/18lvalue.t......................FAILED
[2022-04-23 08:46:55+0200]     2
[2022-04-23 08:46:55+0200] ../cpan/Compress-Raw-Zlib/t/18lvalue.t......................FAILED
[2022-04-23 08:46:55+0200]     Non-zero exit status: 1
[2022-04-23 08:46:55+0200] ../cpan/Compress-Raw-Zlib/t/19nonpv.t.......................FAILED
[2022-04-23 08:46:55+0200]     2
[2022-04-23 08:46:55+0200] ../cpan/Compress-Raw-Zlib/t/19nonpv.t.......................FAILED
[2022-04-23 08:46:55+0200]     Non-zero exit status: 1
[2022-04-23 08:46:55+0200] Archived results...
[2022-04-23 08:46:55+0200] Unskip tests from '/pro/3gl/CPAN/smoke/p59.skip'
[2022-04-23 08:46:55+0200] 
[2022-04-23 08:46:55+0200] Configuration: -Dusedevel -Duse64bitall -Dusequadmath -DDEBUGGING
[2022-04-23 08:46:55+0200] ------------------------------------------------------------------------------
[2022-04-23 08:46:55+0200] make distclean ...
[2022-04-23 08:47:06+0200] 
[2022-04-23 08:47:06+0200] Copy Policy.sh ...
[2022-04-23 08:47:06+0200] 
[2022-04-23 08:47:06+0200] Configure ...
[2022-04-23 08:48:08+0200] 
[2022-04-23 08:48:08+0200] make ...
[2022-04-23 08:50:02+0200] Skip tests from '/pro/3gl/CPAN/smoke/p59.skip'
[2022-04-23 08:50:02+0200] 
[2022-04-23 08:50:02+0200]  Tests start here:
[2022-04-23 08:50:02+0200] TSTENV = stdio	
makefile:258: warning: ignoring prerequisites on suffix rule definition
makefile:254: warning: ignoring prerequisites on suffix rule definition
makefile:258: warning: ignoring prerequisites on suffix rule definition
makefile:258: warning: ignoring prerequisites on suffix rule definition
makefile:254: warning: ignoring prerequisites on suffix rule definition
makefile:258: warning: ignoring prerequisites on suffix rule definition
No saved state, selection will be empty

#   Failed test 'ZLIB_VERSION (1.2.12) matches Compress::Raw::Zlib::zlib_version'
#   at t/01version.t line 34.
#          got: '1.2.12'
#     expected: '1.2.11'
# 
# The version of zlib.h does not match the version of libz
# 
# You have zlib.h version 1.2.12
#      and libz   version 1.2.11
# 
# You probably have two versions of zlib installed on your system.
# Try removing the one you don't want to use and rebuild.
# Looks like you failed 1 test of 2.

#   Failed test 'ZLIB_VERSION matches Compress::Raw::Zlib::zlib_version'
#   at t/02zlib.t line 56.
#          got: '1.2.11'
#     expected: '1.2.12'

#   Failed test at t/02zlib.t line 495.
#          got: -3
#     expected: 1

#   Failed test at t/02zlib.t line 529.
#          got: -3
#     expected: 1
# Looks like you failed 3 tests of 349.

#   Failed test 'ZLIB_VERSION matches Compress::Raw::Zlib::zlib_version'
#   at t/18lvalue.t line 44.
#          got: '1.2.11'
#     expected: '1.2.12'
# Looks like you failed 1 test of 10.

#   Failed test 'ZLIB_VERSION matches Compress::Raw::Zlib::zlib_version'
#   at t/19nonpv.t line 40.
#          got: '1.2.11'
#     expected: '1.2.12'
# Looks like you failed 1 test of 38.

#   Failed test 'ZLIB_VERSION (1.2.12) matches Compress::Zlib::zlib_version'
#   at t/cz-01version.t line 34.
#          got: '1.2.12'
#     expected: '1.2.11'
# 
# The version of zlib.h does not match the version of libz
# 
# You have zlib.h version 1.2.12
# 	 and libz   version 1.2.11
# 
# You probably have two versions of zlib installed on your system.
# Try removing the one you don't want to use and rebuild.
# Looks like you failed 1 test of 2.

#   Failed test 'ZLIB_VERSION matches Compress::Zlib::zlib_version'
#   at t/cz-03zlib-v1.t line 55.
#          got: '1.2.11'
#     expected: '1.2.12'

#   Failed test at t/cz-03zlib-v1.t line 706.
#          got: -3
#     expected: 1
# Looks like you failed 2 tests of 471.

#   Failed test 'ZLIB_VERSION matches Compress::Zlib::zlib_version'
#   at t/cz-06gzsetp.t line 48.
#          got: '1.2.11'
#     expected: '1.2.12'
# Looks like you failed 1 test of 51.

#   Failed test 'ZLIB_VERSION matches Compress::Zlib::zlib_version'
#   at t/cz-08encoding.t line 43.
#          got: '1.2.11'
#     expected: '1.2.12'
# Looks like you failed 1 test of 29.

#   Failed test 'ZLIB_VERSION matches Compress::Zlib::zlib_version'
#   at t/cz-14gzopen.t line 34.
#          got: '1.2.11'
#     expected: '1.2.12'
# Looks like you failed 1 test of 264.
Subroutine Time::HiRes::constant redefined at (eval 37) line 1.
Subroutine Time::HiRes::usleep redefined at (eval 37) line 1.
Subroutine Time::HiRes::nanosleep redefined at (eval 37) line 1.
Subroutine Time::HiRes::sleep redefined at (eval 37) line 1.
Subroutine Time::HiRes::ualarm redefined at (eval 37) line 1.
Subroutine Time::HiRes::alarm redefined at (eval 37) line 1.
Subroutine Time::HiRes::gettimeofday redefined at (eval 37) line 1.
Subroutine Time::HiRes::time redefined at (eval 37) line 1.
Subroutine Time::HiRes::setitimer redefined at (eval 37) line 1.
Subroutine Time::HiRes::getitimer redefined at (eval 37) line 1.
Subroutine Time::HiRes::utime redefined at (eval 37) line 1.
Subroutine Time::HiRes::clock_gettime redefined at (eval 37) line 1.
Subroutine Time::HiRes::clock_getres redefined at (eval 37) line 1.
Subroutine Time::HiRes::clock_nanosleep redefined at (eval 37) line 1.
Subroutine Time::HiRes::clock redefined at (eval 37) line 1.
Subroutine Time::HiRes::lstat redefined at (eval 37) line 1.
Subroutine Time::HiRes::stat redefined at (eval 37) line 1.
No such file or directory
No such file or directory
No such file or directory
No such file or directory
No such file or directory
No such file or directory
No such file or directory
make: *** [makefile:856: test_harness] Error 12

error while running harness target 'test_harness': 2 at /data/pro/3gl/CPAN/smoke/lib/Test/Smoke.pm line 194.
[2022-04-23 08:55:03+0200] 
[2022-04-23 08:55:03+0200] ../cpan/Compress-Raw-Zlib/t/01version.t.....................FAILED
[2022-04-23 08:55:03+0200]     2
[2022-04-23 08:55:03+0200] ../cpan/Compress-Raw-Zlib/t/01version.t.....................FAILED
[2022-04-23 08:55:03+0200]     Non-zero exit status: 1
[2022-04-23 08:55:03+0200] ../cpan/Compress-Raw-Zlib/t/02zlib.t........................FAILED
[2022-04-23 08:55:03+0200]     2, 126, 134
[2022-04-23 08:55:03+0200] ../cpan/Compress-Raw-Zlib/t/02zlib.t........................FAILED
[2022-04-23 08:55:03+0200]     Non-zero exit status: 3
[2022-04-23 08:55:03+0200] ../cpan/Compress-Raw-Zlib/t/18lvalue.t......................FAILED
[2022-04-23 08:55:03+0200]     2
[2022-04-23 08:55:03+0200] ../cpan/Compress-Raw-Zlib/t/18lvalue.t......................FAILED
[2022-04-23 08:55:03+0200]     Non-zero exit status: 1
[2022-04-23 08:55:03+0200] ../cpan/Compress-Raw-Zlib/t/19nonpv.t.......................FAILED
[2022-04-23 08:55:03+0200]     2
[2022-04-23 08:55:03+0200] ../cpan/Compress-Raw-Zlib/t/19nonpv.t.......................FAILED
[2022-04-23 08:55:03+0200]     Non-zero exit status: 1
[2022-04-23 08:55:03+0200] ../cpan/IO-Compress/t/cz-01version.t........................FAILED
[2022-04-23 08:55:03+0200]     2
[2022-04-23 08:55:03+0200] ../cpan/IO-Compress/t/cz-01version.t........................FAILED
[2022-04-23 08:55:03+0200]     Non-zero exit status: 1
[2022-04-23 08:55:03+0200] ../cpan/IO-Compress/t/cz-03zlib-v1.t........................FAILED
[2022-04-23 08:55:03+0200]     4, 196
[2022-04-23 08:55:03+0200] ../cpan/IO-Compress/t/cz-03zlib-v1.t........................FAILED
[2022-04-23 08:55:03+0200]     Non-zero exit status: 2
[2022-04-23 08:55:03+0200] ../cpan/IO-Compress/t/cz-06gzsetp.t.........................FAILED
[2022-04-23 08:55:03+0200]     1
[2022-04-23 08:55:03+0200] ../cpan/IO-Compress/t/cz-06gzsetp.t.........................FAILED
[2022-04-23 08:55:03+0200]     Non-zero exit status: 1
[2022-04-23 08:55:03+0200] ../cpan/IO-Compress/t/cz-08encoding.t.......................FAILED
[2022-04-23 08:55:03+0200]     2
[2022-04-23 08:55:03+0200] ../cpan/IO-Compress/t/cz-08encoding.t.......................FAILED
[2022-04-23 08:55:03+0200]     Non-zero exit status: 1
[2022-04-23 08:55:03+0200] ../cpan/IO-Compress/t/cz-14gzopen.t.........................FAILED
[2022-04-23 08:55:03+0200]     3
[2022-04-23 08:55:03+0200] ../cpan/IO-Compress/t/cz-14gzopen.t.........................FAILED
[2022-04-23 08:55:03+0200]     Non-zero exit status: 1
[2022-04-23 08:55:03+0200] Archived results...
[2022-04-23 08:55:03+0200] TSTENV = perlio	
makefile:258: warning: ignoring prerequisites on suffix rule definition
makefile:254: warning: ignoring prerequisites on suffix rule definition
makefile:258: warning: ignoring prerequisites on suffix rule definition
makefile:258: warning: ignoring prerequisites on suffix rule definition
makefile:254: warning: ignoring prerequisites on suffix rule definition
makefile:258: warning: ignoring prerequisites on suffix rule definition

#   Failed test 'ZLIB_VERSION (1.2.12) matches Compress::Zlib::zlib_version'
#   at t/cz-01version.t line 34.
#          got: '1.2.12'
#     expected: '1.2.11'
# 
# The version of zlib.h does not match the version of libz
# 
# You have zlib.h version 1.2.12
# 	 and libz   version 1.2.11
# 
# You probably have two versions of zlib installed on your system.
# Try removing the one you don't want to use and rebuild.
# Looks like you failed 1 test of 2.

#   Failed test 'ZLIB_VERSION matches Compress::Zlib::zlib_version'
#   at t/cz-03zlib-v1.t line 55.
#          got: '1.2.11'
#     expected: '1.2.12'

#   Failed test at t/cz-03zlib-v1.t line 706.
#          got: -3
#     expected: 1
# Looks like you failed 2 tests of 471.

#   Failed test 'ZLIB_VERSION matches Compress::Zlib::zlib_version'
#   at t/cz-06gzsetp.t line 48.
#          got: '1.2.11'
#     expected: '1.2.12'
# Looks like you failed 1 test of 51.

#   Failed test 'ZLIB_VERSION matches Compress::Zlib::zlib_version'
#   at t/cz-08encoding.t line 43.
#          got: '1.2.11'
#     expected: '1.2.12'
# Looks like you failed 1 test of 29.

#   Failed test 'ZLIB_VERSION matches Compress::Zlib::zlib_version'
#   at t/cz-14gzopen.t line 34.
#          got: '1.2.11'
#     expected: '1.2.12'
# Looks like you failed 1 test of 264.

#   Failed test 'ZLIB_VERSION (1.2.12) matches Compress::Raw::Zlib::zlib_version'
#   at t/01version.t line 34.
#          got: '1.2.12'
#     expected: '1.2.11'
# 
# The version of zlib.h does not match the version of libz
# 
# You have zlib.h version 1.2.12
#      and libz   version 1.2.11
# 
# You probably have two versions of zlib installed on your system.
# Try removing the one you don't want to use and rebuild.
# Looks like you failed 1 test of 2.

#   Failed test 'ZLIB_VERSION matches Compress::Raw::Zlib::zlib_version'
#   at t/02zlib.t line 56.
#          got: '1.2.11'
#     expected: '1.2.12'

#   Failed test at t/02zlib.t line 495.
#          got: -3
#     expected: 1

#   Failed test at t/02zlib.t line 529.
#          got: -3
#     expected: 1
# Looks like you failed 3 tests of 349.

#   Failed test 'ZLIB_VERSION matches Compress::Raw::Zlib::zlib_version'
#   at t/18lvalue.t line 44.
#          got: '1.2.11'
#     expected: '1.2.12'
# Looks like you failed 1 test of 10.

#   Failed test 'ZLIB_VERSION matches Compress::Raw::Zlib::zlib_version'
#   at t/19nonpv.t line 40.
#          got: '1.2.11'
#     expected: '1.2.12'
# Looks like you failed 1 test of 38.
Subroutine Time::HiRes::constant redefined at (eval 37) line 1.
Subroutine Time::HiRes::usleep redefined at (eval 37) line 1.
Subroutine Time::HiRes::nanosleep redefined at (eval 37) line 1.
Subroutine Time::HiRes::sleep redefined at (eval 37) line 1.
Subroutine Time::HiRes::ualarm redefined at (eval 37) line 1.
Subroutine Time::HiRes::alarm redefined at (eval 37) line 1.
Subroutine Time::HiRes::gettimeofday redefined at (eval 37) line 1.
Subroutine Time::HiRes::time redefined at (eval 37) line 1.
Subroutine Time::HiRes::setitimer redefined at (eval 37) line 1.
Subroutine Time::HiRes::getitimer redefined at (eval 37) line 1.
Subroutine Time::HiRes::utime redefined at (eval 37) line 1.
Subroutine Time::HiRes::clock_gettime redefined at (eval 37) line 1.
Subroutine Time::HiRes::clock_getres redefined at (eval 37) line 1.
Subroutine Time::HiRes::clock_nanosleep redefined at (eval 37) line 1.
Subroutine Time::HiRes::clock redefined at (eval 37) line 1.
Subroutine Time::HiRes::lstat redefined at (eval 37) line 1.
Subroutine Time::HiRes::stat redefined at (eval 37) line 1.
make: *** [makefile:856: test_harness] Error 12

error while running harness target 'test_harness': 2 at /data/pro/3gl/CPAN/smoke/lib/Test/Smoke.pm line 194.
[2022-04-23 08:59:56+0200] 
[2022-04-23 08:59:56+0200] ../cpan/IO-Compress/t/cz-01version.t........................FAILED
[2022-04-23 08:59:56+0200]     2
[2022-04-23 08:59:56+0200] ../cpan/IO-Compress/t/cz-01version.t........................FAILED
[2022-04-23 08:59:56+0200]     Non-zero exit status: 1
[2022-04-23 08:59:56+0200] ../cpan/IO-Compress/t/cz-03zlib-v1.t........................FAILED
[2022-04-23 08:59:56+0200]     4, 196
[2022-04-23 08:59:56+0200] ../cpan/IO-Compress/t/cz-03zlib-v1.t........................FAILED
[2022-04-23 08:59:56+0200]     Non-zero exit status: 2
[2022-04-23 08:59:56+0200] ../cpan/IO-Compress/t/cz-06gzsetp.t.........................FAILED
[2022-04-23 08:59:56+0200]     1
[2022-04-23 08:59:56+0200] ../cpan/IO-Compress/t/cz-06gzsetp.t.........................FAILED
[2022-04-23 08:59:56+0200]     Non-zero exit status: 1
[2022-04-23 08:59:56+0200] ../cpan/IO-Compress/t/cz-08encoding.t.......................FAILED
[2022-04-23 08:59:56+0200]     2
[2022-04-23 08:59:56+0200] ../cpan/IO-Compress/t/cz-08encoding.t.......................FAILED
[2022-04-23 08:59:56+0200]     Non-zero exit status: 1
[2022-04-23 08:59:56+0200] ../cpan/IO-Compress/t/cz-14gzopen.t.........................FAILED
[2022-04-23 08:59:56+0200]     3
[2022-04-23 08:59:56+0200] ../cpan/IO-Compress/t/cz-14gzopen.t.........................FAILED
[2022-04-23 08:59:56+0200]     Non-zero exit status: 1
[2022-04-23 08:59:56+0200] ../cpan/Compress-Raw-Zlib/t/01version.t.....................FAILED
[2022-04-23 08:59:56+0200]     2
[2022-04-23 08:59:56+0200] ../cpan/Compress-Raw-Zlib/t/01version.t.....................FAILED
[2022-04-23 08:59:56+0200]     Non-zero exit status: 1
[2022-04-23 08:59:56+0200] ../cpan/Compress-Raw-Zlib/t/02zlib.t........................FAILED
[2022-04-23 08:59:56+0200]     2, 126, 134
[2022-04-23 08:59:56+0200] ../cpan/Compress-Raw-Zlib/t/02zlib.t........................FAILED
[2022-04-23 08:59:56+0200]     Non-zero exit status: 3
[2022-04-23 08:59:56+0200] ../cpan/Compress-Raw-Zlib/t/18lvalue.t......................FAILED
[2022-04-23 08:59:56+0200]     2
[2022-04-23 08:59:56+0200] ../cpan/Compress-Raw-Zlib/t/18lvalue.t......................FAILED
[2022-04-23 08:59:56+0200]     Non-zero exit status: 1
[2022-04-23 08:59:56+0200] ../cpan/Compress-Raw-Zlib/t/19nonpv.t.......................FAILED
[2022-04-23 08:59:56+0200]     2
[2022-04-23 08:59:56+0200] ../cpan/Compress-Raw-Zlib/t/19nonpv.t.......................FAILED
[2022-04-23 08:59:56+0200]     Non-zero exit status: 1
[2022-04-23 08:59:56+0200] Archived results...
[2022-04-23 08:59:56+0200] TSTENV = locale:en_US.utf8	
makefile:258: warning: ignoring prerequisites on suffix rule definition
makefile:254: warning: ignoring prerequisites on suffix rule definition
makefile:258: warning: ignoring prerequisites on suffix rule definition
makefile:258: warning: ignoring prerequisites on suffix rule definition
makefile:254: warning: ignoring prerequisites on suffix rule definition
makefile:258: warning: ignoring prerequisites on suffix rule definition

#   Failed test 'ZLIB_VERSION (1.2.12) matches Compress::Zlib::zlib_version'
#   at t/cz-01version.t line 34.
#          got: '1.2.12'
#     expected: '1.2.11'
# 
# The version of zlib.h does not match the version of libz
# 
# You have zlib.h version 1.2.12
# 	 and libz   version 1.2.11
# 
# You probably have two versions of zlib installed on your system.
# Try removing the one you don't want to use and rebuild.
# Looks like you failed 1 test of 2.

#   Failed test 'ZLIB_VERSION matches Compress::Zlib::zlib_version'
#   at t/cz-03zlib-v1.t line 55.
#          got: '1.2.11'
#     expected: '1.2.12'

#   Failed test at t/cz-03zlib-v1.t line 706.
#          got: -3
#     expected: 1
# Looks like you failed 2 tests of 471.

#   Failed test 'ZLIB_VERSION matches Compress::Zlib::zlib_version'
#   at t/cz-06gzsetp.t line 48.
#          got: '1.2.11'
#     expected: '1.2.12'
# Looks like you failed 1 test of 51.

#   Failed test 'ZLIB_VERSION matches Compress::Zlib::zlib_version'
#   at t/cz-08encoding.t line 43.
#          got: '1.2.11'
#     expected: '1.2.12'
# Looks like you failed 1 test of 29.

#   Failed test 'ZLIB_VERSION matches Compress::Zlib::zlib_version'
#   at t/cz-14gzopen.t line 34.
#          got: '1.2.11'
#     expected: '1.2.12'
# Looks like you failed 1 test of 264.

#   Failed test 'ZLIB_VERSION (1.2.12) matches Compress::Raw::Zlib::zlib_version'
#   at t/01version.t line 34.
#          got: '1.2.12'
#     expected: '1.2.11'
# 
# The version of zlib.h does not match the version of libz
# 
# You have zlib.h version 1.2.12
#      and libz   version 1.2.11
# 
# You probably have two versions of zlib installed on your system.
# Try removing the one you don't want to use and rebuild.
# Looks like you failed 1 test of 2.

#   Failed test 'ZLIB_VERSION matches Compress::Raw::Zlib::zlib_version'
#   at t/02zlib.t line 56.
#          got: '1.2.11'
#     expected: '1.2.12'

#   Failed test at t/02zlib.t line 495.
#          got: -3
#     expected: 1

#   Failed test at t/02zlib.t line 529.
#          got: -3
#     expected: 1
# Looks like you failed 3 tests of 349.

#   Failed test 'ZLIB_VERSION matches Compress::Raw::Zlib::zlib_version'
#   at t/18lvalue.t line 44.
#          got: '1.2.11'
#     expected: '1.2.12'
# Looks like you failed 1 test of 10.

#   Failed test 'ZLIB_VERSION matches Compress::Raw::Zlib::zlib_version'
#   at t/19nonpv.t line 40.
#          got: '1.2.11'
#     expected: '1.2.12'
# Looks like you failed 1 test of 38.
Unable to flush stdout: Broken pipe
Subroutine Time::HiRes::constant redefined at (eval 37) line 1.
Subroutine Time::HiRes::usleep redefined at (eval 37) line 1.
Subroutine Time::HiRes::nanosleep redefined at (eval 37) line 1.
Subroutine Time::HiRes::sleep redefined at (eval 37) line 1.
Subroutine Time::HiRes::ualarm redefined at (eval 37) line 1.
Subroutine Time::HiRes::alarm redefined at (eval 37) line 1.
Subroutine Time::HiRes::gettimeofday redefined at (eval 37) line 1.
Subroutine Time::HiRes::time redefined at (eval 37) line 1.
Subroutine Time::HiRes::setitimer redefined at (eval 37) line 1.
Subroutine Time::HiRes::getitimer redefined at (eval 37) line 1.
Subroutine Time::HiRes::utime redefined at (eval 37) line 1.
Subroutine Time::HiRes::clock_gettime redefined at (eval 37) line 1.
Subroutine Time::HiRes::clock_getres redefined at (eval 37) line 1.
Subroutine Time::HiRes::clock_nanosleep redefined at (eval 37) line 1.
Subroutine Time::HiRes::clock redefined at (eval 37) line 1.
Subroutine Time::HiRes::lstat redefined at (eval 37) line 1.
Subroutine Time::HiRes::stat redefined at (eval 37) line 1.
make: *** [makefile:856: test_harness] Error 12

error while running harness target 'test_harness': 2 at /data/pro/3gl/CPAN/smoke/lib/Test/Smoke.pm line 194.
[2022-04-23 09:04:46+0200] 
[2022-04-23 09:04:46+0200] ../cpan/IO-Compress/t/cz-01version.t........................FAILED
[2022-04-23 09:04:46+0200]     2
[2022-04-23 09:04:46+0200] ../cpan/IO-Compress/t/cz-01version.t........................FAILED
[2022-04-23 09:04:46+0200]     Non-zero exit status: 1
[2022-04-23 09:04:46+0200] ../cpan/IO-Compress/t/cz-03zlib-v1.t........................FAILED
[2022-04-23 09:04:46+0200]     4, 196
[2022-04-23 09:04:46+0200] ../cpan/IO-Compress/t/cz-03zlib-v1.t........................FAILED
[2022-04-23 09:04:46+0200]     Non-zero exit status: 2
[2022-04-23 09:04:46+0200] ../cpan/IO-Compress/t/cz-06gzsetp.t.........................FAILED
[2022-04-23 09:04:46+0200]     1
[2022-04-23 09:04:46+0200] ../cpan/IO-Compress/t/cz-06gzsetp.t.........................FAILED
[2022-04-23 09:04:46+0200]     Non-zero exit status: 1
[2022-04-23 09:04:46+0200] ../cpan/IO-Compress/t/cz-08encoding.t.......................FAILED
[2022-04-23 09:04:46+0200]     2
[2022-04-23 09:04:46+0200] ../cpan/IO-Compress/t/cz-08encoding.t.......................FAILED
[2022-04-23 09:04:46+0200]     Non-zero exit status: 1
[2022-04-23 09:04:46+0200] ../cpan/IO-Compress/t/cz-14gzopen.t.........................FAILED
[2022-04-23 09:04:46+0200]     3
[2022-04-23 09:04:46+0200] ../cpan/IO-Compress/t/cz-14gzopen.t.........................FAILED
[2022-04-23 09:04:46+0200]     Non-zero exit status: 1
[2022-04-23 09:04:46+0200] ../cpan/Compress-Raw-Zlib/t/01version.t.....................FAILED
[2022-04-23 09:04:46+0200]     2
[2022-04-23 09:04:46+0200] ../cpan/Compress-Raw-Zlib/t/01version.t.....................FAILED
[2022-04-23 09:04:46+0200]     Non-zero exit status: 1
[2022-04-23 09:04:46+0200] ../cpan/Compress-Raw-Zlib/t/02zlib.t........................FAILED
[2022-04-23 09:04:46+0200]     2, 126, 134
[2022-04-23 09:04:46+0200] ../cpan/Compress-Raw-Zlib/t/02zlib.t........................FAILED
[2022-04-23 09:04:46+0200]     Non-zero exit status: 3
[2022-04-23 09:04:46+0200] ../cpan/Compress-Raw-Zlib/t/18lvalue.t......................FAILED
[2022-04-23 09:04:46+0200]     2
[2022-04-23 09:04:46+0200] ../cpan/Compress-Raw-Zlib/t/18lvalue.t......................FAILED
[2022-04-23 09:04:46+0200]     Non-zero exit status: 1
[2022-04-23 09:04:46+0200] ../cpan/Compress-Raw-Zlib/t/19nonpv.t.......................FAILED
[2022-04-23 09:04:46+0200]     2
[2022-04-23 09:04:46+0200] ../cpan/Compress-Raw-Zlib/t/19nonpv.t.......................FAILED
[2022-04-23 09:04:46+0200]     Non-zero exit status: 1
[2022-04-23 09:04:46+0200] Archived results...
[2022-04-23 09:04:46+0200] Unskip tests from '/pro/3gl/CPAN/smoke/p59.skip'
[2022-04-23 09:04:46+0200] 
[2022-04-23 09:04:46+0200] Configuration: -Dusedevel -Duseithreads
[2022-04-23 09:04:46+0200] ------------------------------------------------------------------------------
[2022-04-23 09:04:46+0200] make distclean ...
[2022-04-23 09:04:58+0200] 
[2022-04-23 09:04:58+0200] Copy Policy.sh ...
[2022-04-23 09:04:58+0200] 
[2022-04-23 09:04:58+0200] Configure ...
[2022-04-23 09:06:00+0200] 
[2022-04-23 09:06:00+0200] make ...
[2022-04-23 09:07:21+0200] Skip tests from '/pro/3gl/CPAN/smoke/p59.skip'
[2022-04-23 09:07:21+0200] 
[2022-04-23 09:07:21+0200]  Tests start here:
[2022-04-23 09:07:21+0200] TSTENV = stdio	
makefile:258: warning: ignoring prerequisites on suffix rule definition
makefile:254: warning: ignoring prerequisites on suffix rule definition
makefile:258: warning: ignoring prerequisites on suffix rule definition
makefile:258: warning: ignoring prerequisites on suffix rule definition
makefile:254: warning: ignoring prerequisites on suffix rule definition
makefile:258: warning: ignoring prerequisites on suffix rule definition
No saved state, selection will be empty

#   Failed test 'ZLIB_VERSION (1.2.12) matches Compress::Raw::Zlib::zlib_version'
#   at t/01version.t line 34.
#          got: '1.2.12'
#     expected: '1.2.11'
# 
# The version of zlib.h does not match the version of libz
# 
# You have zlib.h version 1.2.12
#      and libz   version 1.2.11
# 
# You probably have two versions of zlib installed on your system.
# Try removing the one you don't want to use and rebuild.
# Looks like you failed 1 test of 2.

#   Failed test 'ZLIB_VERSION matches Compress::Raw::Zlib::zlib_version'
#   at t/02zlib.t line 56.
#          got: '1.2.11'
#     expected: '1.2.12'

#   Failed test at t/02zlib.t line 495.
#          got: -3
#     expected: 1

#   Failed test at t/02zlib.t line 529.
#          got: -3
#     expected: 1
# Looks like you failed 3 tests of 349.

#   Failed test 'ZLIB_VERSION matches Compress::Raw::Zlib::zlib_version'
#   at t/18lvalue.t line 44.
#          got: '1.2.11'
#     expected: '1.2.12'
# Looks like you failed 1 test of 10.

#   Failed test 'ZLIB_VERSION matches Compress::Raw::Zlib::zlib_version'
#   at t/19nonpv.t line 40.
#          got: '1.2.11'
#     expected: '1.2.12'
# Looks like you failed 1 test of 38.

#   Failed test 'ZLIB_VERSION (1.2.12) matches Compress::Zlib::zlib_version'
#   at t/cz-01version.t line 34.
#          got: '1.2.12'
#     expected: '1.2.11'
# 
# The version of zlib.h does not match the version of libz
# 
# You have zlib.h version 1.2.12
# 	 and libz   version 1.2.11
# 
# You probably have two versions of zlib installed on your system.
# Try removing the one you don't want to use and rebuild.
# Looks like you failed 1 test of 2.

#   Failed test 'ZLIB_VERSION matches Compress::Zlib::zlib_version'
#   at t/cz-03zlib-v1.t line 55.
#          got: '1.2.11'
#     expected: '1.2.12'

#   Failed test at t/cz-03zlib-v1.t line 706.
#          got: -3
#     expected: 1
# Looks like you failed 2 tests of 471.

#   Failed test 'ZLIB_VERSION matches Compress::Zlib::zlib_version'
#   at t/cz-06gzsetp.t line 48.
#          got: '1.2.11'
#     expected: '1.2.12'
# Looks like you failed 1 test of 51.

#   Failed test 'ZLIB_VERSION matches Compress::Zlib::zlib_version'
#   at t/cz-08encoding.t line 43.
#          got: '1.2.11'
#     expected: '1.2.12'
# Looks like you failed 1 test of 29.

#   Failed test 'ZLIB_VERSION matches Compress::Zlib::zlib_version'
#   at t/cz-14gzopen.t line 34.
#          got: '1.2.11'
#     expected: '1.2.12'
# Looks like you failed 1 test of 264.
Subroutine Time::HiRes::constant redefined at (eval 37) line 1.
Subroutine Time::HiRes::usleep redefined at (eval 37) line 1.
Subroutine Time::HiRes::nanosleep redefined at (eval 37) line 1.
Subroutine Time::HiRes::sleep redefined at (eval 37) line 1.
Subroutine Time::HiRes::ualarm redefined at (eval 37) line 1.
Subroutine Time::HiRes::alarm redefined at (eval 37) line 1.
Subroutine Time::HiRes::gettimeofday redefined at (eval 37) line 1.
Subroutine Time::HiRes::time redefined at (eval 37) line 1.
Subroutine Time::HiRes::setitimer redefined at (eval 37) line 1.
Subroutine Time::HiRes::getitimer redefined at (eval 37) line 1.
Subroutine Time::HiRes::utime redefined at (eval 37) line 1.
Subroutine Time::HiRes::clock_gettime redefined at (eval 37) line 1.
Subroutine Time::HiRes::clock_getres redefined at (eval 37) line 1.
Subroutine Time::HiRes::clock_nanosleep redefined at (eval 37) line 1.
Subroutine Time::HiRes::clock redefined at (eval 37) line 1.
Subroutine Time::HiRes::lstat redefined at (eval 37) line 1.
Subroutine Time::HiRes::stat redefined at (eval 37) line 1.
No such file or directory
No such file or directory
No such file or directory
No such file or directory
No such file or directory
No such file or directory
No such file or directory
make: *** [makefile:856: test_harness] Error 12

error while running harness target 'test_harness': 2 at /data/pro/3gl/CPAN/smoke/lib/Test/Smoke.pm line 194.
[2022-04-23 09:12:16+0200] 
[2022-04-23 09:12:16+0200] ../cpan/Compress-Raw-Zlib/t/01version.t.....................FAILED
[2022-04-23 09:12:16+0200]     2
[2022-04-23 09:12:16+0200] ../cpan/Compress-Raw-Zlib/t/01version.t.....................FAILED
[2022-04-23 09:12:16+0200]     Non-zero exit status: 1
[2022-04-23 09:12:16+0200] ../cpan/Compress-Raw-Zlib/t/02zlib.t........................FAILED
[2022-04-23 09:12:16+0200]     2, 126, 134
[2022-04-23 09:12:16+0200] ../cpan/Compress-Raw-Zlib/t/02zlib.t........................FAILED
[2022-04-23 09:12:16+0200]     Non-zero exit status: 3
[2022-04-23 09:12:16+0200] ../cpan/Compress-Raw-Zlib/t/18lvalue.t......................FAILED
[2022-04-23 09:12:16+0200]     2
[2022-04-23 09:12:16+0200] ../cpan/Compress-Raw-Zlib/t/18lvalue.t......................FAILED
[2022-04-23 09:12:16+0200]     Non-zero exit status: 1
[2022-04-23 09:12:16+0200] ../cpan/Compress-Raw-Zlib/t/19nonpv.t.......................FAILED
[2022-04-23 09:12:16+0200]     2
[2022-04-23 09:12:16+0200] ../cpan/Compress-Raw-Zlib/t/19nonpv.t.......................FAILED
[2022-04-23 09:12:16+0200]     Non-zero exit status: 1
[2022-04-23 09:12:16+0200] ../cpan/IO-Compress/t/cz-01version.t........................FAILED
[2022-04-23 09:12:16+0200]     2
[2022-04-23 09:12:16+0200] ../cpan/IO-Compress/t/cz-01version.t........................FAILED
[2022-04-23 09:12:16+0200]     Non-zero exit status: 1
[2022-04-23 09:12:16+0200] ../cpan/IO-Compress/t/cz-03zlib-v1.t........................FAILED
[2022-04-23 09:12:16+0200]     4, 196
[2022-04-23 09:12:16+0200] ../cpan/IO-Compress/t/cz-03zlib-v1.t........................FAILED
[2022-04-23 09:12:16+0200]     Non-zero exit status: 2
[2022-04-23 09:12:16+0200] ../cpan/IO-Compress/t/cz-06gzsetp.t.........................FAILED
[2022-04-23 09:12:16+0200]     1
[2022-04-23 09:12:16+0200] ../cpan/IO-Compress/t/cz-06gzsetp.t.........................FAILED
[2022-04-23 09:12:16+0200]     Non-zero exit status: 1
[2022-04-23 09:12:16+0200] ../cpan/IO-Compress/t/cz-08encoding.t.......................FAILED
[2022-04-23 09:12:16+0200]     2
[2022-04-23 09:12:16+0200] ../cpan/IO-Compress/t/cz-08encoding.t.......................FAILED
[2022-04-23 09:12:16+0200]     Non-zero exit status: 1
[2022-04-23 09:12:16+0200] ../cpan/IO-Compress/t/cz-14gzopen.t.........................FAILED
[2022-04-23 09:12:16+0200]     3
[2022-04-23 09:12:16+0200] ../cpan/IO-Compress/t/cz-14gzopen.t.........................FAILED
[2022-04-23 09:12:16+0200]     Non-zero exit status: 1
[2022-04-23 09:12:16+0200] Archived results...
[2022-04-23 09:12:16+0200] TSTENV = perlio	
makefile:258: warning: ignoring prerequisites on suffix rule definition
makefile:254: warning: ignoring prerequisites on suffix rule definition
makefile:258: warning: ignoring prerequisites on suffix rule definition
makefile:258: warning: ignoring prerequisites on suffix rule definition
makefile:254: warning: ignoring prerequisites on suffix rule definition
makefile:258: warning: ignoring prerequisites on suffix rule definition

#   Failed test 'ZLIB_VERSION (1.2.12) matches Compress::Zlib::zlib_version'
#   at t/cz-01version.t line 34.
#          got: '1.2.12'
#     expected: '1.2.11'
# 
# The version of zlib.h does not match the version of libz
# 
# You have zlib.h version 1.2.12
# 	 and libz   version 1.2.11
# 
# You probably have two versions of zlib installed on your system.
# Try removing the one you don't want to use and rebuild.
# Looks like you failed 1 test of 2.

#   Failed test 'ZLIB_VERSION matches Compress::Zlib::zlib_version'
#   at t/cz-03zlib-v1.t line 55.
#          got: '1.2.11'
#     expected: '1.2.12'

#   Failed test at t/cz-03zlib-v1.t line 706.
#          got: -3
#     expected: 1
# Looks like you failed 2 tests of 471.

#   Failed test 'ZLIB_VERSION matches Compress::Zlib::zlib_version'
#   at t/cz-06gzsetp.t line 48.
#          got: '1.2.11'
#     expected: '1.2.12'
# Looks like you failed 1 test of 51.

#   Failed test 'ZLIB_VERSION matches Compress::Zlib::zlib_version'
#   at t/cz-08encoding.t line 43.
#          got: '1.2.11'
#     expected: '1.2.12'
# Looks like you failed 1 test of 29.

#   Failed test 'ZLIB_VERSION matches Compress::Zlib::zlib_version'
#   at t/cz-14gzopen.t line 34.
#          got: '1.2.11'
#     expected: '1.2.12'
# Looks like you failed 1 test of 264.

#   Failed test 'ZLIB_VERSION (1.2.12) matches Compress::Raw::Zlib::zlib_version'
#   at t/01version.t line 34.
#          got: '1.2.12'
#     expected: '1.2.11'
# 
# The version of zlib.h does not match the version of libz
# 
# You have zlib.h version 1.2.12
#      and libz   version 1.2.11
# 
# You probably have two versions of zlib installed on your system.
# Try removing the one you don't want to use and rebuild.
# Looks like you failed 1 test of 2.

#   Failed test 'ZLIB_VERSION matches Compress::Raw::Zlib::zlib_version'
#   at t/02zlib.t line 56.
#          got: '1.2.11'
#     expected: '1.2.12'

#   Failed test at t/02zlib.t line 495.
#          got: -3
#     expected: 1

#   Failed test at t/02zlib.t line 529.
#          got: -3
#     expected: 1
# Looks like you failed 3 tests of 349.

#   Failed test 'ZLIB_VERSION matches Compress::Raw::Zlib::zlib_version'
#   at t/18lvalue.t line 44.
#          got: '1.2.11'
#     expected: '1.2.12'
# Looks like you failed 1 test of 10.

#   Failed test 'ZLIB_VERSION matches Compress::Raw::Zlib::zlib_version'
#   at t/19nonpv.t line 40.
#          got: '1.2.11'
#     expected: '1.2.12'
# Looks like you failed 1 test of 38.
Subroutine Time::HiRes::constant redefined at (eval 37) line 1.
Subroutine Time::HiRes::usleep redefined at (eval 37) line 1.
Subroutine Time::HiRes::nanosleep redefined at (eval 37) line 1.
Subroutine Time::HiRes::sleep redefined at (eval 37) line 1.
Subroutine Time::HiRes::ualarm redefined at (eval 37) line 1.
Subroutine Time::HiRes::alarm redefined at (eval 37) line 1.
Subroutine Time::HiRes::gettimeofday redefined at (eval 37) line 1.
Subroutine Time::HiRes::time redefined at (eval 37) line 1.
Subroutine Time::HiRes::setitimer redefined at (eval 37) line 1.
Subroutine Time::HiRes::getitimer redefined at (eval 37) line 1.
Subroutine Time::HiRes::utime redefined at (eval 37) line 1.
Subroutine Time::HiRes::clock_gettime redefined at (eval 37) line 1.
Subroutine Time::HiRes::clock_getres redefined at (eval 37) line 1.
Subroutine Time::HiRes::clock_nanosleep redefined at (eval 37) line 1.
Subroutine Time::HiRes::clock redefined at (eval 37) line 1.
Subroutine Time::HiRes::lstat redefined at (eval 37) line 1.
Subroutine Time::HiRes::stat redefined at (eval 37) line 1.
make: *** [makefile:856: test_harness] Error 12

error while running harness target 'test_harness': 2 at /data/pro/3gl/CPAN/smoke/lib/Test/Smoke.pm line 194.
[2022-04-23 09:16:52+0200] 
[2022-04-23 09:16:52+0200] ../cpan/IO-Compress/t/cz-01version.t........................FAILED
[2022-04-23 09:16:52+0200]     2
[2022-04-23 09:16:52+0200] ../cpan/IO-Compress/t/cz-01version.t........................FAILED
[2022-04-23 09:16:52+0200]     Non-zero exit status: 1
[2022-04-23 09:16:52+0200] ../cpan/IO-Compress/t/cz-03zlib-v1.t........................FAILED
[2022-04-23 09:16:52+0200]     4, 196
[2022-04-23 09:16:52+0200] ../cpan/IO-Compress/t/cz-03zlib-v1.t........................FAILED
[2022-04-23 09:16:52+0200]     Non-zero exit status: 2
[2022-04-23 09:16:52+0200] ../cpan/IO-Compress/t/cz-06gzsetp.t.........................FAILED
[2022-04-23 09:16:52+0200]     1
[2022-04-23 09:16:52+0200] ../cpan/IO-Compress/t/cz-06gzsetp.t.........................FAILED
[2022-04-23 09:16:52+0200]     Non-zero exit status: 1
[2022-04-23 09:16:52+0200] ../cpan/IO-Compress/t/cz-08encoding.t.......................FAILED
[2022-04-23 09:16:52+0200]     2
[2022-04-23 09:16:52+0200] ../cpan/IO-Compress/t/cz-08encoding.t.......................FAILED
[2022-04-23 09:16:52+0200]     Non-zero exit status: 1
[2022-04-23 09:16:52+0200] ../cpan/IO-Compress/t/cz-14gzopen.t.........................FAILED
[2022-04-23 09:16:52+0200]     3
[2022-04-23 09:16:52+0200] ../cpan/IO-Compress/t/cz-14gzopen.t.........................FAILED
[2022-04-23 09:16:52+0200]     Non-zero exit status: 1
[2022-04-23 09:16:52+0200] ../cpan/Compress-Raw-Zlib/t/01version.t.....................FAILED
[2022-04-23 09:16:52+0200]     2
[2022-04-23 09:16:52+0200] ../cpan/Compress-Raw-Zlib/t/01version.t.....................FAILED
[2022-04-23 09:16:52+0200]     Non-zero exit status: 1
[2022-04-23 09:16:52+0200] ../cpan/Compress-Raw-Zlib/t/02zlib.t........................FAILED
[2022-04-23 09:16:52+0200]     2, 126, 134
[2022-04-23 09:16:52+0200] ../cpan/Compress-Raw-Zlib/t/02zlib.t........................FAILED
[2022-04-23 09:16:52+0200]     Non-zero exit status: 3
[2022-04-23 09:16:52+0200] ../cpan/Compress-Raw-Zlib/t/18lvalue.t......................FAILED
[2022-04-23 09:16:52+0200]     2
[2022-04-23 09:16:52+0200] ../cpan/Compress-Raw-Zlib/t/18lvalue.t......................FAILED
[2022-04-23 09:16:52+0200]     Non-zero exit status: 1
[2022-04-23 09:16:52+0200] ../cpan/Compress-Raw-Zlib/t/19nonpv.t.......................FAILED
[2022-04-23 09:16:52+0200]     2
[2022-04-23 09:16:52+0200] ../cpan/Compress-Raw-Zlib/t/19nonpv.t.......................FAILED
[2022-04-23 09:16:52+0200]     Non-zero exit status: 1
[2022-04-23 09:16:52+0200] Archived results...
[2022-04-23 09:16:52+0200] TSTENV = locale:en_US.utf8	
makefile:258: warning: ignoring prerequisites on suffix rule definition
makefile:254: warning: ignoring prerequisites on suffix rule definition
makefile:258: warning: ignoring prerequisites on suffix rule definition
makefile:258: warning: ignoring prerequisites on suffix rule definition
makefile:254: warning: ignoring prerequisites on suffix rule definition
makefile:258: warning: ignoring prerequisites on suffix rule definition

#   Failed test 'ZLIB_VERSION (1.2.12) matches Compress::Zlib::zlib_version'
#   at t/cz-01version.t line 34.
#          got: '1.2.12'
#     expected: '1.2.11'
# 
# The version of zlib.h does not match the version of libz
# 
# You have zlib.h version 1.2.12
# 	 and libz   version 1.2.11
# 
# You probably have two versions of zlib installed on your system.
# Try removing the one you don't want to use and rebuild.
# Looks like you failed 1 test of 2.

#   Failed test 'ZLIB_VERSION matches Compress::Zlib::zlib_version'
#   at t/cz-03zlib-v1.t line 55.
#          got: '1.2.11'
#     expected: '1.2.12'

#   Failed test at t/cz-03zlib-v1.t line 706.
#          got: -3
#     expected: 1
# Looks like you failed 2 tests of 471.

#   Failed test 'ZLIB_VERSION matches Compress::Zlib::zlib_version'
#   at t/cz-06gzsetp.t line 48.
#          got: '1.2.11'
#     expected: '1.2.12'
# Looks like you failed 1 test of 51.

#   Failed test 'ZLIB_VERSION matches Compress::Zlib::zlib_version'
#   at t/cz-08encoding.t line 43.
#          got: '1.2.11'
#     expected: '1.2.12'
# Looks like you failed 1 test of 29.

#   Failed test 'ZLIB_VERSION matches Compress::Zlib::zlib_version'
#   at t/cz-14gzopen.t line 34.
#          got: '1.2.11'
#     expected: '1.2.12'
# Looks like you failed 1 test of 264.

#   Failed test 'ZLIB_VERSION (1.2.12) matches Compress::Raw::Zlib::zlib_version'
#   at t/01version.t line 34.
#          got: '1.2.12'
#     expected: '1.2.11'
# 
# The version of zlib.h does not match the version of libz
# 
# You have zlib.h version 1.2.12
#      and libz   version 1.2.11
# 
# You probably have two versions of zlib installed on your system.
# Try removing the one you don't want to use and rebuild.
# Looks like you failed 1 test of 2.

#   Failed test 'ZLIB_VERSION matches Compress::Raw::Zlib::zlib_version'
#   at t/02zlib.t line 56.
#          got: '1.2.11'
#     expected: '1.2.12'

#   Failed test at t/02zlib.t line 495.
#          got: -3
#     expected: 1

#   Failed test at t/02zlib.t line 529.
#          got: -3
#     expected: 1
# Looks like you failed 3 tests of 349.

#   Failed test 'ZLIB_VERSION matches Compress::Raw::Zlib::zlib_version'
#   at t/18lvalue.t line 44.
#          got: '1.2.11'
#     expected: '1.2.12'
# Looks like you failed 1 test of 10.

#   Failed test 'ZLIB_VERSION matches Compress::Raw::Zlib::zlib_version'
#   at t/19nonpv.t line 40.
#          got: '1.2.11'
#     expected: '1.2.12'
# Looks like you failed 1 test of 38.
Subroutine Time::HiRes::constant redefined at (eval 37) line 1.
Subroutine Time::HiRes::usleep redefined at (eval 37) line 1.
Subroutine Time::HiRes::nanosleep redefined at (eval 37) line 1.
Subroutine Time::HiRes::sleep redefined at (eval 37) line 1.
Subroutine Time::HiRes::ualarm redefined at (eval 37) line 1.
Subroutine Time::HiRes::alarm redefined at (eval 37) line 1.
Subroutine Time::HiRes::gettimeofday redefined at (eval 37) line 1.
Subroutine Time::HiRes::time redefined at (eval 37) line 1.
Subroutine Time::HiRes::setitimer redefined at (eval 37) line 1.
Subroutine Time::HiRes::getitimer redefined at (eval 37) line 1.
Subroutine Time::HiRes::utime redefined at (eval 37) line 1.
Subroutine Time::HiRes::clock_gettime redefined at (eval 37) line 1.
Subroutine Time::HiRes::clock_getres redefined at (eval 37) line 1.
Subroutine Time::HiRes::clock_nanosleep redefined at (eval 37) line 1.
Subroutine Time::HiRes::clock redefined at (eval 37) line 1.
Subroutine Time::HiRes::lstat redefined at (eval 37) line 1.
Subroutine Time::HiRes::stat redefined at (eval 37) line 1.
make: *** [makefile:856: test_harness] Error 12

error while running harness target 'test_harness': 2 at /data/pro/3gl/CPAN/smoke/lib/Test/Smoke.pm line 194.
[2022-04-23 09:21:26+0200] 
[2022-04-23 09:21:26+0200] ../cpan/IO-Compress/t/cz-01version.t........................FAILED
[2022-04-23 09:21:26+0200]     2
[2022-04-23 09:21:26+0200] ../cpan/IO-Compress/t/cz-01version.t........................FAILED
[2022-04-23 09:21:26+0200]     Non-zero exit status: 1
[2022-04-23 09:21:26+0200] ../cpan/IO-Compress/t/cz-03zlib-v1.t........................FAILED
[2022-04-23 09:21:26+0200]     4, 196
[2022-04-23 09:21:26+0200] ../cpan/IO-Compress/t/cz-03zlib-v1.t........................FAILED
[2022-04-23 09:21:26+0200]     Non-zero exit status: 2
[2022-04-23 09:21:26+0200] ../cpan/IO-Compress/t/cz-06gzsetp.t.........................FAILED
[2022-04-23 09:21:26+0200]     1
[2022-04-23 09:21:26+0200] ../cpan/IO-Compress/t/cz-06gzsetp.t.........................FAILED
[2022-04-23 09:21:26+0200]     Non-zero exit status: 1
[2022-04-23 09:21:26+0200] ../cpan/IO-Compress/t/cz-08encoding.t.......................FAILED
[2022-04-23 09:21:26+0200]     2
[2022-04-23 09:21:26+0200] ../cpan/IO-Compress/t/cz-08encoding.t.......................FAILED
[2022-04-23 09:21:26+0200]     Non-zero exit status: 1
[2022-04-23 09:21:26+0200] ../cpan/IO-Compress/t/cz-14gzopen.t.........................FAILED
[2022-04-23 09:21:26+0200]     3
[2022-04-23 09:21:26+0200] ../cpan/IO-Compress/t/cz-14gzopen.t.........................FAILED
[2022-04-23 09:21:26+0200]     Non-zero exit status: 1
[2022-04-23 09:21:26+0200] ../cpan/Compress-Raw-Zlib/t/01version.t.....................FAILED
[2022-04-23 09:21:26+0200]     2
[2022-04-23 09:21:26+0200] ../cpan/Compress-Raw-Zlib/t/01version.t.....................FAILED
[2022-04-23 09:21:26+0200]     Non-zero exit status: 1
[2022-04-23 09:21:26+0200] ../cpan/Compress-Raw-Zlib/t/02zlib.t........................FAILED
[2022-04-23 09:21:26+0200]     2, 126, 134
[2022-04-23 09:21:26+0200] ../cpan/Compress-Raw-Zlib/t/02zlib.t........................FAILED
[2022-04-23 09:21:26+0200]     Non-zero exit status: 3
[2022-04-23 09:21:26+0200] ../cpan/Compress-Raw-Zlib/t/18lvalue.t......................FAILED
[2022-04-23 09:21:26+0200]     2
[2022-04-23 09:21:26+0200] ../cpan/Compress-Raw-Zlib/t/18lvalue.t......................FAILED
[2022-04-23 09:21:26+0200]     Non-zero exit status: 1
[2022-04-23 09:21:26+0200] ../cpan/Compress-Raw-Zlib/t/19nonpv.t.......................FAILED
[2022-04-23 09:21:26+0200]     2
[2022-04-23 09:21:26+0200] ../cpan/Compress-Raw-Zlib/t/19nonpv.t.......................FAILED
[2022-04-23 09:21:26+0200]     Non-zero exit status: 1
[2022-04-23 09:21:26+0200] Archived results...
[2022-04-23 09:21:26+0200] Unskip tests from '/pro/3gl/CPAN/smoke/p59.skip'
[2022-04-23 09:21:26+0200] 
[2022-04-23 09:21:26+0200] Configuration: -Dusedevel -Duseithreads -DDEBUGGING
[2022-04-23 09:21:26+0200] ------------------------------------------------------------------------------
[2022-04-23 09:21:26+0200] make distclean ...
[2022-04-23 09:21:38+0200] 
[2022-04-23 09:21:38+0200] Copy Policy.sh ...
[2022-04-23 09:21:38+0200] 
[2022-04-23 09:21:38+0200] Configure ...
[2022-04-23 09:22:40+0200] 
[2022-04-23 09:22:40+0200] make ...
[2022-04-23 09:24:40+0200] Skip tests from '/pro/3gl/CPAN/smoke/p59.skip'
[2022-04-23 09:24:40+0200] 
[2022-04-23 09:24:40+0200]  Tests start here:
[2022-04-23 09:24:40+0200] TSTENV = stdio	
makefile:258: warning: ignoring prerequisites on suffix rule definition
makefile:254: warning: ignoring prerequisites on suffix rule definition
makefile:258: warning: ignoring prerequisites on suffix rule definition
makefile:258: warning: ignoring prerequisites on suffix rule definition
makefile:254: warning: ignoring prerequisites on suffix rule definition
makefile:258: warning: ignoring prerequisites on suffix rule definition
No saved state, selection will be empty

#   Failed test 'ZLIB_VERSION (1.2.12) matches Compress::Raw::Zlib::zlib_version'
#   at t/01version.t line 34.
#          got: '1.2.12'
#     expected: '1.2.11'
# 
# The version of zlib.h does not match the version of libz
# 
# You have zlib.h version 1.2.12
#      and libz   version 1.2.11
# 
# You probably have two versions of zlib installed on your system.
# Try removing the one you don't want to use and rebuild.
# Looks like you failed 1 test of 2.

#   Failed test 'ZLIB_VERSION matches Compress::Raw::Zlib::zlib_version'
#   at t/02zlib.t line 56.
#          got: '1.2.11'
#     expected: '1.2.12'

#   Failed test at t/02zlib.t line 495.
#          got: -3
#     expected: 1

#   Failed test at t/02zlib.t line 529.
#          got: -3
#     expected: 1
# Looks like you failed 3 tests of 349.

#   Failed test 'ZLIB_VERSION matches Compress::Raw::Zlib::zlib_version'
#   at t/18lvalue.t line 44.
#          got: '1.2.11'
#     expected: '1.2.12'
# Looks like you failed 1 test of 10.

#   Failed test 'ZLIB_VERSION matches Compress::Raw::Zlib::zlib_version'
#   at t/19nonpv.t line 40.
#          got: '1.2.11'
#     expected: '1.2.12'
# Looks like you failed 1 test of 38.

#   Failed test 'ZLIB_VERSION (1.2.12) matches Compress::Zlib::zlib_version'
#   at t/cz-01version.t line 34.
#          got: '1.2.12'
#     expected: '1.2.11'
# 
# The version of zlib.h does not match the version of libz
# 
# You have zlib.h version 1.2.12
# 	 and libz   version 1.2.11
# 
# You probably have two versions of zlib installed on your system.
# Try removing the one you don't want to use and rebuild.
# Looks like you failed 1 test of 2.

#   Failed test 'ZLIB_VERSION matches Compress::Zlib::zlib_version'
#   at t/cz-03zlib-v1.t line 55.
#          got: '1.2.11'
#     expected: '1.2.12'

#   Failed test at t/cz-03zlib-v1.t line 706.
#          got: -3
#     expected: 1
# Looks like you failed 2 tests of 471.

#   Failed test 'ZLIB_VERSION matches Compress::Zlib::zlib_version'
#   at t/cz-06gzsetp.t line 48.
#          got: '1.2.11'
#     expected: '1.2.12'
# Looks like you failed 1 test of 51.

#   Failed test 'ZLIB_VERSION matches Compress::Zlib::zlib_version'
#   at t/cz-08encoding.t line 43.
#          got: '1.2.11'
#     expected: '1.2.12'
# Looks like you failed 1 test of 29.

#   Failed test 'ZLIB_VERSION matches Compress::Zlib::zlib_version'
#   at t/cz-14gzopen.t line 34.
#          got: '1.2.11'
#     expected: '1.2.12'
# Looks like you failed 1 test of 264.
Subroutine Time::HiRes::constant redefined at (eval 37) line 1.
Subroutine Time::HiRes::usleep redefined at (eval 37) line 1.
Subroutine Time::HiRes::nanosleep redefined at (eval 37) line 1.
Subroutine Time::HiRes::sleep redefined at (eval 37) line 1.
Subroutine Time::HiRes::ualarm redefined at (eval 37) line 1.
Subroutine Time::HiRes::alarm redefined at (eval 37) line 1.
Subroutine Time::HiRes::gettimeofday redefined at (eval 37) line 1.
Subroutine Time::HiRes::time redefined at (eval 37) line 1.
Subroutine Time::HiRes::setitimer redefined at (eval 37) line 1.
Subroutine Time::HiRes::getitimer redefined at (eval 37) line 1.
Subroutine Time::HiRes::utime redefined at (eval 37) line 1.
Subroutine Time::HiRes::clock_gettime redefined at (eval 37) line 1.
Subroutine Time::HiRes::clock_getres redefined at (eval 37) line 1.
Subroutine Time::HiRes::clock_nanosleep redefined at (eval 37) line 1.
Subroutine Time::HiRes::clock redefined at (eval 37) line 1.
Subroutine Time::HiRes::lstat redefined at (eval 37) line 1.
Subroutine Time::HiRes::stat redefined at (eval 37) line 1.
No such file or directory
No such file or directory
No such file or directory
No such file or directory
No such file or directory
No such file or directory
No such file or directory
make: *** [makefile:856: test_harness] Error 12

error while running harness target 'test_harness': 2 at /data/pro/3gl/CPAN/smoke/lib/Test/Smoke.pm line 194.
[2022-04-23 09:30:17+0200] 
[2022-04-23 09:30:17+0200] ../cpan/Compress-Raw-Zlib/t/01version.t.....................FAILED
[2022-04-23 09:30:17+0200]     2
[2022-04-23 09:30:17+0200] ../cpan/Compress-Raw-Zlib/t/01version.t.....................FAILED
[2022-04-23 09:30:17+0200]     Non-zero exit status: 1
[2022-04-23 09:30:17+0200] ../cpan/Compress-Raw-Zlib/t/02zlib.t........................FAILED
[2022-04-23 09:30:17+0200]     2, 126, 134
[2022-04-23 09:30:17+0200] ../cpan/Compress-Raw-Zlib/t/02zlib.t........................FAILED
[2022-04-23 09:30:17+0200]     Non-zero exit status: 3
[2022-04-23 09:30:17+0200] ../cpan/Compress-Raw-Zlib/t/18lvalue.t......................FAILED
[2022-04-23 09:30:17+0200]     2
[2022-04-23 09:30:17+0200] ../cpan/Compress-Raw-Zlib/t/18lvalue.t......................FAILED
[2022-04-23 09:30:17+0200]     Non-zero exit status: 1
[2022-04-23 09:30:17+0200] ../cpan/Compress-Raw-Zlib/t/19nonpv.t.......................FAILED
[2022-04-23 09:30:17+0200]     2
[2022-04-23 09:30:17+0200] ../cpan/Compress-Raw-Zlib/t/19nonpv.t.......................FAILED
[2022-04-23 09:30:17+0200]     Non-zero exit status: 1
[2022-04-23 09:30:17+0200] ../cpan/IO-Compress/t/cz-01version.t........................FAILED
[2022-04-23 09:30:17+0200]     2
[2022-04-23 09:30:17+0200] ../cpan/IO-Compress/t/cz-01version.t........................FAILED
[2022-04-23 09:30:17+0200]     Non-zero exit status: 1
[2022-04-23 09:30:17+0200] ../cpan/IO-Compress/t/cz-03zlib-v1.t........................FAILED
[2022-04-23 09:30:17+0200]     4, 196
[2022-04-23 09:30:17+0200] ../cpan/IO-Compress/t/cz-03zlib-v1.t........................FAILED
[2022-04-23 09:30:17+0200]     Non-zero exit status: 2
[2022-04-23 09:30:17+0200] ../cpan/IO-Compress/t/cz-06gzsetp.t.........................FAILED
[2022-04-23 09:30:17+0200]     1
[2022-04-23 09:30:17+0200] ../cpan/IO-Compress/t/cz-06gzsetp.t.........................FAILED
[2022-04-23 09:30:17+0200]     Non-zero exit status: 1
[2022-04-23 09:30:17+0200] ../cpan/IO-Compress/t/cz-08encoding.t.......................FAILED
[2022-04-23 09:30:17+0200]     2
[2022-04-23 09:30:17+0200] ../cpan/IO-Compress/t/cz-08encoding.t.......................FAILED
[2022-04-23 09:30:17+0200]     Non-zero exit status: 1
[2022-04-23 09:30:17+0200] ../cpan/IO-Compress/t/cz-14gzopen.t.........................FAILED
[2022-04-23 09:30:17+0200]     3
[2022-04-23 09:30:17+0200] ../cpan/IO-Compress/t/cz-14gzopen.t.........................FAILED
[2022-04-23 09:30:17+0200]     Non-zero exit status: 1
[2022-04-23 09:30:17+0200] Archived results...
[2022-04-23 09:30:17+0200] TSTENV = perlio	
makefile:258: warning: ignoring prerequisites on suffix rule definition
makefile:254: warning: ignoring prerequisites on suffix rule definition
makefile:258: warning: ignoring prerequisites on suffix rule definition
makefile:258: warning: ignoring prerequisites on suffix rule definition
makefile:254: warning: ignoring prerequisites on suffix rule definition
makefile:258: warning: ignoring prerequisites on suffix rule definition

#   Failed test 'ZLIB_VERSION (1.2.12) matches Compress::Zlib::zlib_version'
#   at t/cz-01version.t line 34.
#          got: '1.2.12'
#     expected: '1.2.11'
# 
# The version of zlib.h does not match the version of libz
# 
# You have zlib.h version 1.2.12
# 	 and libz   version 1.2.11
# 
# You probably have two versions of zlib installed on your system.
# Try removing the one you don't want to use and rebuild.
# Looks like you failed 1 test of 2.

#   Failed test 'ZLIB_VERSION matches Compress::Zlib::zlib_version'
#   at t/cz-03zlib-v1.t line 55.
#          got: '1.2.11'
#     expected: '1.2.12'

#   Failed test at t/cz-03zlib-v1.t line 706.
#          got: -3
#     expected: 1
# Looks like you failed 2 tests of 471.

#   Failed test 'ZLIB_VERSION matches Compress::Zlib::zlib_version'
#   at t/cz-06gzsetp.t line 48.
#          got: '1.2.11'
#     expected: '1.2.12'
# Looks like you failed 1 test of 51.

#   Failed test 'ZLIB_VERSION matches Compress::Zlib::zlib_version'
#   at t/cz-08encoding.t line 43.
#          got: '1.2.11'
#     expected: '1.2.12'
# Looks like you failed 1 test of 29.

#   Failed test 'ZLIB_VERSION matches Compress::Zlib::zlib_version'
#   at t/cz-14gzopen.t line 34.
#          got: '1.2.11'
#     expected: '1.2.12'
# Looks like you failed 1 test of 264.

#   Failed test 'ZLIB_VERSION (1.2.12) matches Compress::Raw::Zlib::zlib_version'
#   at t/01version.t line 34.
#          got: '1.2.12'
#     expected: '1.2.11'
# 
# The version of zlib.h does not match the version of libz
# 
# You have zlib.h version 1.2.12
#      and libz   version 1.2.11
# 
# You probably have two versions of zlib installed on your system.
# Try removing the one you don't want to use and rebuild.
# Looks like you failed 1 test of 2.

#   Failed test 'ZLIB_VERSION matches Compress::Raw::Zlib::zlib_version'
#   at t/02zlib.t line 56.
#          got: '1.2.11'
#     expected: '1.2.12'

#   Failed test at t/02zlib.t line 495.
#          got: -3
#     expected: 1

#   Failed test at t/02zlib.t line 529.
#          got: -3
#     expected: 1
# Looks like you failed 3 tests of 349.

#   Failed test 'ZLIB_VERSION matches Compress::Raw::Zlib::zlib_version'
#   at t/18lvalue.t line 44.
#          got: '1.2.11'
#     expected: '1.2.12'
# Looks like you failed 1 test of 10.

#   Failed test 'ZLIB_VERSION matches Compress::Raw::Zlib::zlib_version'
#   at t/19nonpv.t line 40.
#          got: '1.2.11'
#     expected: '1.2.12'
# Looks like you failed 1 test of 38.
Unable to flush stdout: Broken pipe
Subroutine Time::HiRes::constant redefined at (eval 37) line 1.
Subroutine Time::HiRes::usleep redefined at (eval 37) line 1.
Subroutine Time::HiRes::nanosleep redefined at (eval 37) line 1.
Subroutine Time::HiRes::sleep redefined at (eval 37) line 1.
Subroutine Time::HiRes::ualarm redefined at (eval 37) line 1.
Subroutine Time::HiRes::alarm redefined at (eval 37) line 1.
Subroutine Time::HiRes::gettimeofday redefined at (eval 37) line 1.
Subroutine Time::HiRes::time redefined at (eval 37) line 1.
Subroutine Time::HiRes::setitimer redefined at (eval 37) line 1.
Subroutine Time::HiRes::getitimer redefined at (eval 37) line 1.
Subroutine Time::HiRes::utime redefined at (eval 37) line 1.
Subroutine Time::HiRes::clock_gettime redefined at (eval 37) line 1.
Subroutine Time::HiRes::clock_getres redefined at (eval 37) line 1.
Subroutine Time::HiRes::clock_nanosleep redefined at (eval 37) line 1.
Subroutine Time::HiRes::clock redefined at (eval 37) line 1.
Subroutine Time::HiRes::lstat redefined at (eval 37) line 1.
Subroutine Time::HiRes::stat redefined at (eval 37) line 1.
make: *** [makefile:856: test_harness] Error 12

error while running harness target 'test_harness': 2 at /data/pro/3gl/CPAN/smoke/lib/Test/Smoke.pm line 194.
[2022-04-23 09:35:42+0200] 
[2022-04-23 09:35:42+0200] ../cpan/IO-Compress/t/cz-01version.t........................FAILED
[2022-04-23 09:35:42+0200]     2
[2022-04-23 09:35:42+0200] ../cpan/IO-Compress/t/cz-01version.t........................FAILED
[2022-04-23 09:35:42+0200]     Non-zero exit status: 1
[2022-04-23 09:35:42+0200] ../cpan/IO-Compress/t/cz-03zlib-v1.t........................FAILED
[2022-04-23 09:35:42+0200]     4, 196
[2022-04-23 09:35:42+0200] ../cpan/IO-Compress/t/cz-03zlib-v1.t........................FAILED
[2022-04-23 09:35:42+0200]     Non-zero exit status: 2
[2022-04-23 09:35:42+0200] ../cpan/IO-Compress/t/cz-06gzsetp.t.........................FAILED
[2022-04-23 09:35:42+0200]     1
[2022-04-23 09:35:42+0200] ../cpan/IO-Compress/t/cz-06gzsetp.t.........................FAILED
[2022-04-23 09:35:42+0200]     Non-zero exit status: 1
[2022-04-23 09:35:42+0200] ../cpan/IO-Compress/t/cz-08encoding.t.......................FAILED
[2022-04-23 09:35:42+0200]     2
[2022-04-23 09:35:42+0200] ../cpan/IO-Compress/t/cz-08encoding.t.......................FAILED
[2022-04-23 09:35:42+0200]     Non-zero exit status: 1
[2022-04-23 09:35:42+0200] ../cpan/IO-Compress/t/cz-14gzopen.t.........................FAILED
[2022-04-23 09:35:42+0200]     3
[2022-04-23 09:35:42+0200] ../cpan/IO-Compress/t/cz-14gzopen.t.........................FAILED
[2022-04-23 09:35:42+0200]     Non-zero exit status: 1
[2022-04-23 09:35:42+0200] ../cpan/Compress-Raw-Zlib/t/01version.t.....................FAILED
[2022-04-23 09:35:42+0200]     2
[2022-04-23 09:35:42+0200] ../cpan/Compress-Raw-Zlib/t/01version.t.....................FAILED
[2022-04-23 09:35:42+0200]     Non-zero exit status: 1
[2022-04-23 09:35:42+0200] ../cpan/Compress-Raw-Zlib/t/02zlib.t........................FAILED
[2022-04-23 09:35:42+0200]     2, 126, 134
[2022-04-23 09:35:42+0200] ../cpan/Compress-Raw-Zlib/t/02zlib.t........................FAILED
[2022-04-23 09:35:42+0200]     Non-zero exit status: 3
[2022-04-23 09:35:42+0200] ../cpan/Compress-Raw-Zlib/t/18lvalue.t......................FAILED
[2022-04-23 09:35:42+0200]     2
[2022-04-23 09:35:42+0200] ../cpan/Compress-Raw-Zlib/t/18lvalue.t......................FAILED
[2022-04-23 09:35:42+0200]     Non-zero exit status: 1
[2022-04-23 09:35:42+0200] ../cpan/Compress-Raw-Zlib/t/19nonpv.t.......................FAILED
[2022-04-23 09:35:42+0200]     2
[2022-04-23 09:35:42+0200] ../cpan/Compress-Raw-Zlib/t/19nonpv.t.......................FAILED
[2022-04-23 09:35:42+0200]     Non-zero exit status: 1
[2022-04-23 09:35:42+0200] Archived results...
[2022-04-23 09:35:42+0200] TSTENV = locale:en_US.utf8	
makefile:258: warning: ignoring prerequisites on suffix rule definition
makefile:254: warning: ignoring prerequisites on suffix rule definition
makefile:258: warning: ignoring prerequisites on suffix rule definition
makefile:258: warning: ignoring prerequisites on suffix rule definition
makefile:254: warning: ignoring prerequisites on suffix rule definition
makefile:258: warning: ignoring prerequisites on suffix rule definition

#   Failed test 'ZLIB_VERSION (1.2.12) matches Compress::Zlib::zlib_version'
#   at t/cz-01version.t line 34.
#          got: '1.2.12'
#     expected: '1.2.11'
# 
# The version of zlib.h does not match the version of libz
# 
# You have zlib.h version 1.2.12
# 	 and libz   version 1.2.11
# 
# You probably have two versions of zlib installed on your system.
# Try removing the one you don't want to use and rebuild.
# Looks like you failed 1 test of 2.

#   Failed test 'ZLIB_VERSION matches Compress::Zlib::zlib_version'
#   at t/cz-03zlib-v1.t line 55.
#          got: '1.2.11'
#     expected: '1.2.12'

#   Failed test at t/cz-03zlib-v1.t line 706.
#          got: -3
#     expected: 1
# Looks like you failed 2 tests of 471.

#   Failed test 'ZLIB_VERSION matches Compress::Zlib::zlib_version'
#   at t/cz-06gzsetp.t line 48.
#          got: '1.2.11'
#     expected: '1.2.12'
# Looks like you failed 1 test of 51.

#   Failed test 'ZLIB_VERSION matches Compress::Zlib::zlib_version'
#   at t/cz-08encoding.t line 43.
#          got: '1.2.11'
#     expected: '1.2.12'
# Looks like you failed 1 test of 29.

#   Failed test 'ZLIB_VERSION matches Compress::Zlib::zlib_version'
#   at t/cz-14gzopen.t line 34.
#          got: '1.2.11'
#     expected: '1.2.12'
# Looks like you failed 1 test of 264.

#   Failed test 'ZLIB_VERSION (1.2.12) matches Compress::Raw::Zlib::zlib_version'
#   at t/01version.t line 34.
#          got: '1.2.12'
#     expected: '1.2.11'
# 
# The version of zlib.h does not match the version of libz
# 
# You have zlib.h version 1.2.12
#      and libz   version 1.2.11
# 
# You probably have two versions of zlib installed on your system.
# Try removing the one you don't want to use and rebuild.
# Looks like you failed 1 test of 2.

#   Failed test 'ZLIB_VERSION matches Compress::Raw::Zlib::zlib_version'
#   at t/02zlib.t line 56.
#          got: '1.2.11'
#     expected: '1.2.12'

#   Failed test at t/02zlib.t line 495.
#          got: -3
#     expected: 1

#   Failed test at t/02zlib.t line 529.
#          got: -3
#     expected: 1
# Looks like you failed 3 tests of 349.

#   Failed test 'ZLIB_VERSION matches Compress::Raw::Zlib::zlib_version'
#   at t/18lvalue.t line 44.
#          got: '1.2.11'
#     expected: '1.2.12'
# Looks like you failed 1 test of 10.

#   Failed test 'ZLIB_VERSION matches Compress::Raw::Zlib::zlib_version'
#   at t/19nonpv.t line 40.
#          got: '1.2.11'
#     expected: '1.2.12'
# Looks like you failed 1 test of 38.
Subroutine Time::HiRes::constant redefined at (eval 37) line 1.
Subroutine Time::HiRes::usleep redefined at (eval 37) line 1.
Subroutine Time::HiRes::nanosleep redefined at (eval 37) line 1.
Subroutine Time::HiRes::sleep redefined at (eval 37) line 1.
Subroutine Time::HiRes::ualarm redefined at (eval 37) line 1.
Subroutine Time::HiRes::alarm redefined at (eval 37) line 1.
Subroutine Time::HiRes::gettimeofday redefined at (eval 37) line 1.
Subroutine Time::HiRes::time redefined at (eval 37) line 1.
Subroutine Time::HiRes::setitimer redefined at (eval 37) line 1.
Subroutine Time::HiRes::getitimer redefined at (eval 37) line 1.
Subroutine Time::HiRes::utime redefined at (eval 37) line 1.
Subroutine Time::HiRes::clock_gettime redefined at (eval 37) line 1.
Subroutine Time::HiRes::clock_getres redefined at (eval 37) line 1.
Subroutine Time::HiRes::clock_nanosleep redefined at (eval 37) line 1.
Subroutine Time::HiRes::clock redefined at (eval 37) line 1.
Subroutine Time::HiRes::lstat redefined at (eval 37) line 1.
Subroutine Time::HiRes::stat redefined at (eval 37) line 1.
Unable to flush stdout: Broken pipe
make: *** [makefile:856: test_harness] Error 12

error while running harness target 'test_harness': 2 at /data/pro/3gl/CPAN/smoke/lib/Test/Smoke.pm line 194.
[2022-04-23 09:41:01+0200] 
[2022-04-23 09:41:01+0200] ../cpan/IO-Compress/t/cz-01version.t........................FAILED
[2022-04-23 09:41:01+0200]     2
[2022-04-23 09:41:01+0200] ../cpan/IO-Compress/t/cz-01version.t........................FAILED
[2022-04-23 09:41:01+0200]     Non-zero exit status: 1
[2022-04-23 09:41:01+0200] ../cpan/IO-Compress/t/cz-03zlib-v1.t........................FAILED
[2022-04-23 09:41:01+0200]     4, 196
[2022-04-23 09:41:01+0200] ../cpan/IO-Compress/t/cz-03zlib-v1.t........................FAILED
[2022-04-23 09:41:01+0200]     Non-zero exit status: 2
[2022-04-23 09:41:01+0200] ../cpan/IO-Compress/t/cz-06gzsetp.t.........................FAILED
[2022-04-23 09:41:01+0200]     1
[2022-04-23 09:41:01+0200] ../cpan/IO-Compress/t/cz-06gzsetp.t.........................FAILED
[2022-04-23 09:41:01+0200]     Non-zero exit status: 1
[2022-04-23 09:41:01+0200] ../cpan/IO-Compress/t/cz-08encoding.t.......................FAILED
[2022-04-23 09:41:01+0200]     2
[2022-04-23 09:41:01+0200] ../cpan/IO-Compress/t/cz-08encoding.t.......................FAILED
[2022-04-23 09:41:01+0200]     Non-zero exit status: 1
[2022-04-23 09:41:01+0200] ../cpan/IO-Compress/t/cz-14gzopen.t.........................FAILED
[2022-04-23 09:41:01+0200]     3
[2022-04-23 09:41:01+0200] ../cpan/IO-Compress/t/cz-14gzopen.t.........................FAILED
[2022-04-23 09:41:01+0200]     Non-zero exit status: 1
[2022-04-23 09:41:01+0200] ../cpan/Compress-Raw-Zlib/t/01version.t.....................FAILED
[2022-04-23 09:41:01+0200]     2
[2022-04-23 09:41:01+0200] ../cpan/Compress-Raw-Zlib/t/01version.t.....................FAILED
[2022-04-23 09:41:01+0200]     Non-zero exit status: 1
[2022-04-23 09:41:01+0200] ../cpan/Compress-Raw-Zlib/t/02zlib.t........................FAILED
[2022-04-23 09:41:01+0200]     2, 126, 134
[2022-04-23 09:41:01+0200] ../cpan/Compress-Raw-Zlib/t/02zlib.t........................FAILED
[2022-04-23 09:41:01+0200]     Non-zero exit status: 3
[2022-04-23 09:41:01+0200] ../cpan/Compress-Raw-Zlib/t/18lvalue.t......................FAILED
[2022-04-23 09:41:01+0200]     2
[2022-04-23 09:41:01+0200] ../cpan/Compress-Raw-Zlib/t/18lvalue.t......................FAILED
[2022-04-23 09:41:01+0200]     Non-zero exit status: 1
[2022-04-23 09:41:01+0200] ../cpan/Compress-Raw-Zlib/t/19nonpv.t.......................FAILED
[2022-04-23 09:41:01+0200]     2
[2022-04-23 09:41:01+0200] ../cpan/Compress-Raw-Zlib/t/19nonpv.t.......................FAILED
[2022-04-23 09:41:01+0200]     Non-zero exit status: 1
[2022-04-23 09:41:01+0200] Archived results...
[2022-04-23 09:41:01+0200] Unskip tests from '/pro/3gl/CPAN/smoke/p59.skip'
[2022-04-23 09:41:01+0200] 
[2022-04-23 09:41:01+0200] Configuration: -Dusedevel -Duseithreads -Duse64bitall -Dusequadmath
[2022-04-23 09:41:01+0200] ------------------------------------------------------------------------------
[2022-04-23 09:41:01+0200] make distclean ...
[2022-04-23 09:41:13+0200] 
[2022-04-23 09:41:13+0200] Copy Policy.sh ...
[2022-04-23 09:41:13+0200] 
[2022-04-23 09:41:13+0200] Configure ...
[2022-04-23 09:42:16+0200] 
[2022-04-23 09:42:16+0200] make ...
[2022-04-23 09:43:38+0200] Skip tests from '/pro/3gl/CPAN/smoke/p59.skip'
[2022-04-23 09:43:38+0200] 
[2022-04-23 09:43:38+0200]  Tests start here:
[2022-04-23 09:43:38+0200] TSTENV = stdio	
makefile:258: warning: ignoring prerequisites on suffix rule definition
makefile:254: warning: ignoring prerequisites on suffix rule definition
makefile:258: warning: ignoring prerequisites on suffix rule definition
makefile:258: warning: ignoring prerequisites on suffix rule definition
makefile:254: warning: ignoring prerequisites on suffix rule definition
makefile:258: warning: ignoring prerequisites on suffix rule definition
No saved state, selection will be empty

#   Failed test 'ZLIB_VERSION (1.2.12) matches Compress::Raw::Zlib::zlib_version'
#   at t/01version.t line 34.
#          got: '1.2.12'
#     expected: '1.2.11'
# 
# The version of zlib.h does not match the version of libz
# 
# You have zlib.h version 1.2.12
#      and libz   version 1.2.11
# 
# You probably have two versions of zlib installed on your system.
# Try removing the one you don't want to use and rebuild.
# Looks like you failed 1 test of 2.

#   Failed test 'ZLIB_VERSION matches Compress::Raw::Zlib::zlib_version'
#   at t/02zlib.t line 56.
#          got: '1.2.11'
#     expected: '1.2.12'

#   Failed test at t/02zlib.t line 495.
#          got: -3
#     expected: 1

#   Failed test at t/02zlib.t line 529.
#          got: -3
#     expected: 1
# Looks like you failed 3 tests of 349.

#   Failed test 'ZLIB_VERSION matches Compress::Raw::Zlib::zlib_version'
#   at t/18lvalue.t line 44.
#          got: '1.2.11'
#     expected: '1.2.12'
# Looks like you failed 1 test of 10.

#   Failed test 'ZLIB_VERSION matches Compress::Raw::Zlib::zlib_version'
#   at t/19nonpv.t line 40.
#          got: '1.2.11'
#     expected: '1.2.12'
# Looks like you failed 1 test of 38.

#   Failed test 'ZLIB_VERSION (1.2.12) matches Compress::Zlib::zlib_version'
#   at t/cz-01version.t line 34.
#          got: '1.2.12'
#     expected: '1.2.11'
# 
# The version of zlib.h does not match the version of libz
# 
# You have zlib.h version 1.2.12
# 	 and libz   version 1.2.11
# 
# You probably have two versions of zlib installed on your system.
# Try removing the one you don't want to use and rebuild.
# Looks like you failed 1 test of 2.

#   Failed test 'ZLIB_VERSION matches Compress::Zlib::zlib_version'
#   at t/cz-03zlib-v1.t line 55.
#          got: '1.2.11'
#     expected: '1.2.12'

#   Failed test at t/cz-03zlib-v1.t line 706.
#          got: -3
#     expected: 1
# Looks like you failed 2 tests of 471.

#   Failed test 'ZLIB_VERSION matches Compress::Zlib::zlib_version'
#   at t/cz-06gzsetp.t line 48.
#          got: '1.2.11'
#     expected: '1.2.12'
# Looks like you failed 1 test of 51.

#   Failed test 'ZLIB_VERSION matches Compress::Zlib::zlib_version'
#   at t/cz-08encoding.t line 43.
#          got: '1.2.11'
#     expected: '1.2.12'
# Looks like you failed 1 test of 29.

#   Failed test 'ZLIB_VERSION matches Compress::Zlib::zlib_version'
#   at t/cz-14gzopen.t line 34.
#          got: '1.2.11'
#     expected: '1.2.12'
# Looks like you failed 1 test of 264.
Subroutine Time::HiRes::constant redefined at (eval 37) line 1.
Subroutine Time::HiRes::usleep redefined at (eval 37) line 1.
Subroutine Time::HiRes::nanosleep redefined at (eval 37) line 1.
Subroutine Time::HiRes::sleep redefined at (eval 37) line 1.
Subroutine Time::HiRes::ualarm redefined at (eval 37) line 1.
Subroutine Time::HiRes::alarm redefined at (eval 37) line 1.
Subroutine Time::HiRes::gettimeofday redefined at (eval 37) line 1.
Subroutine Time::HiRes::time redefined at (eval 37) line 1.
Subroutine Time::HiRes::setitimer redefined at (eval 37) line 1.
Subroutine Time::HiRes::getitimer redefined at (eval 37) line 1.
Subroutine Time::HiRes::utime redefined at (eval 37) line 1.
Subroutine Time::HiRes::clock_gettime redefined at (eval 37) line 1.
Subroutine Time::HiRes::clock_getres redefined at (eval 37) line 1.
Subroutine Time::HiRes::clock_nanosleep redefined at (eval 37) line 1.
Subroutine Time::HiRes::clock redefined at (eval 37) line 1.
Subroutine Time::HiRes::lstat redefined at (eval 37) line 1.
Subroutine Time::HiRes::stat redefined at (eval 37) line 1.
No such file or directory
No such file or directory
No such file or directory
No such file or directory
No such file or directory
No such file or directory
No such file or directory
make: *** [makefile:856: test_harness] Error 12

error while running harness target 'test_harness': 2 at /data/pro/3gl/CPAN/smoke/lib/Test/Smoke.pm line 194.
[2022-04-23 09:48:36+0200] 
[2022-04-23 09:48:36+0200] ../cpan/Compress-Raw-Zlib/t/01version.t.....................FAILED
[2022-04-23 09:48:36+0200]     2
[2022-04-23 09:48:36+0200] ../cpan/Compress-Raw-Zlib/t/01version.t.....................FAILED
[2022-04-23 09:48:36+0200]     Non-zero exit status: 1
[2022-04-23 09:48:36+0200] ../cpan/Compress-Raw-Zlib/t/02zlib.t........................FAILED
[2022-04-23 09:48:36+0200]     2, 126, 134
[2022-04-23 09:48:36+0200] ../cpan/Compress-Raw-Zlib/t/02zlib.t........................FAILED
[2022-04-23 09:48:36+0200]     Non-zero exit status: 3
[2022-04-23 09:48:36+0200] ../cpan/Compress-Raw-Zlib/t/18lvalue.t......................FAILED
[2022-04-23 09:48:36+0200]     2
[2022-04-23 09:48:36+0200] ../cpan/Compress-Raw-Zlib/t/18lvalue.t......................FAILED
[2022-04-23 09:48:36+0200]     Non-zero exit status: 1
[2022-04-23 09:48:36+0200] ../cpan/Compress-Raw-Zlib/t/19nonpv.t.......................FAILED
[2022-04-23 09:48:36+0200]     2
[2022-04-23 09:48:36+0200] ../cpan/Compress-Raw-Zlib/t/19nonpv.t.......................FAILED
[2022-04-23 09:48:36+0200]     Non-zero exit status: 1
[2022-04-23 09:48:36+0200] ../cpan/IO-Compress/t/cz-01version.t........................FAILED
[2022-04-23 09:48:36+0200]     2
[2022-04-23 09:48:36+0200] ../cpan/IO-Compress/t/cz-01version.t........................FAILED
[2022-04-23 09:48:36+0200]     Non-zero exit status: 1
[2022-04-23 09:48:36+0200] ../cpan/IO-Compress/t/cz-03zlib-v1.t........................FAILED
[2022-04-23 09:48:36+0200]     4, 196
[2022-04-23 09:48:36+0200] ../cpan/IO-Compress/t/cz-03zlib-v1.t........................FAILED
[2022-04-23 09:48:36+0200]     Non-zero exit status: 2
[2022-04-23 09:48:36+0200] ../cpan/IO-Compress/t/cz-06gzsetp.t.........................FAILED
[2022-04-23 09:48:36+0200]     1
[2022-04-23 09:48:36+0200] ../cpan/IO-Compress/t/cz-06gzsetp.t.........................FAILED
[2022-04-23 09:48:36+0200]     Non-zero exit status: 1
[2022-04-23 09:48:36+0200] ../cpan/IO-Compress/t/cz-08encoding.t.......................FAILED
[2022-04-23 09:48:36+0200]     2
[2022-04-23 09:48:36+0200] ../cpan/IO-Compress/t/cz-08encoding.t.......................FAILED
[2022-04-23 09:48:36+0200]     Non-zero exit status: 1
[2022-04-23 09:48:36+0200] ../cpan/IO-Compress/t/cz-14gzopen.t.........................FAILED
[2022-04-23 09:48:36+0200]     3
[2022-04-23 09:48:36+0200] ../cpan/IO-Compress/t/cz-14gzopen.t.........................FAILED
[2022-04-23 09:48:36+0200]     Non-zero exit status: 1
[2022-04-23 09:48:36+0200] Archived results...
[2022-04-23 09:48:36+0200] TSTENV = perlio	
makefile:258: warning: ignoring prerequisites on suffix rule definition
makefile:254: warning: ignoring prerequisites on suffix rule definition
makefile:258: warning: ignoring prerequisites on suffix rule definition
makefile:258: warning: ignoring prerequisites on suffix rule definition
makefile:254: warning: ignoring prerequisites on suffix rule definition
makefile:258: warning: ignoring prerequisites on suffix rule definition

#   Failed test 'ZLIB_VERSION (1.2.12) matches Compress::Zlib::zlib_version'
#   at t/cz-01version.t line 34.
#          got: '1.2.12'
#     expected: '1.2.11'
# 
# The version of zlib.h does not match the version of libz
# 
# You have zlib.h version 1.2.12
# 	 and libz   version 1.2.11
# 
# You probably have two versions of zlib installed on your system.
# Try removing the one you don't want to use and rebuild.
# Looks like you failed 1 test of 2.

#   Failed test 'ZLIB_VERSION matches Compress::Zlib::zlib_version'
#   at t/cz-03zlib-v1.t line 55.
#          got: '1.2.11'
#     expected: '1.2.12'

#   Failed test at t/cz-03zlib-v1.t line 706.
#          got: -3
#     expected: 1
# Looks like you failed 2 tests of 471.

#   Failed test 'ZLIB_VERSION matches Compress::Zlib::zlib_version'
#   at t/cz-06gzsetp.t line 48.
#          got: '1.2.11'
#     expected: '1.2.12'
# Looks like you failed 1 test of 51.

#   Failed test 'ZLIB_VERSION matches Compress::Zlib::zlib_version'
#   at t/cz-08encoding.t line 43.
#          got: '1.2.11'
#     expected: '1.2.12'
# Looks like you failed 1 test of 29.

#   Failed test 'ZLIB_VERSION matches Compress::Zlib::zlib_version'
#   at t/cz-14gzopen.t line 34.
#          got: '1.2.11'
#     expected: '1.2.12'
# Looks like you failed 1 test of 264.

#   Failed test 'ZLIB_VERSION (1.2.12) matches Compress::Raw::Zlib::zlib_version'
#   at t/01version.t line 34.
#          got: '1.2.12'
#     expected: '1.2.11'
# 
# The version of zlib.h does not match the version of libz
# 
# You have zlib.h version 1.2.12
#      and libz   version 1.2.11
# 
# You probably have two versions of zlib installed on your system.
# Try removing the one you don't want to use and rebuild.
# Looks like you failed 1 test of 2.

#   Failed test 'ZLIB_VERSION matches Compress::Raw::Zlib::zlib_version'
#   at t/02zlib.t line 56.
#          got: '1.2.11'
#     expected: '1.2.12'

#   Failed test at t/02zlib.t line 495.
#          got: -3
#     expected: 1

#   Failed test at t/02zlib.t line 529.
#          got: -3
#     expected: 1
# Looks like you failed 3 tests of 349.

#   Failed test 'ZLIB_VERSION matches Compress::Raw::Zlib::zlib_version'
#   at t/18lvalue.t line 44.
#          got: '1.2.11'
#     expected: '1.2.12'
# Looks like you failed 1 test of 10.

#   Failed test 'ZLIB_VERSION matches Compress::Raw::Zlib::zlib_version'
#   at t/19nonpv.t line 40.
#          got: '1.2.11'
#     expected: '1.2.12'
# Looks like you failed 1 test of 38.
Subroutine Time::HiRes::constant redefined at (eval 37) line 1.
Subroutine Time::HiRes::usleep redefined at (eval 37) line 1.
Subroutine Time::HiRes::nanosleep redefined at (eval 37) line 1.
Subroutine Time::HiRes::sleep redefined at (eval 37) line 1.
Subroutine Time::HiRes::ualarm redefined at (eval 37) line 1.
Subroutine Time::HiRes::alarm redefined at (eval 37) line 1.
Subroutine Time::HiRes::gettimeofday redefined at (eval 37) line 1.
Subroutine Time::HiRes::time redefined at (eval 37) line 1.
Subroutine Time::HiRes::setitimer redefined at (eval 37) line 1.
Subroutine Time::HiRes::getitimer redefined at (eval 37) line 1.
Subroutine Time::HiRes::utime redefined at (eval 37) line 1.
Subroutine Time::HiRes::clock_gettime redefined at (eval 37) line 1.
Subroutine Time::HiRes::clock_getres redefined at (eval 37) line 1.
Subroutine Time::HiRes::clock_nanosleep redefined at (eval 37) line 1.
Subroutine Time::HiRes::clock redefined at (eval 37) line 1.
Subroutine Time::HiRes::lstat redefined at (eval 37) line 1.
Subroutine Time::HiRes::stat redefined at (eval 37) line 1.
make: *** [makefile:856: test_harness] Error 12

error while running harness target 'test_harness': 2 at /data/pro/3gl/CPAN/smoke/lib/Test/Smoke.pm line 194.
[2022-04-23 09:53:19+0200] 
[2022-04-23 09:53:19+0200] ../cpan/IO-Compress/t/cz-01version.t........................FAILED
[2022-04-23 09:53:19+0200]     2
[2022-04-23 09:53:19+0200] ../cpan/IO-Compress/t/cz-01version.t........................FAILED
[2022-04-23 09:53:19+0200]     Non-zero exit status: 1
[2022-04-23 09:53:19+0200] ../cpan/IO-Compress/t/cz-03zlib-v1.t........................FAILED
[2022-04-23 09:53:19+0200]     4, 196
[2022-04-23 09:53:19+0200] ../cpan/IO-Compress/t/cz-03zlib-v1.t........................FAILED
[2022-04-23 09:53:19+0200]     Non-zero exit status: 2
[2022-04-23 09:53:19+0200] ../cpan/IO-Compress/t/cz-06gzsetp.t.........................FAILED
[2022-04-23 09:53:19+0200]     1
[2022-04-23 09:53:19+0200] ../cpan/IO-Compress/t/cz-06gzsetp.t.........................FAILED
[2022-04-23 09:53:19+0200]     Non-zero exit status: 1
[2022-04-23 09:53:19+0200] ../cpan/IO-Compress/t/cz-08encoding.t.......................FAILED
[2022-04-23 09:53:19+0200]     2
[2022-04-23 09:53:19+0200] ../cpan/IO-Compress/t/cz-08encoding.t.......................FAILED
[2022-04-23 09:53:19+0200]     Non-zero exit status: 1
[2022-04-23 09:53:19+0200] ../cpan/IO-Compress/t/cz-14gzopen.t.........................FAILED
[2022-04-23 09:53:19+0200]     3
[2022-04-23 09:53:19+0200] ../cpan/IO-Compress/t/cz-14gzopen.t.........................FAILED
[2022-04-23 09:53:19+0200]     Non-zero exit status: 1
[2022-04-23 09:53:19+0200] ../cpan/Compress-Raw-Zlib/t/01version.t.....................FAILED
[2022-04-23 09:53:19+0200]     2
[2022-04-23 09:53:19+0200] ../cpan/Compress-Raw-Zlib/t/01version.t.....................FAILED
[2022-04-23 09:53:19+0200]     Non-zero exit status: 1
[2022-04-23 09:53:19+0200] ../cpan/Compress-Raw-Zlib/t/02zlib.t........................FAILED
[2022-04-23 09:53:19+0200]     2, 126, 134
[2022-04-23 09:53:19+0200] ../cpan/Compress-Raw-Zlib/t/02zlib.t........................FAILED
[2022-04-23 09:53:19+0200]     Non-zero exit status: 3
[2022-04-23 09:53:19+0200] ../cpan/Compress-Raw-Zlib/t/18lvalue.t......................FAILED
[2022-04-23 09:53:19+0200]     2
[2022-04-23 09:53:19+0200] ../cpan/Compress-Raw-Zlib/t/18lvalue.t......................FAILED
[2022-04-23 09:53:19+0200]     Non-zero exit status: 1
[2022-04-23 09:53:19+0200] ../cpan/Compress-Raw-Zlib/t/19nonpv.t.......................FAILED
[2022-04-23 09:53:19+0200]     2
[2022-04-23 09:53:19+0200] ../cpan/Compress-Raw-Zlib/t/19nonpv.t.......................FAILED
[2022-04-23 09:53:19+0200]     Non-zero exit status: 1
[2022-04-23 09:53:19+0200] Archived results...
[2022-04-23 09:53:19+0200] TSTENV = locale:en_US.utf8	
makefile:258: warning: ignoring prerequisites on suffix rule definition
makefile:254: warning: ignoring prerequisites on suffix rule definition
makefile:258: warning: ignoring prerequisites on suffix rule definition
makefile:258: warning: ignoring prerequisites on suffix rule definition
makefile:254: warning: ignoring prerequisites on suffix rule definition
makefile:258: warning: ignoring prerequisites on suffix rule definition

#   Failed test 'ZLIB_VERSION (1.2.12) matches Compress::Zlib::zlib_version'
#   at t/cz-01version.t line 34.
#          got: '1.2.12'
#     expected: '1.2.11'
# 
# The version of zlib.h does not match the version of libz
# 
# You have zlib.h version 1.2.12
# 	 and libz   version 1.2.11
# 
# You probably have two versions of zlib installed on your system.
# Try removing the one you don't want to use and rebuild.
# Looks like you failed 1 test of 2.

#   Failed test 'ZLIB_VERSION matches Compress::Zlib::zlib_version'
#   at t/cz-03zlib-v1.t line 55.
#          got: '1.2.11'
#     expected: '1.2.12'

#   Failed test at t/cz-03zlib-v1.t line 706.
#          got: -3
#     expected: 1
# Looks like you failed 2 tests of 471.

#   Failed test 'ZLIB_VERSION matches Compress::Zlib::zlib_version'
#   at t/cz-06gzsetp.t line 48.
#          got: '1.2.11'
#     expected: '1.2.12'
# Looks like you failed 1 test of 51.

#   Failed test 'ZLIB_VERSION matches Compress::Zlib::zlib_version'
#   at t/cz-08encoding.t line 43.
#          got: '1.2.11'
#     expected: '1.2.12'
# Looks like you failed 1 test of 29.

#   Failed test 'ZLIB_VERSION matches Compress::Zlib::zlib_version'
#   at t/cz-14gzopen.t line 34.
#          got: '1.2.11'
#     expected: '1.2.12'
# Looks like you failed 1 test of 264.

#   Failed test 'ZLIB_VERSION (1.2.12) matches Compress::Raw::Zlib::zlib_version'
#   at t/01version.t line 34.
#          got: '1.2.12'
#     expected: '1.2.11'
# 
# The version of zlib.h does not match the version of libz
# 
# You have zlib.h version 1.2.12
#      and libz   version 1.2.11
# 
# You probably have two versions of zlib installed on your system.
# Try removing the one you don't want to use and rebuild.
# Looks like you failed 1 test of 2.

#   Failed test 'ZLIB_VERSION matches Compress::Raw::Zlib::zlib_version'
#   at t/02zlib.t line 56.
#          got: '1.2.11'
#     expected: '1.2.12'

#   Failed test at t/02zlib.t line 495.
#          got: -3
#     expected: 1

#   Failed test at t/02zlib.t line 529.
#          got: -3
#     expected: 1
# Looks like you failed 3 tests of 349.

#   Failed test 'ZLIB_VERSION matches Compress::Raw::Zlib::zlib_version'
#   at t/18lvalue.t line 44.
#          got: '1.2.11'
#     expected: '1.2.12'
# Looks like you failed 1 test of 10.

#   Failed test 'ZLIB_VERSION matches Compress::Raw::Zlib::zlib_version'
#   at t/19nonpv.t line 40.
#          got: '1.2.11'
#     expected: '1.2.12'
# Looks like you failed 1 test of 38.
Unable to flush stdout: Broken pipe
Subroutine Time::HiRes::constant redefined at (eval 37) line 1.
Subroutine Time::HiRes::usleep redefined at (eval 37) line 1.
Subroutine Time::HiRes::nanosleep redefined at (eval 37) line 1.
Subroutine Time::HiRes::sleep redefined at (eval 37) line 1.
Subroutine Time::HiRes::ualarm redefined at (eval 37) line 1.
Subroutine Time::HiRes::alarm redefined at (eval 37) line 1.
Subroutine Time::HiRes::gettimeofday redefined at (eval 37) line 1.
Subroutine Time::HiRes::time redefined at (eval 37) line 1.
Subroutine Time::HiRes::setitimer redefined at (eval 37) line 1.
Subroutine Time::HiRes::getitimer redefined at (eval 37) line 1.
Subroutine Time::HiRes::utime redefined at (eval 37) line 1.
Subroutine Time::HiRes::clock_gettime redefined at (eval 37) line 1.
Subroutine Time::HiRes::clock_getres redefined at (eval 37) line 1.
Subroutine Time::HiRes::clock_nanosleep redefined at (eval 37) line 1.
Subroutine Time::HiRes::clock redefined at (eval 37) line 1.
Subroutine Time::HiRes::lstat redefined at (eval 37) line 1.
Subroutine Time::HiRes::stat redefined at (eval 37) line 1.
make: *** [makefile:856: test_harness] Error 12

error while running harness target 'test_harness': 2 at /data/pro/3gl/CPAN/smoke/lib/Test/Smoke.pm line 194.
[2022-04-23 09:57:53+0200] 
[2022-04-23 09:57:53+0200] ../cpan/IO-Compress/t/cz-01version.t........................FAILED
[2022-04-23 09:57:53+0200]     2
[2022-04-23 09:57:53+0200] ../cpan/IO-Compress/t/cz-01version.t........................FAILED
[2022-04-23 09:57:53+0200]     Non-zero exit status: 1
[2022-04-23 09:57:53+0200] ../cpan/IO-Compress/t/cz-03zlib-v1.t........................FAILED
[2022-04-23 09:57:53+0200]     4, 196
[2022-04-23 09:57:53+0200] ../cpan/IO-Compress/t/cz-03zlib-v1.t........................FAILED
[2022-04-23 09:57:53+0200]     Non-zero exit status: 2
[2022-04-23 09:57:53+0200] ../cpan/IO-Compress/t/cz-06gzsetp.t.........................FAILED
[2022-04-23 09:57:53+0200]     1
[2022-04-23 09:57:53+0200] ../cpan/IO-Compress/t/cz-06gzsetp.t.........................FAILED
[2022-04-23 09:57:53+0200]     Non-zero exit status: 1
[2022-04-23 09:57:53+0200] ../cpan/IO-Compress/t/cz-08encoding.t.......................FAILED
[2022-04-23 09:57:53+0200]     2
[2022-04-23 09:57:53+0200] ../cpan/IO-Compress/t/cz-08encoding.t.......................FAILED
[2022-04-23 09:57:53+0200]     Non-zero exit status: 1
[2022-04-23 09:57:53+0200] ../cpan/IO-Compress/t/cz-14gzopen.t.........................FAILED
[2022-04-23 09:57:53+0200]     3
[2022-04-23 09:57:53+0200] ../cpan/IO-Compress/t/cz-14gzopen.t.........................FAILED
[2022-04-23 09:57:53+0200]     Non-zero exit status: 1
[2022-04-23 09:57:53+0200] ../cpan/Compress-Raw-Zlib/t/01version.t.....................FAILED
[2022-04-23 09:57:53+0200]     2
[2022-04-23 09:57:53+0200] ../cpan/Compress-Raw-Zlib/t/01version.t.....................FAILED
[2022-04-23 09:57:53+0200]     Non-zero exit status: 1
[2022-04-23 09:57:53+0200] ../cpan/Compress-Raw-Zlib/t/02zlib.t........................FAILED
[2022-04-23 09:57:53+0200]     2, 126, 134
[2022-04-23 09:57:53+0200] ../cpan/Compress-Raw-Zlib/t/02zlib.t........................FAILED
[2022-04-23 09:57:53+0200]     Non-zero exit status: 3
[2022-04-23 09:57:53+0200] ../cpan/Compress-Raw-Zlib/t/18lvalue.t......................FAILED
[2022-04-23 09:57:53+0200]     2
[2022-04-23 09:57:53+0200] ../cpan/Compress-Raw-Zlib/t/18lvalue.t......................FAILED
[2022-04-23 09:57:53+0200]     Non-zero exit status: 1
[2022-04-23 09:57:53+0200] ../cpan/Compress-Raw-Zlib/t/19nonpv.t.......................FAILED
[2022-04-23 09:57:53+0200]     2
[2022-04-23 09:57:53+0200] ../cpan/Compress-Raw-Zlib/t/19nonpv.t.......................FAILED
[2022-04-23 09:57:53+0200]     Non-zero exit status: 1
[2022-04-23 09:57:53+0200] Archived results...
[2022-04-23 09:57:53+0200] Unskip tests from '/pro/3gl/CPAN/smoke/p59.skip'
[2022-04-23 09:57:53+0200] 
[2022-04-23 09:57:53+0200] Configuration: -Dusedevel -Duseithreads -Duse64bitall -Dusequadmath -DDEBUGGING
[2022-04-23 09:57:53+0200] ------------------------------------------------------------------------------
[2022-04-23 09:57:53+0200] make distclean ...
[2022-04-23 09:58:04+0200] 
[2022-04-23 09:58:04+0200] Copy Policy.sh ...
[2022-04-23 09:58:04+0200] 
[2022-04-23 09:58:04+0200] Configure ...
[2022-04-23 09:59:08+0200] 
[2022-04-23 09:59:08+0200] make ...
[2022-04-23 10:01:08+0200] Skip tests from '/pro/3gl/CPAN/smoke/p59.skip'
[2022-04-23 10:01:08+0200] 
[2022-04-23 10:01:08+0200]  Tests start here:
[2022-04-23 10:01:08+0200] TSTENV = stdio	
makefile:258: warning: ignoring prerequisites on suffix rule definition
makefile:254: warning: ignoring prerequisites on suffix rule definition
makefile:258: warning: ignoring prerequisites on suffix rule definition
makefile:258: warning: ignoring prerequisites on suffix rule definition
makefile:254: warning: ignoring prerequisites on suffix rule definition
makefile:258: warning: ignoring prerequisites on suffix rule definition
No saved state, selection will be empty

#   Failed test 'ZLIB_VERSION (1.2.12) matches Compress::Raw::Zlib::zlib_version'
#   at t/01version.t line 34.
#          got: '1.2.12'
#     expected: '1.2.11'
# 
# The version of zlib.h does not match the version of libz
# 
# You have zlib.h version 1.2.12
#      and libz   version 1.2.11
# 
# You probably have two versions of zlib installed on your system.
# Try removing the one you don't want to use and rebuild.
# Looks like you failed 1 test of 2.

#   Failed test 'ZLIB_VERSION matches Compress::Raw::Zlib::zlib_version'
#   at t/02zlib.t line 56.
#          got: '1.2.11'
#     expected: '1.2.12'

#   Failed test at t/02zlib.t line 495.
#          got: -3
#     expected: 1

#   Failed test at t/02zlib.t line 529.
#          got: -3
#     expected: 1
# Looks like you failed 3 tests of 349.

#   Failed test 'ZLIB_VERSION matches Compress::Raw::Zlib::zlib_version'
#   at t/18lvalue.t line 44.
#          got: '1.2.11'
#     expected: '1.2.12'
# Looks like you failed 1 test of 10.

#   Failed test 'ZLIB_VERSION matches Compress::Raw::Zlib::zlib_version'
#   at t/19nonpv.t line 40.
#          got: '1.2.11'
#     expected: '1.2.12'
# Looks like you failed 1 test of 38.

#   Failed test 'ZLIB_VERSION (1.2.12) matches Compress::Zlib::zlib_version'
#   at t/cz-01version.t line 34.
#          got: '1.2.12'
#     expected: '1.2.11'
# 
# The version of zlib.h does not match the version of libz
# 
# You have zlib.h version 1.2.12
# 	 and libz   version 1.2.11
# 
# You probably have two versions of zlib installed on your system.
# Try removing the one you don't want to use and rebuild.
# Looks like you failed 1 test of 2.

#   Failed test 'ZLIB_VERSION matches Compress::Zlib::zlib_version'
#   at t/cz-03zlib-v1.t line 55.
#          got: '1.2.11'
#     expected: '1.2.12'

#   Failed test at t/cz-03zlib-v1.t line 706.
#          got: -3
#     expected: 1
# Looks like you failed 2 tests of 471.

#   Failed test 'ZLIB_VERSION matches Compress::Zlib::zlib_version'
#   at t/cz-06gzsetp.t line 48.
#          got: '1.2.11'
#     expected: '1.2.12'
# Looks like you failed 1 test of 51.

#   Failed test 'ZLIB_VERSION matches Compress::Zlib::zlib_version'
#   at t/cz-08encoding.t line 43.
#          got: '1.2.11'
#     expected: '1.2.12'
# Looks like you failed 1 test of 29.

#   Failed test 'ZLIB_VERSION matches Compress::Zlib::zlib_version'
#   at t/cz-14gzopen.t line 34.
#          got: '1.2.11'
#     expected: '1.2.12'
# Looks like you failed 1 test of 264.
Subroutine Time::HiRes::constant redefined at (eval 37) line 1.
Subroutine Time::HiRes::usleep redefined at (eval 37) line 1.
Subroutine Time::HiRes::nanosleep redefined at (eval 37) line 1.
Subroutine Time::HiRes::sleep redefined at (eval 37) line 1.
Subroutine Time::HiRes::ualarm redefined at (eval 37) line 1.
Subroutine Time::HiRes::alarm redefined at (eval 37) line 1.
Subroutine Time::HiRes::gettimeofday redefined at (eval 37) line 1.
Subroutine Time::HiRes::time redefined at (eval 37) line 1.
Subroutine Time::HiRes::setitimer redefined at (eval 37) line 1.
Subroutine Time::HiRes::getitimer redefined at (eval 37) line 1.
Subroutine Time::HiRes::utime redefined at (eval 37) line 1.
Subroutine Time::HiRes::clock_gettime redefined at (eval 37) line 1.
Subroutine Time::HiRes::clock_getres redefined at (eval 37) line 1.
Subroutine Time::HiRes::clock_nanosleep redefined at (eval 37) line 1.
Subroutine Time::HiRes::clock redefined at (eval 37) line 1.
Subroutine Time::HiRes::lstat redefined at (eval 37) line 1.
Subroutine Time::HiRes::stat redefined at (eval 37) line 1.
No such file or directory
No such file or directory
No such file or directory
No such file or directory
No such file or directory
No such file or directory
No such file or directory
make: *** [makefile:856: test_harness] Error 12

error while running harness target 'test_harness': 2 at /data/pro/3gl/CPAN/smoke/lib/Test/Smoke.pm line 194.
[2022-04-23 10:06:55+0200] 
[2022-04-23 10:06:55+0200] ../cpan/Compress-Raw-Zlib/t/01version.t.....................FAILED
[2022-04-23 10:06:55+0200]     2
[2022-04-23 10:06:55+0200] ../cpan/Compress-Raw-Zlib/t/01version.t.....................FAILED
[2022-04-23 10:06:55+0200]     Non-zero exit status: 1
[2022-04-23 10:06:55+0200] ../cpan/Compress-Raw-Zlib/t/02zlib.t........................FAILED
[2022-04-23 10:06:55+0200]     2, 126, 134
[2022-04-23 10:06:55+0200] ../cpan/Compress-Raw-Zlib/t/02zlib.t........................FAILED
[2022-04-23 10:06:55+0200]     Non-zero exit status: 3
[2022-04-23 10:06:55+0200] ../cpan/Compress-Raw-Zlib/t/18lvalue.t......................FAILED
[2022-04-23 10:06:55+0200]     2
[2022-04-23 10:06:55+0200] ../cpan/Compress-Raw-Zlib/t/18lvalue.t......................FAILED
[2022-04-23 10:06:55+0200]     Non-zero exit status: 1
[2022-04-23 10:06:55+0200] ../cpan/Compress-Raw-Zlib/t/19nonpv.t.......................FAILED
[2022-04-23 10:06:55+0200]     2
[2022-04-23 10:06:55+0200] ../cpan/Compress-Raw-Zlib/t/19nonpv.t.......................FAILED
[2022-04-23 10:06:55+0200]     Non-zero exit status: 1
[2022-04-23 10:06:55+0200] ../cpan/IO-Compress/t/cz-01version.t........................FAILED
[2022-04-23 10:06:55+0200]     2
[2022-04-23 10:06:55+0200] ../cpan/IO-Compress/t/cz-01version.t........................FAILED
[2022-04-23 10:06:55+0200]     Non-zero exit status: 1
[2022-04-23 10:06:55+0200] ../cpan/IO-Compress/t/cz-03zlib-v1.t........................FAILED
[2022-04-23 10:06:55+0200]     4, 196
[2022-04-23 10:06:55+0200] ../cpan/IO-Compress/t/cz-03zlib-v1.t........................FAILED
[2022-04-23 10:06:55+0200]     Non-zero exit status: 2
[2022-04-23 10:06:55+0200] ../cpan/IO-Compress/t/cz-06gzsetp.t.........................FAILED
[2022-04-23 10:06:55+0200]     1
[2022-04-23 10:06:55+0200] ../cpan/IO-Compress/t/cz-06gzsetp.t.........................FAILED
[2022-04-23 10:06:55+0200]     Non-zero exit status: 1
[2022-04-23 10:06:55+0200] ../cpan/IO-Compress/t/cz-08encoding.t.......................FAILED
[2022-04-23 10:06:55+0200]     2
[2022-04-23 10:06:55+0200] ../cpan/IO-Compress/t/cz-08encoding.t.......................FAILED
[2022-04-23 10:06:55+0200]     Non-zero exit status: 1
[2022-04-23 10:06:55+0200] ../cpan/IO-Compress/t/cz-14gzopen.t.........................FAILED
[2022-04-23 10:06:55+0200]     3
[2022-04-23 10:06:55+0200] ../cpan/IO-Compress/t/cz-14gzopen.t.........................FAILED
[2022-04-23 10:06:55+0200]     Non-zero exit status: 1
[2022-04-23 10:06:55+0200] Archived results...
[2022-04-23 10:06:55+0200] TSTENV = perlio	
makefile:258: warning: ignoring prerequisites on suffix rule definition
makefile:254: warning: ignoring prerequisites on suffix rule definition
makefile:258: warning: ignoring prerequisites on suffix rule definition
makefile:258: warning: ignoring prerequisites on suffix rule definition
makefile:254: warning: ignoring prerequisites on suffix rule definition
makefile:258: warning: ignoring prerequisites on suffix rule definition

#   Failed test 'ZLIB_VERSION (1.2.12) matches Compress::Zlib::zlib_version'
#   at t/cz-01version.t line 34.
#          got: '1.2.12'
#     expected: '1.2.11'
# 
# The version of zlib.h does not match the version of libz
# 
# You have zlib.h version 1.2.12
# 	 and libz   version 1.2.11
# 
# You probably have two versions of zlib installed on your system.
# Try removing the one you don't want to use and rebuild.
# Looks like you failed 1 test of 2.

#   Failed test 'ZLIB_VERSION matches Compress::Zlib::zlib_version'
#   at t/cz-03zlib-v1.t line 55.
#          got: '1.2.11'
#     expected: '1.2.12'

#   Failed test at t/cz-03zlib-v1.t line 706.
#          got: -3
#     expected: 1
# Looks like you failed 2 tests of 471.

#   Failed test 'ZLIB_VERSION matches Compress::Zlib::zlib_version'
#   at t/cz-06gzsetp.t line 48.
#          got: '1.2.11'
#     expected: '1.2.12'
# Looks like you failed 1 test of 51.

#   Failed test 'ZLIB_VERSION matches Compress::Zlib::zlib_version'
#   at t/cz-08encoding.t line 43.
#          got: '1.2.11'
#     expected: '1.2.12'
# Looks like you failed 1 test of 29.

#   Failed test 'ZLIB_VERSION matches Compress::Zlib::zlib_version'
#   at t/cz-14gzopen.t line 34.
#          got: '1.2.11'
#     expected: '1.2.12'
# Looks like you failed 1 test of 264.

#   Failed test 'ZLIB_VERSION (1.2.12) matches Compress::Raw::Zlib::zlib_version'
#   at t/01version.t line 34.
#          got: '1.2.12'
#     expected: '1.2.11'
# 
# The version of zlib.h does not match the version of libz
# 
# You have zlib.h version 1.2.12
#      and libz   version 1.2.11
# 
# You probably have two versions of zlib installed on your system.
# Try removing the one you don't want to use and rebuild.
# Looks like you failed 1 test of 2.

#   Failed test 'ZLIB_VERSION matches Compress::Raw::Zlib::zlib_version'
#   at t/02zlib.t line 56.
#          got: '1.2.11'
#     expected: '1.2.12'

#   Failed test at t/02zlib.t line 495.
#          got: -3
#     expected: 1

#   Failed test at t/02zlib.t line 529.
#          got: -3
#     expected: 1
# Looks like you failed 3 tests of 349.

#   Failed test 'ZLIB_VERSION matches Compress::Raw::Zlib::zlib_version'
#   at t/18lvalue.t line 44.
#          got: '1.2.11'
#     expected: '1.2.12'
# Looks like you failed 1 test of 10.

#   Failed test 'ZLIB_VERSION matches Compress::Raw::Zlib::zlib_version'
#   at t/19nonpv.t line 40.
#          got: '1.2.11'
#     expected: '1.2.12'
# Looks like you failed 1 test of 38.
Subroutine Time::HiRes::constant redefined at (eval 37) line 1.
Subroutine Time::HiRes::usleep redefined at (eval 37) line 1.
Subroutine Time::HiRes::nanosleep redefined at (eval 37) line 1.
Subroutine Time::HiRes::sleep redefined at (eval 37) line 1.
Subroutine Time::HiRes::ualarm redefined at (eval 37) line 1.
Subroutine Time::HiRes::alarm redefined at (eval 37) line 1.
Subroutine Time::HiRes::gettimeofday redefined at (eval 37) line 1.
Subroutine Time::HiRes::time redefined at (eval 37) line 1.
Subroutine Time::HiRes::setitimer redefined at (eval 37) line 1.
Subroutine Time::HiRes::getitimer redefined at (eval 37) line 1.
Subroutine Time::HiRes::utime redefined at (eval 37) line 1.
Subroutine Time::HiRes::clock_gettime redefined at (eval 37) line 1.
Subroutine Time::HiRes::clock_getres redefined at (eval 37) line 1.
Subroutine Time::HiRes::clock_nanosleep redefined at (eval 37) line 1.
Subroutine Time::HiRes::clock redefined at (eval 37) line 1.
Subroutine Time::HiRes::lstat redefined at (eval 37) line 1.
Subroutine Time::HiRes::stat redefined at (eval 37) line 1.
make: *** [makefile:856: test_harness] Error 12

error while running harness target 'test_harness': 2 at /data/pro/3gl/CPAN/smoke/lib/Test/Smoke.pm line 194.
[2022-04-23 10:12:24+0200] 
[2022-04-23 10:12:24+0200] ../cpan/IO-Compress/t/cz-01version.t........................FAILED
[2022-04-23 10:12:24+0200]     2
[2022-04-23 10:12:24+0200] ../cpan/IO-Compress/t/cz-01version.t........................FAILED
[2022-04-23 10:12:24+0200]     Non-zero exit status: 1
[2022-04-23 10:12:24+0200] ../cpan/IO-Compress/t/cz-03zlib-v1.t........................FAILED
[2022-04-23 10:12:24+0200]     4, 196
[2022-04-23 10:12:24+0200] ../cpan/IO-Compress/t/cz-03zlib-v1.t........................FAILED
[2022-04-23 10:12:24+0200]     Non-zero exit status: 2
[2022-04-23 10:12:24+0200] ../cpan/IO-Compress/t/cz-06gzsetp.t.........................FAILED
[2022-04-23 10:12:24+0200]     1
[2022-04-23 10:12:24+0200] ../cpan/IO-Compress/t/cz-06gzsetp.t.........................FAILED
[2022-04-23 10:12:24+0200]     Non-zero exit status: 1
[2022-04-23 10:12:24+0200] ../cpan/IO-Compress/t/cz-08encoding.t.......................FAILED
[2022-04-23 10:12:24+0200]     2
[2022-04-23 10:12:24+0200] ../cpan/IO-Compress/t/cz-08encoding.t.......................FAILED
[2022-04-23 10:12:24+0200]     Non-zero exit status: 1
[2022-04-23 10:12:24+0200] ../cpan/IO-Compress/t/cz-14gzopen.t.........................FAILED
[2022-04-23 10:12:24+0200]     3
[2022-04-23 10:12:24+0200] ../cpan/IO-Compress/t/cz-14gzopen.t.........................FAILED
[2022-04-23 10:12:24+0200]     Non-zero exit status: 1
[2022-04-23 10:12:24+0200] ../cpan/Compress-Raw-Zlib/t/01version.t.....................FAILED
[2022-04-23 10:12:24+0200]     2
[2022-04-23 10:12:24+0200] ../cpan/Compress-Raw-Zlib/t/01version.t.....................FAILED
[2022-04-23 10:12:24+0200]     Non-zero exit status: 1
[2022-04-23 10:12:24+0200] ../cpan/Compress-Raw-Zlib/t/02zlib.t........................FAILED
[2022-04-23 10:12:24+0200]     2, 126, 134
[2022-04-23 10:12:24+0200] ../cpan/Compress-Raw-Zlib/t/02zlib.t........................FAILED
[2022-04-23 10:12:24+0200]     Non-zero exit status: 3
[2022-04-23 10:12:24+0200] ../cpan/Compress-Raw-Zlib/t/18lvalue.t......................FAILED
[2022-04-23 10:12:24+0200]     2
[2022-04-23 10:12:24+0200] ../cpan/Compress-Raw-Zlib/t/18lvalue.t......................FAILED
[2022-04-23 10:12:24+0200]     Non-zero exit status: 1
[2022-04-23 10:12:24+0200] ../cpan/Compress-Raw-Zlib/t/19nonpv.t.......................FAILED
[2022-04-23 10:12:24+0200]     2
[2022-04-23 10:12:24+0200] ../cpan/Compress-Raw-Zlib/t/19nonpv.t.......................FAILED
[2022-04-23 10:12:24+0200]     Non-zero exit status: 1
[2022-04-23 10:12:24+0200] Archived results...
[2022-04-23 10:12:24+0200] TSTENV = locale:en_US.utf8	
makefile:258: warning: ignoring prerequisites on suffix rule definition
makefile:254: warning: ignoring prerequisites on suffix rule definition
makefile:258: warning: ignoring prerequisites on suffix rule definition
makefile:258: warning: ignoring prerequisites on suffix rule definition
makefile:254: warning: ignoring prerequisites on suffix rule definition
makefile:258: warning: ignoring prerequisites on suffix rule definition

#   Failed test 'ZLIB_VERSION (1.2.12) matches Compress::Zlib::zlib_version'
#   at t/cz-01version.t line 34.
#          got: '1.2.12'
#     expected: '1.2.11'
# 
# The version of zlib.h does not match the version of libz
# 
# You have zlib.h version 1.2.12
# 	 and libz   version 1.2.11
# 
# You probably have two versions of zlib installed on your system.
# Try removing the one you don't want to use and rebuild.
# Looks like you failed 1 test of 2.

#   Failed test 'ZLIB_VERSION matches Compress::Zlib::zlib_version'
#   at t/cz-03zlib-v1.t line 55.
#          got: '1.2.11'
#     expected: '1.2.12'

#   Failed test at t/cz-03zlib-v1.t line 706.
#          got: -3
#     expected: 1
# Looks like you failed 2 tests of 471.

#   Failed test 'ZLIB_VERSION matches Compress::Zlib::zlib_version'
#   at t/cz-06gzsetp.t line 48.
#          got: '1.2.11'
#     expected: '1.2.12'
# Looks like you failed 1 test of 51.

#   Failed test 'ZLIB_VERSION matches Compress::Zlib::zlib_version'
#   at t/cz-08encoding.t line 43.
#          got: '1.2.11'
#     expected: '1.2.12'
# Looks like you failed 1 test of 29.

#   Failed test 'ZLIB_VERSION matches Compress::Zlib::zlib_version'
#   at t/cz-14gzopen.t line 34.
#          got: '1.2.11'
#     expected: '1.2.12'
# Looks like you failed 1 test of 264.

#   Failed test 'ZLIB_VERSION (1.2.12) matches Compress::Raw::Zlib::zlib_version'
#   at t/01version.t line 34.
#          got: '1.2.12'
#     expected: '1.2.11'
# 
# The version of zlib.h does not match the version of libz
# 
# You have zlib.h version 1.2.12
#      and libz   version 1.2.11
# 
# You probably have two versions of zlib installed on your system.
# Try removing the one you don't want to use and rebuild.
# Looks like you failed 1 test of 2.

#   Failed test 'ZLIB_VERSION matches Compress::Raw::Zlib::zlib_version'
#   at t/02zlib.t line 56.
#          got: '1.2.11'
#     expected: '1.2.12'

#   Failed test at t/02zlib.t line 495.
#          got: -3
#     expected: 1

#   Failed test at t/02zlib.t line 529.
#          got: -3
#     expected: 1
# Looks like you failed 3 tests of 349.

#   Failed test 'ZLIB_VERSION matches Compress::Raw::Zlib::zlib_version'
#   at t/18lvalue.t line 44.
#          got: '1.2.11'
#     expected: '1.2.12'
# Looks like you failed 1 test of 10.

#   Failed test 'ZLIB_VERSION matches Compress::Raw::Zlib::zlib_version'
#   at t/19nonpv.t line 40.
#          got: '1.2.11'
#     expected: '1.2.12'
# Looks like you failed 1 test of 38.
Unable to flush stdout: Broken pipe
Subroutine Time::HiRes::constant redefined at (eval 37) line 1.
Subroutine Time::HiRes::usleep redefined at (eval 37) line 1.
Subroutine Time::HiRes::nanosleep redefined at (eval 37) line 1.
Subroutine Time::HiRes::sleep redefined at (eval 37) line 1.
Subroutine Time::HiRes::ualarm redefined at (eval 37) line 1.
Subroutine Time::HiRes::alarm redefined at (eval 37) line 1.
Subroutine Time::HiRes::gettimeofday redefined at (eval 37) line 1.
Subroutine Time::HiRes::time redefined at (eval 37) line 1.
Subroutine Time::HiRes::setitimer redefined at (eval 37) line 1.
Subroutine Time::HiRes::getitimer redefined at (eval 37) line 1.
Subroutine Time::HiRes::utime redefined at (eval 37) line 1.
Subroutine Time::HiRes::clock_gettime redefined at (eval 37) line 1.
Subroutine Time::HiRes::clock_getres redefined at (eval 37) line 1.
Subroutine Time::HiRes::clock_nanosleep redefined at (eval 37) line 1.
Subroutine Time::HiRes::clock redefined at (eval 37) line 1.
Subroutine Time::HiRes::lstat redefined at (eval 37) line 1.
Subroutine Time::HiRes::stat redefined at (eval 37) line 1.
make: *** [makefile:856: test_harness] Error 12

error while running harness target 'test_harness': 2 at /data/pro/3gl/CPAN/smoke/lib/Test/Smoke.pm line 194.
[2022-04-23 10:17:52+0200] 
[2022-04-23 10:17:52+0200] ../cpan/IO-Compress/t/cz-01version.t........................FAILED
[2022-04-23 10:17:52+0200]     2
[2022-04-23 10:17:52+0200] ../cpan/IO-Compress/t/cz-01version.t........................FAILED
[2022-04-23 10:17:52+0200]     Non-zero exit status: 1
[2022-04-23 10:17:52+0200] ../cpan/IO-Compress/t/cz-03zlib-v1.t........................FAILED
[2022-04-23 10:17:52+0200]     4, 196
[2022-04-23 10:17:52+0200] ../cpan/IO-Compress/t/cz-03zlib-v1.t........................FAILED
[2022-04-23 10:17:52+0200]     Non-zero exit status: 2
[2022-04-23 10:17:52+0200] ../cpan/IO-Compress/t/cz-06gzsetp.t.........................FAILED
[2022-04-23 10:17:52+0200]     1
[2022-04-23 10:17:52+0200] ../cpan/IO-Compress/t/cz-06gzsetp.t.........................FAILED
[2022-04-23 10:17:52+0200]     Non-zero exit status: 1
[2022-04-23 10:17:52+0200] ../cpan/IO-Compress/t/cz-08encoding.t.......................FAILED
[2022-04-23 10:17:52+0200]     2
[2022-04-23 10:17:52+0200] ../cpan/IO-Compress/t/cz-08encoding.t.......................FAILED
[2022-04-23 10:17:52+0200]     Non-zero exit status: 1
[2022-04-23 10:17:52+0200] ../cpan/IO-Compress/t/cz-14gzopen.t.........................FAILED
[2022-04-23 10:17:52+0200]     3
[2022-04-23 10:17:52+0200] ../cpan/IO-Compress/t/cz-14gzopen.t.........................FAILED
[2022-04-23 10:17:52+0200]     Non-zero exit status: 1
[2022-04-23 10:17:52+0200] ../cpan/Compress-Raw-Zlib/t/01version.t.....................FAILED
[2022-04-23 10:17:52+0200]     2
[2022-04-23 10:17:52+0200] ../cpan/Compress-Raw-Zlib/t/01version.t.....................FAILED
[2022-04-23 10:17:52+0200]     Non-zero exit status: 1
[2022-04-23 10:17:52+0200] ../cpan/Compress-Raw-Zlib/t/02zlib.t........................FAILED
[2022-04-23 10:17:52+0200]     2, 126, 134
[2022-04-23 10:17:52+0200] ../cpan/Compress-Raw-Zlib/t/02zlib.t........................FAILED
[2022-04-23 10:17:52+0200]     Non-zero exit status: 3
[2022-04-23 10:17:52+0200] ../cpan/Compress-Raw-Zlib/t/18lvalue.t......................FAILED
[2022-04-23 10:17:52+0200]     2
[2022-04-23 10:17:52+0200] ../cpan/Compress-Raw-Zlib/t/18lvalue.t......................FAILED
[2022-04-23 10:17:52+0200]     Non-zero exit status: 1
[2022-04-23 10:17:52+0200] ../cpan/Compress-Raw-Zlib/t/19nonpv.t.......................FAILED
[2022-04-23 10:17:52+0200]     2
[2022-04-23 10:17:52+0200] ../cpan/Compress-Raw-Zlib/t/19nonpv.t.......................FAILED
[2022-04-23 10:17:52+0200]     Non-zero exit status: 1
[2022-04-23 10:17:52+0200] Archived results...
[2022-04-23 10:17:52+0200] Unskip tests from '/pro/3gl/CPAN/smoke/p59.skip'
[2022-04-23 10:17:52+0200] Finished smoking 70f5c3e99f92075109e4262faf825fb00ea79bd3 v5.35.11-10-g70f5c3e blead
[2022-04-23 10:17:52+0200] Reading smokeresult from /pro/3gl/CPAN/perl-current/mktest.out
[2022-04-23 10:17:52+0200] Processing []
[2022-04-23 10:17:52+0200] Processing [-DDEBUGGING]
[2022-04-23 10:17:52+0200] Processing [-Duse64bitall -Dusequadmath]
[2022-04-23 10:17:52+0200] Processing [-DDEBUGGING -Duse64bitall -Dusequadmath]
[2022-04-23 10:17:52+0200] Processing [-Duseithreads]
[2022-04-23 10:17:52+0200] Processing [-DDEBUGGING -Duseithreads]
[2022-04-23 10:17:52+0200] Processing [-Duseithreads -Duse64bitall -Dusequadmath]
[2022-04-23 10:17:52+0200] Processing [-DDEBUGGING -Duseithreads -Duse64bitall -Dusequadmath]
[2022-04-23 10:17:52+0200] Writing report to '/pro/3gl/CPAN/perl-current/mktest.rpt'
[2022-04-23 10:17:52+0200] Locally applied patches from '/pro/3gl/CPAN/perl-current/patchlevel.h'
[2022-04-23 10:17:52+0200] Patches: 'uncommitted-changes'
[2022-04-23 10:17:52+0200] Looking for cc messages: 'gcc'
-- 
Report generated by Test::Smoke::Gateway v0.12