Show report
[2022-03-24 05:52:23-0400] ==> Starting synctree
[2022-03-24 05:52:23-0400] qx[/usr/local/bin/git clone file:///home/core/smoke/git /home/core/smoke/git-perl 2>&1]
[2022-03-24 05:57:26-0400] qx[/usr/local/bin/git remote update --prune 2>&1]
[2022-03-24 05:57:27-0400] qx[/usr/local/bin/git checkout blead
[2022-03-24 05:57:27-0400]  2>&1]
Already on 'blead'
[2022-03-24 05:57:27-0400] qx[/usr/local/bin/git reset --hard origin/blead
[2022-03-24 05:57:27-0400]  2>&1]
[2022-03-24 05:57:27-0400] qx[/usr/local/bin/git clone /home/core/smoke/git-perl /home/core/smoke/perl-current 2>&1]
[2022-03-24 05:57:36-0400] qx[/usr/local/bin/git clean -dfx 2>&1]
[2022-03-24 05:57:36-0400] qx[/usr/local/bin/git fetch origin 2>&1]
[2022-03-24 05:57:36-0400] qx[/usr/local/bin/git checkout blead
[2022-03-24 05:57:36-0400]  2>&1]
Already on 'blead'
[2022-03-24 05:57:36-0400] qx[/usr/local/bin/git reset --hard origin/blead
[2022-03-24 05:57:36-0400]  2>&1]
[2022-03-24 05:57:36-0400] qx[/home/core/bin/perl-5.30.2/bin/perl5.30.2 Porting/make_dot_patch.pl > .patch]
[2022-03-24 05:57:37-0400] /home/core/smoke/perl-current is now up to patchlevel 0f7529f0ca9df6069f41f1b9bfacac94db2c7bed
[2022-03-24 05:57:37-0400] ==> Starting runsmoke
[2022-03-24 05:57:37-0400] [./tssmokeperl.pl] chdir(/home/core/smoke/perl-current)
[2022-03-24 05:57:37-0400] qx[/home/core/bin/perl-5.30.2/bin/perl5.30.2 -e "require q[/home/core/smoke/perl-current/cpan/Test-Harness/lib/Test/Harness.pm];print Test::Harness->VERSION" 2>&1]
[2022-03-24 05:57:37-0400] Found: Test::Harness version 3.43.
[2022-03-24 05:57:37-0400] Reading build configurations from /home/core/smoke/TestSmoke/perlcurrent.cfg
[2022-03-24 05:57:37-0400] Reading 'Policy.sh' from default content (v=1)
[2022-03-24 05:57:37-0400] Running smoke tests without $ENV{PERLIO}
[2022-03-24 05:57:37-0400] Running test suite only with 'harness'
[2022-03-24 05:57:37-0400] make distclean ...
[2022-03-24 05:57:37-0400] Smoking patch 0f7529f0ca9df6069f41f1b9bfacac94db2c7bed v5.35.10-14-g0f7529f0ca
[2022-03-24 05:57:37-0400] Smoking branch blead
[2022-03-24 05:57:38-0400] Locally applied patches from '/home/core/smoke/perl-current/patchlevel.h'
[2022-03-24 05:57:38-0400] Patches: 'uncommitted-changes'
[2022-03-24 05:57:38-0400] Adding 'SMOKE0f7529f0ca9df6069f41f1b9bfacac94db2c7bed' to the registered patches.
[2022-03-24 05:57:38-0400] 
[2022-03-24 05:57:38-0400] Configuration: -Dusedevel -Dcc=clang
[2022-03-24 05:57:38-0400] ------------------------------------------------------------------------------
[2022-03-24 05:57:38-0400] make distclean ...
[2022-03-24 05:57:38-0400] 
[2022-03-24 05:57:38-0400] Copy Policy.sh ...
[2022-03-24 05:57:38-0400] 
[2022-03-24 05:57:38-0400] Configure ...
[2022-03-24 05:59:00-0400] 
[2022-03-24 05:59:00-0400] make ...
Warning (mostly harmless): No library found for -lndbm
Warning (mostly harmless): No library found for -ldbm
Warning (mostly harmless): No library found for -lucb
Warning (mostly harmless): No library found for -lposix
Warning (mostly harmless): No library found for -lcposix
In file included from HiRes.xs:859:
./const-c.inc:351:42: warning: unused parameter 'iv_return' [-Wunused-parameter]
constant_19 (pTHX_ const char *name, IV *iv_return) {
                                         ^
1 warning generated.
[2022-03-24 06:08:07-0400] Skip tests from '/home/core/smoke/TestSmoke/smokecurrent.skiptests'
[2022-03-24 06:08:07-0400] 
[2022-03-24 06:08:07-0400]  Tests start here:
[2022-03-24 06:08:07-0400] TSTENV = stdio	
#   " outside of any" 
#     '=item' '=over' near line 1358 of pod/perlunicode.pod
# See end of this test output for your options on silencing this
# 
# HOW TO GET porting/podcheck.t TO PASS
# 
# There was 1 file that had new potential problems identified.
# Some of them may be real, and some of them may be false positives because
# this program isn't as smart as it likes to think it is.  You can teach this
# program to ignore the issues it has identified, and hence pass, by doing the
# following:
# 
# 1) If a problem is about a link to an unknown module or man page that
#    you know exists, re-run the command something like:
#       ./perl -I../lib porting/podcheck.t --add_link MODULE man_page ...
#    (MODULEs should look like Foo::Bar, and man_pages should look like
#    bar(3c); don't do this for a module or man page that you aren't sure
#    about; instead treat as another type of issue and follow the
#    instructions below.)
# 
# 2) For other issues, decide if each should be fixed now or not.  Fix the
#    ones you decided to, and rerun this test to verify that the fixes
#    worked.
# 
# 3) If there remain false positive or problems that you don't plan to fix right
#    now,
#    run this test script by hand, using the following formula (on
#    Un*x-like machines):
#         cd t
#         ./perl -I../lib porting/podcheck.t --regen
# 
#    That should cause all current potential problems to be accepted by
#    the program, so that the next time it runs, they won't be flagged.
#    For a few files, such as perltoc, certain issues will always be
#    expected, and more of the same will be added over time.  For those,
#    before you do the regen, you can edit
#    /home/core/smoke/perl-current/t/porting/known_pod_issues.dat
#    and find the entry for the module's file and specific error message,
#    and change the count of known potential problems to -1.
# temp file: /home/core/tmp/DMSOT4ImyL
Subroutine Time::HiRes::constant redefined at (eval 37) line 1.
Subroutine Time::HiRes::usleep redefined at (eval 37) line 1.
Subroutine Time::HiRes::nanosleep redefined at (eval 37) line 1.
Subroutine Time::HiRes::sleep redefined at (eval 37) line 1.
Subroutine Time::HiRes::ualarm redefined at (eval 37) line 1.
Subroutine Time::HiRes::alarm redefined at (eval 37) line 1.
Subroutine Time::HiRes::gettimeofday redefined at (eval 37) line 1.
Subroutine Time::HiRes::time redefined at (eval 37) line 1.
Subroutine Time::HiRes::setitimer redefined at (eval 37) line 1.
Subroutine Time::HiRes::getitimer redefined at (eval 37) line 1.
Subroutine Time::HiRes::utime redefined at (eval 37) line 1.
Subroutine Time::HiRes::clock_gettime redefined at (eval 37) line 1.
Subroutine Time::HiRes::clock_getres redefined at (eval 37) line 1.
Subroutine Time::HiRes::clock_nanosleep redefined at (eval 37) line 1.
Subroutine Time::HiRes::clock redefined at (eval 37) line 1.
Subroutine Time::HiRes::lstat redefined at (eval 37) line 1.
Subroutine Time::HiRes::stat redefined at (eval 37) line 1.
*** Error 1 in /home/core/smoke/perl-current (makefile:841 'test_harness')

error while running harness target 'test_harness': 2 at /home/core/smoke/TestSmoke/Test/Smoke/App/RunSmoke.pm line 118.
[2022-03-24 06:46:52-0400] 
[2022-03-24 06:46:52-0400] ../t/porting/podcheck.t.....................................FAILED
[2022-03-24 06:46:52-0400]     270
[2022-03-24 06:46:52-0400] Archived results...
[2022-03-24 06:46:52-0400] Unskip tests from '/home/core/smoke/TestSmoke/smokecurrent.skiptests'
[2022-03-24 06:46:52-0400] 
[2022-03-24 06:46:52-0400] Configuration: -Dusedevel -Dcc=clang -DDEBUGGING
[2022-03-24 06:46:52-0400] ------------------------------------------------------------------------------
[2022-03-24 06:46:52-0400] make distclean ...
[2022-03-24 06:47:27-0400] 
[2022-03-24 06:47:27-0400] Copy Policy.sh ...
[2022-03-24 06:47:27-0400] 
[2022-03-24 06:47:27-0400] Configure ...
[2022-03-24 06:48:48-0400] 
[2022-03-24 06:48:48-0400] make ...
Warning (mostly harmless): No library found for -lndbm
Warning (mostly harmless): No library found for -ldbm
Warning (mostly harmless): No library found for -lucb
Warning (mostly harmless): No library found for -lposix
Warning (mostly harmless): No library found for -lcposix
In file included from HiRes.xs:859:
./const-c.inc:351:42: warning: unused parameter 'iv_return' [-Wunused-parameter]
constant_19 (pTHX_ const char *name, IV *iv_return) {
                                         ^
1 warning generated.
[2022-03-24 07:00:39-0400] Skip tests from '/home/core/smoke/TestSmoke/smokecurrent.skiptests'
[2022-03-24 07:00:39-0400] 
[2022-03-24 07:00:39-0400]  Tests start here:
[2022-03-24 07:00:39-0400] TSTENV = stdio	
#   " outside of any" 
#     '=item' '=over' near line 1358 of pod/perlunicode.pod
# See end of this test output for your options on silencing this
# 
# HOW TO GET porting/podcheck.t TO PASS
# 
# There was 1 file that had new potential problems identified.
# Some of them may be real, and some of them may be false positives because
# this program isn't as smart as it likes to think it is.  You can teach this
# program to ignore the issues it has identified, and hence pass, by doing the
# following:
# 
# 1) If a problem is about a link to an unknown module or man page that
#    you know exists, re-run the command something like:
#       ./perl -I../lib porting/podcheck.t --add_link MODULE man_page ...
#    (MODULEs should look like Foo::Bar, and man_pages should look like
#    bar(3c); don't do this for a module or man page that you aren't sure
#    about; instead treat as another type of issue and follow the
#    instructions below.)
# 
# 2) For other issues, decide if each should be fixed now or not.  Fix the
#    ones you decided to, and rerun this test to verify that the fixes
#    worked.
# 
# 3) If there remain false positive or problems that you don't plan to fix right
#    now,
#    run this test script by hand, using the following formula (on
#    Un*x-like machines):
#         cd t
#         ./perl -I../lib porting/podcheck.t --regen
# 
#    That should cause all current potential problems to be accepted by
#    the program, so that the next time it runs, they won't be flagged.
#    For a few files, such as perltoc, certain issues will always be
#    expected, and more of the same will be added over time.  For those,
#    before you do the regen, you can edit
#    /home/core/smoke/perl-current/t/porting/known_pod_issues.dat
#    and find the entry for the module's file and specific error message,
#    and change the count of known potential problems to -1.
# temp file: /home/core/tmp/Bc2kEsPfmD
Subroutine Time::HiRes::constant redefined at (eval 37) line 1.
Subroutine Time::HiRes::usleep redefined at (eval 37) line 1.
Subroutine Time::HiRes::nanosleep redefined at (eval 37) line 1.
Subroutine Time::HiRes::sleep redefined at (eval 37) line 1.
Subroutine Time::HiRes::ualarm redefined at (eval 37) line 1.
Subroutine Time::HiRes::alarm redefined at (eval 37) line 1.
Subroutine Time::HiRes::gettimeofday redefined at (eval 37) line 1.
Subroutine Time::HiRes::time redefined at (eval 37) line 1.
Subroutine Time::HiRes::setitimer redefined at (eval 37) line 1.
Subroutine Time::HiRes::getitimer redefined at (eval 37) line 1.
Subroutine Time::HiRes::utime redefined at (eval 37) line 1.
Subroutine Time::HiRes::clock_gettime redefined at (eval 37) line 1.
Subroutine Time::HiRes::clock_getres redefined at (eval 37) line 1.
Subroutine Time::HiRes::clock_nanosleep redefined at (eval 37) line 1.
Subroutine Time::HiRes::clock redefined at (eval 37) line 1.
Subroutine Time::HiRes::lstat redefined at (eval 37) line 1.
Subroutine Time::HiRes::stat redefined at (eval 37) line 1.
*** Error 1 in /home/core/smoke/perl-current (makefile:841 'test_harness')

error while running harness target 'test_harness': 2 at /home/core/smoke/TestSmoke/Test/Smoke/App/RunSmoke.pm line 118.
[2022-03-24 07:45:23-0400] 
[2022-03-24 07:45:23-0400] ../t/porting/podcheck.t.....................................FAILED
[2022-03-24 07:45:23-0400]     270
[2022-03-24 07:45:23-0400] Archived results...
[2022-03-24 07:45:23-0400] Unskip tests from '/home/core/smoke/TestSmoke/smokecurrent.skiptests'
[2022-03-24 07:45:23-0400] 
[2022-03-24 07:45:23-0400] Configuration: -Dusedevel -Dcc=clang -Duse64bitall
[2022-03-24 07:45:23-0400] ------------------------------------------------------------------------------
[2022-03-24 07:45:23-0400] make distclean ...
[2022-03-24 07:46:03-0400] 
[2022-03-24 07:46:03-0400] Copy Policy.sh ...
[2022-03-24 07:46:03-0400] 
[2022-03-24 07:46:03-0400] Configure ...
[2022-03-24 07:47:21-0400] 
[2022-03-24 07:47:21-0400] make ...
Warning (mostly harmless): No library found for -lndbm
Warning (mostly harmless): No library found for -ldbm
Warning (mostly harmless): No library found for -lucb
Warning (mostly harmless): No library found for -lposix
Warning (mostly harmless): No library found for -lcposix
In file included from HiRes.xs:859:
./const-c.inc:351:42: warning: unused parameter 'iv_return' [-Wunused-parameter]
constant_19 (pTHX_ const char *name, IV *iv_return) {
                                         ^
1 warning generated.
[2022-03-24 07:56:29-0400] Skip tests from '/home/core/smoke/TestSmoke/smokecurrent.skiptests'
[2022-03-24 07:56:29-0400] 
[2022-03-24 07:56:29-0400]  Tests start here:
[2022-03-24 07:56:29-0400] TSTENV = stdio	
#   " outside of any" 
#     '=item' '=over' near line 1358 of pod/perlunicode.pod
# See end of this test output for your options on silencing this
# 
# HOW TO GET porting/podcheck.t TO PASS
# 
# There was 1 file that had new potential problems identified.
# Some of them may be real, and some of them may be false positives because
# this program isn't as smart as it likes to think it is.  You can teach this
# program to ignore the issues it has identified, and hence pass, by doing the
# following:
# 
# 1) If a problem is about a link to an unknown module or man page that
#    you know exists, re-run the command something like:
#       ./perl -I../lib porting/podcheck.t --add_link MODULE man_page ...
#    (MODULEs should look like Foo::Bar, and man_pages should look like
#    bar(3c); don't do this for a module or man page that you aren't sure
#    about; instead treat as another type of issue and follow the
#    instructions below.)
# 
# 2) For other issues, decide if each should be fixed now or not.  Fix the
#    ones you decided to, and rerun this test to verify that the fixes
#    worked.
# 
# 3) If there remain false positive or problems that you don't plan to fix right
#    now,
#    run this test script by hand, using the following formula (on
#    Un*x-like machines):
#         cd t
#         ./perl -I../lib porting/podcheck.t --regen
# 
#    That should cause all current potential problems to be accepted by
#    the program, so that the next time it runs, they won't be flagged.
#    For a few files, such as perltoc, certain issues will always be
#    expected, and more of the same will be added over time.  For those,
#    before you do the regen, you can edit
#    /home/core/smoke/perl-current/t/porting/known_pod_issues.dat
#    and find the entry for the module's file and specific error message,
#    and change the count of known potential problems to -1.
# temp file: /home/core/tmp/UFqU0j0P3O
Subroutine Time::HiRes::constant redefined at (eval 37) line 1.
Subroutine Time::HiRes::usleep redefined at (eval 37) line 1.
Subroutine Time::HiRes::nanosleep redefined at (eval 37) line 1.
Subroutine Time::HiRes::sleep redefined at (eval 37) line 1.
Subroutine Time::HiRes::ualarm redefined at (eval 37) line 1.
Subroutine Time::HiRes::alarm redefined at (eval 37) line 1.
Subroutine Time::HiRes::gettimeofday redefined at (eval 37) line 1.
Subroutine Time::HiRes::time redefined at (eval 37) line 1.
Subroutine Time::HiRes::setitimer redefined at (eval 37) line 1.
Subroutine Time::HiRes::getitimer redefined at (eval 37) line 1.
Subroutine Time::HiRes::utime redefined at (eval 37) line 1.
Subroutine Time::HiRes::clock_gettime redefined at (eval 37) line 1.
Subroutine Time::HiRes::clock_getres redefined at (eval 37) line 1.
Subroutine Time::HiRes::clock_nanosleep redefined at (eval 37) line 1.
Subroutine Time::HiRes::clock redefined at (eval 37) line 1.
Subroutine Time::HiRes::lstat redefined at (eval 37) line 1.
Subroutine Time::HiRes::stat redefined at (eval 37) line 1.
*** Error 1 in /home/core/smoke/perl-current (makefile:841 'test_harness')

error while running harness target 'test_harness': 2 at /home/core/smoke/TestSmoke/Test/Smoke/App/RunSmoke.pm line 118.
[2022-03-24 08:35:25-0400] 
[2022-03-24 08:35:25-0400] ../t/porting/podcheck.t.....................................FAILED
[2022-03-24 08:35:25-0400]     270
[2022-03-24 08:35:25-0400] Archived results...
[2022-03-24 08:35:25-0400] Unskip tests from '/home/core/smoke/TestSmoke/smokecurrent.skiptests'
[2022-03-24 08:35:25-0400] 
[2022-03-24 08:35:25-0400] Configuration: -Dusedevel -Dcc=clang -Duse64bitall -DDEBUGGING
[2022-03-24 08:35:25-0400] ------------------------------------------------------------------------------
[2022-03-24 08:35:25-0400] make distclean ...
[2022-03-24 08:36:01-0400] 
[2022-03-24 08:36:01-0400] Copy Policy.sh ...
[2022-03-24 08:36:01-0400] 
[2022-03-24 08:36:01-0400] Configure ...
[2022-03-24 08:37:26-0400] 
[2022-03-24 08:37:26-0400] make ...
Warning (mostly harmless): No library found for -lndbm
Warning (mostly harmless): No library found for -ldbm
Warning (mostly harmless): No library found for -lucb
Warning (mostly harmless): No library found for -lposix
Warning (mostly harmless): No library found for -lcposix
In file included from HiRes.xs:859:
./const-c.inc:351:42: warning: unused parameter 'iv_return' [-Wunused-parameter]
constant_19 (pTHX_ const char *name, IV *iv_return) {
                                         ^
1 warning generated.
[2022-03-24 08:49:28-0400] Skip tests from '/home/core/smoke/TestSmoke/smokecurrent.skiptests'
[2022-03-24 08:49:28-0400] 
[2022-03-24 08:49:28-0400]  Tests start here:
[2022-03-24 08:49:28-0400] TSTENV = stdio	
#   " outside of any" 
#     '=item' '=over' near line 1358 of pod/perlunicode.pod
# See end of this test output for your options on silencing this
# 
# HOW TO GET porting/podcheck.t TO PASS
# 
# There was 1 file that had new potential problems identified.
# Some of them may be real, and some of them may be false positives because
# this program isn't as smart as it likes to think it is.  You can teach this
# program to ignore the issues it has identified, and hence pass, by doing the
# following:
# 
# 1) If a problem is about a link to an unknown module or man page that
#    you know exists, re-run the command something like:
#       ./perl -I../lib porting/podcheck.t --add_link MODULE man_page ...
#    (MODULEs should look like Foo::Bar, and man_pages should look like
#    bar(3c); don't do this for a module or man page that you aren't sure
#    about; instead treat as another type of issue and follow the
#    instructions below.)
# 
# 2) For other issues, decide if each should be fixed now or not.  Fix the
#    ones you decided to, and rerun this test to verify that the fixes
#    worked.
# 
# 3) If there remain false positive or problems that you don't plan to fix right
#    now,
#    run this test script by hand, using the following formula (on
#    Un*x-like machines):
#         cd t
#         ./perl -I../lib porting/podcheck.t --regen
# 
#    That should cause all current potential problems to be accepted by
#    the program, so that the next time it runs, they won't be flagged.
#    For a few files, such as perltoc, certain issues will always be
#    expected, and more of the same will be added over time.  For those,
#    before you do the regen, you can edit
#    /home/core/smoke/perl-current/t/porting/known_pod_issues.dat
#    and find the entry for the module's file and specific error message,
#    and change the count of known potential problems to -1.
# temp file: /home/core/tmp/kovF5NCXXT
Subroutine Time::HiRes::constant redefined at (eval 37) line 1.
Subroutine Time::HiRes::usleep redefined at (eval 37) line 1.
Subroutine Time::HiRes::nanosleep redefined at (eval 37) line 1.
Subroutine Time::HiRes::sleep redefined at (eval 37) line 1.
Subroutine Time::HiRes::ualarm redefined at (eval 37) line 1.
Subroutine Time::HiRes::alarm redefined at (eval 37) line 1.
Subroutine Time::HiRes::gettimeofday redefined at (eval 37) line 1.
Subroutine Time::HiRes::time redefined at (eval 37) line 1.
Subroutine Time::HiRes::setitimer redefined at (eval 37) line 1.
Subroutine Time::HiRes::getitimer redefined at (eval 37) line 1.
Subroutine Time::HiRes::utime redefined at (eval 37) line 1.
Subroutine Time::HiRes::clock_gettime redefined at (eval 37) line 1.
Subroutine Time::HiRes::clock_getres redefined at (eval 37) line 1.
Subroutine Time::HiRes::clock_nanosleep redefined at (eval 37) line 1.
Subroutine Time::HiRes::clock redefined at (eval 37) line 1.
Subroutine Time::HiRes::lstat redefined at (eval 37) line 1.
Subroutine Time::HiRes::stat redefined at (eval 37) line 1.
*** Error 1 in /home/core/smoke/perl-current (makefile:841 'test_harness')

error while running harness target 'test_harness': 2 at /home/core/smoke/TestSmoke/Test/Smoke/App/RunSmoke.pm line 118.
[2022-03-24 09:34:16-0400] 
[2022-03-24 09:34:16-0400] ../t/porting/podcheck.t.....................................FAILED
[2022-03-24 09:34:16-0400]     270
[2022-03-24 09:34:16-0400] Archived results...
[2022-03-24 09:34:16-0400] Unskip tests from '/home/core/smoke/TestSmoke/smokecurrent.skiptests'
[2022-03-24 09:34:16-0400] 
[2022-03-24 09:34:16-0400] Configuration: -Dusedevel -Dcc=clang -Duselongdouble
[2022-03-24 09:34:16-0400] ------------------------------------------------------------------------------
[2022-03-24 09:34:16-0400] make distclean ...
[2022-03-24 09:34:55-0400] 
[2022-03-24 09:34:55-0400] Copy Policy.sh ...
[2022-03-24 09:34:55-0400] 
[2022-03-24 09:34:55-0400] Configure ...
[2022-03-24 09:36:15-0400] 
[2022-03-24 09:36:15-0400] make ...
Warning (mostly harmless): No library found for -lndbm
Warning (mostly harmless): No library found for -ldbm
Warning (mostly harmless): No library found for -lucb
Warning (mostly harmless): No library found for -lposix
Warning (mostly harmless): No library found for -lcposix
In file included from HiRes.xs:859:
./const-c.inc:351:42: warning: unused parameter 'iv_return' [-Wunused-parameter]
constant_19 (pTHX_ const char *name, IV *iv_return) {
                                         ^
1 warning generated.
[2022-03-24 09:45:18-0400] Skip tests from '/home/core/smoke/TestSmoke/smokecurrent.skiptests'
[2022-03-24 09:45:18-0400] 
[2022-03-24 09:45:18-0400]  Tests start here:
[2022-03-24 09:45:18-0400] TSTENV = stdio	
#   " outside of any" 
#     '=item' '=over' near line 1358 of pod/perlunicode.pod
# See end of this test output for your options on silencing this
# 
# HOW TO GET porting/podcheck.t TO PASS
# 
# There was 1 file that had new potential problems identified.
# Some of them may be real, and some of them may be false positives because
# this program isn't as smart as it likes to think it is.  You can teach this
# program to ignore the issues it has identified, and hence pass, by doing the
# following:
# 
# 1) If a problem is about a link to an unknown module or man page that
#    you know exists, re-run the command something like:
#       ./perl -I../lib porting/podcheck.t --add_link MODULE man_page ...
#    (MODULEs should look like Foo::Bar, and man_pages should look like
#    bar(3c); don't do this for a module or man page that you aren't sure
#    about; instead treat as another type of issue and follow the
#    instructions below.)
# 
# 2) For other issues, decide if each should be fixed now or not.  Fix the
#    ones you decided to, and rerun this test to verify that the fixes
#    worked.
# 
# 3) If there remain false positive or problems that you don't plan to fix right
#    now,
#    run this test script by hand, using the following formula (on
#    Un*x-like machines):
#         cd t
#         ./perl -I../lib porting/podcheck.t --regen
# 
#    That should cause all current potential problems to be accepted by
#    the program, so that the next time it runs, they won't be flagged.
#    For a few files, such as perltoc, certain issues will always be
#    expected, and more of the same will be added over time.  For those,
#    before you do the regen, you can edit
#    /home/core/smoke/perl-current/t/porting/known_pod_issues.dat
#    and find the entry for the module's file and specific error message,
#    and change the count of known potential problems to -1.
# temp file: /home/core/tmp/mP6YaoX2mH
Subroutine Time::HiRes::constant redefined at (eval 37) line 1.
Subroutine Time::HiRes::usleep redefined at (eval 37) line 1.
Subroutine Time::HiRes::nanosleep redefined at (eval 37) line 1.
Subroutine Time::HiRes::sleep redefined at (eval 37) line 1.
Subroutine Time::HiRes::ualarm redefined at (eval 37) line 1.
Subroutine Time::HiRes::alarm redefined at (eval 37) line 1.
Subroutine Time::HiRes::gettimeofday redefined at (eval 37) line 1.
Subroutine Time::HiRes::time redefined at (eval 37) line 1.
Subroutine Time::HiRes::setitimer redefined at (eval 37) line 1.
Subroutine Time::HiRes::getitimer redefined at (eval 37) line 1.
Subroutine Time::HiRes::utime redefined at (eval 37) line 1.
Subroutine Time::HiRes::clock_gettime redefined at (eval 37) line 1.
Subroutine Time::HiRes::clock_getres redefined at (eval 37) line 1.
Subroutine Time::HiRes::clock_nanosleep redefined at (eval 37) line 1.
Subroutine Time::HiRes::clock redefined at (eval 37) line 1.
Subroutine Time::HiRes::lstat redefined at (eval 37) line 1.
Subroutine Time::HiRes::stat redefined at (eval 37) line 1.
*** Error 1 in /home/core/smoke/perl-current (makefile:841 'test_harness')

error while running harness target 'test_harness': 2 at /home/core/smoke/TestSmoke/Test/Smoke/App/RunSmoke.pm line 118.
[2022-03-24 10:24:25-0400] 
[2022-03-24 10:24:25-0400] ../t/porting/podcheck.t.....................................FAILED
[2022-03-24 10:24:25-0400]     270
[2022-03-24 10:24:25-0400] Archived results...
[2022-03-24 10:24:25-0400] Unskip tests from '/home/core/smoke/TestSmoke/smokecurrent.skiptests'
[2022-03-24 10:24:25-0400] 
[2022-03-24 10:24:25-0400] Configuration: -Dusedevel -Dcc=clang -Duselongdouble -DDEBUGGING
[2022-03-24 10:24:25-0400] ------------------------------------------------------------------------------
[2022-03-24 10:24:25-0400] make distclean ...
[2022-03-24 10:25:01-0400] 
[2022-03-24 10:25:01-0400] Copy Policy.sh ...
[2022-03-24 10:25:01-0400] 
[2022-03-24 10:25:01-0400] Configure ...
[2022-03-24 10:26:21-0400] 
[2022-03-24 10:26:21-0400] make ...
Warning (mostly harmless): No library found for -lndbm
Warning (mostly harmless): No library found for -ldbm
Warning (mostly harmless): No library found for -lucb
Warning (mostly harmless): No library found for -lposix
Warning (mostly harmless): No library found for -lcposix
In file included from HiRes.xs:859:
./const-c.inc:351:42: warning: unused parameter 'iv_return' [-Wunused-parameter]
constant_19 (pTHX_ const char *name, IV *iv_return) {
                                         ^
1 warning generated.
[2022-03-24 10:38:19-0400] Skip tests from '/home/core/smoke/TestSmoke/smokecurrent.skiptests'
[2022-03-24 10:38:19-0400] 
[2022-03-24 10:38:19-0400]  Tests start here:
[2022-03-24 10:38:19-0400] TSTENV = stdio	
#   " outside of any" 
#     '=item' '=over' near line 1358 of pod/perlunicode.pod
# See end of this test output for your options on silencing this
# 
# HOW TO GET porting/podcheck.t TO PASS
# 
# There was 1 file that had new potential problems identified.
# Some of them may be real, and some of them may be false positives because
# this program isn't as smart as it likes to think it is.  You can teach this
# program to ignore the issues it has identified, and hence pass, by doing the
# following:
# 
# 1) If a problem is about a link to an unknown module or man page that
#    you know exists, re-run the command something like:
#       ./perl -I../lib porting/podcheck.t --add_link MODULE man_page ...
#    (MODULEs should look like Foo::Bar, and man_pages should look like
#    bar(3c); don't do this for a module or man page that you aren't sure
#    about; instead treat as another type of issue and follow the
#    instructions below.)
# 
# 2) For other issues, decide if each should be fixed now or not.  Fix the
#    ones you decided to, and rerun this test to verify that the fixes
#    worked.
# 
# 3) If there remain false positive or problems that you don't plan to fix right
#    now,
#    run this test script by hand, using the following formula (on
#    Un*x-like machines):
#         cd t
#         ./perl -I../lib porting/podcheck.t --regen
# 
#    That should cause all current potential problems to be accepted by
#    the program, so that the next time it runs, they won't be flagged.
#    For a few files, such as perltoc, certain issues will always be
#    expected, and more of the same will be added over time.  For those,
#    before you do the regen, you can edit
#    /home/core/smoke/perl-current/t/porting/known_pod_issues.dat
#    and find the entry for the module's file and specific error message,
#    and change the count of known potential problems to -1.
# temp file: /home/core/tmp/7h1SwFMw1G
Subroutine Time::HiRes::constant redefined at (eval 37) line 1.
Subroutine Time::HiRes::usleep redefined at (eval 37) line 1.
Subroutine Time::HiRes::nanosleep redefined at (eval 37) line 1.
Subroutine Time::HiRes::sleep redefined at (eval 37) line 1.
Subroutine Time::HiRes::ualarm redefined at (eval 37) line 1.
Subroutine Time::HiRes::alarm redefined at (eval 37) line 1.
Subroutine Time::HiRes::gettimeofday redefined at (eval 37) line 1.
Subroutine Time::HiRes::time redefined at (eval 37) line 1.
Subroutine Time::HiRes::setitimer redefined at (eval 37) line 1.
Subroutine Time::HiRes::getitimer redefined at (eval 37) line 1.
Subroutine Time::HiRes::utime redefined at (eval 37) line 1.
Subroutine Time::HiRes::clock_gettime redefined at (eval 37) line 1.
Subroutine Time::HiRes::clock_getres redefined at (eval 37) line 1.
Subroutine Time::HiRes::clock_nanosleep redefined at (eval 37) line 1.
Subroutine Time::HiRes::clock redefined at (eval 37) line 1.
Subroutine Time::HiRes::lstat redefined at (eval 37) line 1.
Subroutine Time::HiRes::stat redefined at (eval 37) line 1.
*** Error 1 in /home/core/smoke/perl-current (makefile:841 'test_harness')

error while running harness target 'test_harness': 2 at /home/core/smoke/TestSmoke/Test/Smoke/App/RunSmoke.pm line 118.
[2022-03-24 11:22:51-0400] 
[2022-03-24 11:22:51-0400] ../t/porting/podcheck.t.....................................FAILED
[2022-03-24 11:22:51-0400]     270
[2022-03-24 11:22:51-0400] Archived results...
[2022-03-24 11:22:51-0400] Unskip tests from '/home/core/smoke/TestSmoke/smokecurrent.skiptests'
[2022-03-24 11:22:51-0400] 
[2022-03-24 11:22:51-0400] Configuration: -Dusedevel -Dcc=clang -Duseithreads
[2022-03-24 11:22:51-0400] ------------------------------------------------------------------------------
[2022-03-24 11:22:51-0400] make distclean ...
[2022-03-24 11:23:30-0400] 
[2022-03-24 11:23:30-0400] Copy Policy.sh ...
[2022-03-24 11:23:30-0400] 
[2022-03-24 11:23:30-0400] Configure ...
[2022-03-24 11:24:55-0400] 
[2022-03-24 11:24:55-0400] make ...
Warning (mostly harmless): No library found for -lndbm
Warning (mostly harmless): No library found for -ldbm
Warning (mostly harmless): No library found for -lucb
Warning (mostly harmless): No library found for -lposix
Warning (mostly harmless): No library found for -lcposix
In file included from HiRes.xs:859:
./const-c.inc:351:42: warning: unused parameter 'iv_return' [-Wunused-parameter]
constant_19 (pTHX_ const char *name, IV *iv_return) {
                                         ^
1 warning generated.
[2022-03-24 11:34:17-0400] Skip tests from '/home/core/smoke/TestSmoke/smokecurrent.skiptests'
[2022-03-24 11:34:17-0400] 
[2022-03-24 11:34:17-0400]  Tests start here:
[2022-03-24 11:34:17-0400] TSTENV = stdio	
#   " outside of any" 
#     '=item' '=over' near line 1358 of pod/perlunicode.pod
# See end of this test output for your options on silencing this
# 
# HOW TO GET porting/podcheck.t TO PASS
# 
# There was 1 file that had new potential problems identified.
# Some of them may be real, and some of them may be false positives because
# this program isn't as smart as it likes to think it is.  You can teach this
# program to ignore the issues it has identified, and hence pass, by doing the
# following:
# 
# 1) If a problem is about a link to an unknown module or man page that
#    you know exists, re-run the command something like:
#       ./perl -I../lib porting/podcheck.t --add_link MODULE man_page ...
#    (MODULEs should look like Foo::Bar, and man_pages should look like
#    bar(3c); don't do this for a module or man page that you aren't sure
#    about; instead treat as another type of issue and follow the
#    instructions below.)
# 
# 2) For other issues, decide if each should be fixed now or not.  Fix the
#    ones you decided to, and rerun this test to verify that the fixes
#    worked.
# 
# 3) If there remain false positive or problems that you don't plan to fix right
#    now,
#    run this test script by hand, using the following formula (on
#    Un*x-like machines):
#         cd t
#         ./perl -I../lib porting/podcheck.t --regen
# 
#    That should cause all current potential problems to be accepted by
#    the program, so that the next time it runs, they won't be flagged.
#    For a few files, such as perltoc, certain issues will always be
#    expected, and more of the same will be added over time.  For those,
#    before you do the regen, you can edit
#    /home/core/smoke/perl-current/t/porting/known_pod_issues.dat
#    and find the entry for the module's file and specific error message,
#    and change the count of known potential problems to -1.
# temp file: /home/core/tmp/jTqHYHqVaG
Subroutine Time::HiRes::constant redefined at (eval 37) line 1.
Subroutine Time::HiRes::usleep redefined at (eval 37) line 1.
Subroutine Time::HiRes::nanosleep redefined at (eval 37) line 1.
Subroutine Time::HiRes::sleep redefined at (eval 37) line 1.
Subroutine Time::HiRes::ualarm redefined at (eval 37) line 1.
Subroutine Time::HiRes::alarm redefined at (eval 37) line 1.
Subroutine Time::HiRes::gettimeofday redefined at (eval 37) line 1.
Subroutine Time::HiRes::time redefined at (eval 37) line 1.
Subroutine Time::HiRes::setitimer redefined at (eval 37) line 1.
Subroutine Time::HiRes::getitimer redefined at (eval 37) line 1.
Subroutine Time::HiRes::utime redefined at (eval 37) line 1.
Subroutine Time::HiRes::clock_gettime redefined at (eval 37) line 1.
Subroutine Time::HiRes::clock_getres redefined at (eval 37) line 1.
Subroutine Time::HiRes::clock_nanosleep redefined at (eval 37) line 1.
Subroutine Time::HiRes::clock redefined at (eval 37) line 1.
Subroutine Time::HiRes::lstat redefined at (eval 37) line 1.
Subroutine Time::HiRes::stat redefined at (eval 37) line 1.
*** Error 1 in /home/core/smoke/perl-current (makefile:841 'test_harness')

error while running harness target 'test_harness': 2 at /home/core/smoke/TestSmoke/Test/Smoke/App/RunSmoke.pm line 118.
[2022-03-24 12:19:42-0400] 
[2022-03-24 12:19:42-0400] ../t/porting/podcheck.t.....................................FAILED
[2022-03-24 12:19:42-0400]     270
[2022-03-24 12:19:42-0400] Archived results...
[2022-03-24 12:19:42-0400] Unskip tests from '/home/core/smoke/TestSmoke/smokecurrent.skiptests'
[2022-03-24 12:19:42-0400] 
[2022-03-24 12:19:42-0400] Configuration: -Dusedevel -Dcc=clang -Duseithreads -DDEBUGGING
[2022-03-24 12:19:42-0400] ------------------------------------------------------------------------------
[2022-03-24 12:19:42-0400] make distclean ...
[2022-03-24 12:20:19-0400] 
[2022-03-24 12:20:19-0400] Copy Policy.sh ...
[2022-03-24 12:20:19-0400] 
[2022-03-24 12:20:19-0400] Configure ...
[2022-03-24 12:21:46-0400] 
[2022-03-24 12:21:46-0400] make ...
Warning (mostly harmless): No library found for -lndbm
Warning (mostly harmless): No library found for -ldbm
Warning (mostly harmless): No library found for -lucb
Warning (mostly harmless): No library found for -lposix
Warning (mostly harmless): No library found for -lcposix
In file included from HiRes.xs:859:
./const-c.inc:351:42: warning: unused parameter 'iv_return' [-Wunused-parameter]
constant_19 (pTHX_ const char *name, IV *iv_return) {
                                         ^
1 warning generated.
[2022-03-24 12:34:54-0400] Skip tests from '/home/core/smoke/TestSmoke/smokecurrent.skiptests'
[2022-03-24 12:34:54-0400] 
[2022-03-24 12:34:54-0400]  Tests start here:
[2022-03-24 12:34:54-0400] TSTENV = stdio	
#   " outside of any" 
#     '=item' '=over' near line 1358 of pod/perlunicode.pod
# See end of this test output for your options on silencing this
# 
# HOW TO GET porting/podcheck.t TO PASS
# 
# There was 1 file that had new potential problems identified.
# Some of them may be real, and some of them may be false positives because
# this program isn't as smart as it likes to think it is.  You can teach this
# program to ignore the issues it has identified, and hence pass, by doing the
# following:
# 
# 1) If a problem is about a link to an unknown module or man page that
#    you know exists, re-run the command something like:
#       ./perl -I../lib porting/podcheck.t --add_link MODULE man_page ...
#    (MODULEs should look like Foo::Bar, and man_pages should look like
#    bar(3c); don't do this for a module or man page that you aren't sure
#    about; instead treat as another type of issue and follow the
#    instructions below.)
# 
# 2) For other issues, decide if each should be fixed now or not.  Fix the
#    ones you decided to, and rerun this test to verify that the fixes
#    worked.
# 
# 3) If there remain false positive or problems that you don't plan to fix right
#    now,
#    run this test script by hand, using the following formula (on
#    Un*x-like machines):
#         cd t
#         ./perl -I../lib porting/podcheck.t --regen
# 
#    That should cause all current potential problems to be accepted by
#    the program, so that the next time it runs, they won't be flagged.
#    For a few files, such as perltoc, certain issues will always be
#    expected, and more of the same will be added over time.  For those,
#    before you do the regen, you can edit
#    /home/core/smoke/perl-current/t/porting/known_pod_issues.dat
#    and find the entry for the module's file and specific error message,
#    and change the count of known potential problems to -1.
# temp file: /home/core/tmp/NEzXAUYSY5
Subroutine Time::HiRes::constant redefined at (eval 37) line 1.
Subroutine Time::HiRes::usleep redefined at (eval 37) line 1.
Subroutine Time::HiRes::nanosleep redefined at (eval 37) line 1.
Subroutine Time::HiRes::sleep redefined at (eval 37) line 1.
Subroutine Time::HiRes::ualarm redefined at (eval 37) line 1.
Subroutine Time::HiRes::alarm redefined at (eval 37) line 1.
Subroutine Time::HiRes::gettimeofday redefined at (eval 37) line 1.
Subroutine Time::HiRes::time redefined at (eval 37) line 1.
Subroutine Time::HiRes::setitimer redefined at (eval 37) line 1.
Subroutine Time::HiRes::getitimer redefined at (eval 37) line 1.
Subroutine Time::HiRes::utime redefined at (eval 37) line 1.
Subroutine Time::HiRes::clock_gettime redefined at (eval 37) line 1.
Subroutine Time::HiRes::clock_getres redefined at (eval 37) line 1.
Subroutine Time::HiRes::clock_nanosleep redefined at (eval 37) line 1.
Subroutine Time::HiRes::clock redefined at (eval 37) line 1.
Subroutine Time::HiRes::lstat redefined at (eval 37) line 1.
Subroutine Time::HiRes::stat redefined at (eval 37) line 1.
*** Error 1 in /home/core/smoke/perl-current (makefile:841 'test_harness')

error while running harness target 'test_harness': 2 at /home/core/smoke/TestSmoke/Test/Smoke/App/RunSmoke.pm line 118.
[2022-03-24 13:32:14-0400] 
[2022-03-24 13:32:14-0400] ../t/porting/podcheck.t.....................................FAILED
[2022-03-24 13:32:14-0400]     270
[2022-03-24 13:32:14-0400] Archived results...
[2022-03-24 13:32:14-0400] Unskip tests from '/home/core/smoke/TestSmoke/smokecurrent.skiptests'
[2022-03-24 13:32:14-0400] 
[2022-03-24 13:32:14-0400] Configuration: -Dusedevel -Dcc=clang -Duseithreads -Duse64bitall
[2022-03-24 13:32:14-0400] ------------------------------------------------------------------------------
[2022-03-24 13:32:14-0400] make distclean ...
[2022-03-24 13:33:01-0400] 
[2022-03-24 13:33:01-0400] Copy Policy.sh ...
[2022-03-24 13:33:01-0400] 
[2022-03-24 13:33:01-0400] Configure ...
[2022-03-24 13:34:26-0400] 
[2022-03-24 13:34:26-0400] make ...
Warning (mostly harmless): No library found for -lndbm
Warning (mostly harmless): No library found for -ldbm
Warning (mostly harmless): No library found for -lucb
Warning (mostly harmless): No library found for -lposix
Warning (mostly harmless): No library found for -lcposix
In file included from HiRes.xs:859:
./const-c.inc:351:42: warning: unused parameter 'iv_return' [-Wunused-parameter]
constant_19 (pTHX_ const char *name, IV *iv_return) {
                                         ^
1 warning generated.
[2022-03-24 13:43:52-0400] Skip tests from '/home/core/smoke/TestSmoke/smokecurrent.skiptests'
[2022-03-24 13:43:52-0400] 
[2022-03-24 13:43:52-0400]  Tests start here:
[2022-03-24 13:43:52-0400] TSTENV = stdio	
#   " outside of any" 
#     '=item' '=over' near line 1358 of pod/perlunicode.pod
# See end of this test output for your options on silencing this
# 
# HOW TO GET porting/podcheck.t TO PASS
# 
# There was 1 file that had new potential problems identified.
# Some of them may be real, and some of them may be false positives because
# this program isn't as smart as it likes to think it is.  You can teach this
# program to ignore the issues it has identified, and hence pass, by doing the
# following:
# 
# 1) If a problem is about a link to an unknown module or man page that
#    you know exists, re-run the command something like:
#       ./perl -I../lib porting/podcheck.t --add_link MODULE man_page ...
#    (MODULEs should look like Foo::Bar, and man_pages should look like
#    bar(3c); don't do this for a module or man page that you aren't sure
#    about; instead treat as another type of issue and follow the
#    instructions below.)
# 
# 2) For other issues, decide if each should be fixed now or not.  Fix the
#    ones you decided to, and rerun this test to verify that the fixes
#    worked.
# 
# 3) If there remain false positive or problems that you don't plan to fix right
#    now,
#    run this test script by hand, using the following formula (on
#    Un*x-like machines):
#         cd t
#         ./perl -I../lib porting/podcheck.t --regen
# 
#    That should cause all current potential problems to be accepted by
#    the program, so that the next time it runs, they won't be flagged.
#    For a few files, such as perltoc, certain issues will always be
#    expected, and more of the same will be added over time.  For those,
#    before you do the regen, you can edit
#    /home/core/smoke/perl-current/t/porting/known_pod_issues.dat
#    and find the entry for the module's file and specific error message,
#    and change the count of known potential problems to -1.
# temp file: /home/core/tmp/uTzKjtuKjM
Subroutine Time::HiRes::constant redefined at (eval 37) line 1.
Subroutine Time::HiRes::usleep redefined at (eval 37) line 1.
Subroutine Time::HiRes::nanosleep redefined at (eval 37) line 1.
Subroutine Time::HiRes::sleep redefined at (eval 37) line 1.
Subroutine Time::HiRes::ualarm redefined at (eval 37) line 1.
Subroutine Time::HiRes::alarm redefined at (eval 37) line 1.
Subroutine Time::HiRes::gettimeofday redefined at (eval 37) line 1.
Subroutine Time::HiRes::time redefined at (eval 37) line 1.
Subroutine Time::HiRes::setitimer redefined at (eval 37) line 1.
Subroutine Time::HiRes::getitimer redefined at (eval 37) line 1.
Subroutine Time::HiRes::utime redefined at (eval 37) line 1.
Subroutine Time::HiRes::clock_gettime redefined at (eval 37) line 1.
Subroutine Time::HiRes::clock_getres redefined at (eval 37) line 1.
Subroutine Time::HiRes::clock_nanosleep redefined at (eval 37) line 1.
Subroutine Time::HiRes::clock redefined at (eval 37) line 1.
Subroutine Time::HiRes::lstat redefined at (eval 37) line 1.
Subroutine Time::HiRes::stat redefined at (eval 37) line 1.
*** Error 1 in /home/core/smoke/perl-current (makefile:841 'test_harness')

error while running harness target 'test_harness': 2 at /home/core/smoke/TestSmoke/Test/Smoke/App/RunSmoke.pm line 118.
[2022-03-24 14:29:42-0400] 
[2022-03-24 14:29:42-0400] ../t/porting/podcheck.t.....................................FAILED
[2022-03-24 14:29:42-0400]     270
[2022-03-24 14:29:42-0400] Archived results...
[2022-03-24 14:29:42-0400] Unskip tests from '/home/core/smoke/TestSmoke/smokecurrent.skiptests'
[2022-03-24 14:29:42-0400] 
[2022-03-24 14:29:42-0400] Configuration: -Dusedevel -Dcc=clang -Duseithreads -Duse64bitall -DDEBUGGING
[2022-03-24 14:29:42-0400] ------------------------------------------------------------------------------
[2022-03-24 14:29:42-0400] make distclean ...
[2022-03-24 14:30:20-0400] 
[2022-03-24 14:30:20-0400] Copy Policy.sh ...
[2022-03-24 14:30:20-0400] 
[2022-03-24 14:30:20-0400] Configure ...
[2022-03-24 14:31:47-0400] 
[2022-03-24 14:31:47-0400] make ...
Warning (mostly harmless): No library found for -lndbm
Warning (mostly harmless): No library found for -ldbm
Warning (mostly harmless): No library found for -lucb
Warning (mostly harmless): No library found for -lposix
Warning (mostly harmless): No library found for -lcposix
In file included from HiRes.xs:859:
./const-c.inc:351:42: warning: unused parameter 'iv_return' [-Wunused-parameter]
constant_19 (pTHX_ const char *name, IV *iv_return) {
                                         ^
1 warning generated.
[2022-03-24 14:44:50-0400] Skip tests from '/home/core/smoke/TestSmoke/smokecurrent.skiptests'
[2022-03-24 14:44:50-0400] 
[2022-03-24 14:44:50-0400]  Tests start here:
[2022-03-24 14:44:50-0400] TSTENV = stdio	
#   " outside of any" 
#     '=item' '=over' near line 1358 of pod/perlunicode.pod
# See end of this test output for your options on silencing this
# 
# HOW TO GET porting/podcheck.t TO PASS
# 
# There was 1 file that had new potential problems identified.
# Some of them may be real, and some of them may be false positives because
# this program isn't as smart as it likes to think it is.  You can teach this
# program to ignore the issues it has identified, and hence pass, by doing the
# following:
# 
# 1) If a problem is about a link to an unknown module or man page that
#    you know exists, re-run the command something like:
#       ./perl -I../lib porting/podcheck.t --add_link MODULE man_page ...
#    (MODULEs should look like Foo::Bar, and man_pages should look like
#    bar(3c); don't do this for a module or man page that you aren't sure
#    about; instead treat as another type of issue and follow the
#    instructions below.)
# 
# 2) For other issues, decide if each should be fixed now or not.  Fix the
#    ones you decided to, and rerun this test to verify that the fixes
#    worked.
# 
# 3) If there remain false positive or problems that you don't plan to fix right
#    now,
#    run this test script by hand, using the following formula (on
#    Un*x-like machines):
#         cd t
#         ./perl -I../lib porting/podcheck.t --regen
# 
#    That should cause all current potential problems to be accepted by
#    the program, so that the next time it runs, they won't be flagged.
#    For a few files, such as perltoc, certain issues will always be
#    expected, and more of the same will be added over time.  For those,
#    before you do the regen, you can edit
#    /home/core/smoke/perl-current/t/porting/known_pod_issues.dat
#    and find the entry for the module's file and specific error message,
#    and change the count of known potential problems to -1.
# temp file: /home/core/tmp/wHiqUjvVRu
Subroutine Time::HiRes::constant redefined at (eval 37) line 1.
Subroutine Time::HiRes::usleep redefined at (eval 37) line 1.
Subroutine Time::HiRes::nanosleep redefined at (eval 37) line 1.
Subroutine Time::HiRes::sleep redefined at (eval 37) line 1.
Subroutine Time::HiRes::ualarm redefined at (eval 37) line 1.
Subroutine Time::HiRes::alarm redefined at (eval 37) line 1.
Subroutine Time::HiRes::gettimeofday redefined at (eval 37) line 1.
Subroutine Time::HiRes::time redefined at (eval 37) line 1.
Subroutine Time::HiRes::setitimer redefined at (eval 37) line 1.
Subroutine Time::HiRes::getitimer redefined at (eval 37) line 1.
Subroutine Time::HiRes::utime redefined at (eval 37) line 1.
Subroutine Time::HiRes::clock_gettime redefined at (eval 37) line 1.
Subroutine Time::HiRes::clock_getres redefined at (eval 37) line 1.
Subroutine Time::HiRes::clock_nanosleep redefined at (eval 37) line 1.
Subroutine Time::HiRes::clock redefined at (eval 37) line 1.
Subroutine Time::HiRes::lstat redefined at (eval 37) line 1.
Subroutine Time::HiRes::stat redefined at (eval 37) line 1.
*** Error 1 in /home/core/smoke/perl-current (makefile:841 'test_harness')

error while running harness target 'test_harness': 2 at /home/core/smoke/TestSmoke/Test/Smoke/App/RunSmoke.pm line 118.
[2022-03-24 15:41:30-0400] 
[2022-03-24 15:41:30-0400] ../t/porting/podcheck.t.....................................FAILED
[2022-03-24 15:41:30-0400]     270
[2022-03-24 15:41:30-0400] Archived results...
[2022-03-24 15:41:30-0400] Unskip tests from '/home/core/smoke/TestSmoke/smokecurrent.skiptests'
[2022-03-24 15:41:30-0400] 
[2022-03-24 15:41:30-0400] Configuration: -Dusedevel -Dcc=clang -Duseithreads -Duselongdouble
[2022-03-24 15:41:30-0400] ------------------------------------------------------------------------------
[2022-03-24 15:41:30-0400] make distclean ...
[2022-03-24 15:42:16-0400] 
[2022-03-24 15:42:16-0400] Copy Policy.sh ...
[2022-03-24 15:42:16-0400] 
[2022-03-24 15:42:16-0400] Configure ...
[2022-03-24 15:43:41-0400] 
[2022-03-24 15:43:41-0400] make ...
Warning (mostly harmless): No library found for -lndbm
Warning (mostly harmless): No library found for -ldbm
Warning (mostly harmless): No library found for -lucb
Warning (mostly harmless): No library found for -lposix
Warning (mostly harmless): No library found for -lcposix
In file included from HiRes.xs:859:
./const-c.inc:351:42: warning: unused parameter 'iv_return' [-Wunused-parameter]
constant_19 (pTHX_ const char *name, IV *iv_return) {
                                         ^
1 warning generated.
[2022-03-24 15:53:06-0400] Skip tests from '/home/core/smoke/TestSmoke/smokecurrent.skiptests'
[2022-03-24 15:53:06-0400] 
[2022-03-24 15:53:06-0400]  Tests start here:
[2022-03-24 15:53:06-0400] TSTENV = stdio	
#   " outside of any" 
#     '=item' '=over' near line 1358 of pod/perlunicode.pod
# See end of this test output for your options on silencing this
# 
# HOW TO GET porting/podcheck.t TO PASS
# 
# There was 1 file that had new potential problems identified.
# Some of them may be real, and some of them may be false positives because
# this program isn't as smart as it likes to think it is.  You can teach this
# program to ignore the issues it has identified, and hence pass, by doing the
# following:
# 
# 1) If a problem is about a link to an unknown module or man page that
#    you know exists, re-run the command something like:
#       ./perl -I../lib porting/podcheck.t --add_link MODULE man_page ...
#    (MODULEs should look like Foo::Bar, and man_pages should look like
#    bar(3c); don't do this for a module or man page that you aren't sure
#    about; instead treat as another type of issue and follow the
#    instructions below.)
# 
# 2) For other issues, decide if each should be fixed now or not.  Fix the
#    ones you decided to, and rerun this test to verify that the fixes
#    worked.
# 
# 3) If there remain false positive or problems that you don't plan to fix right
#    now,
#    run this test script by hand, using the following formula (on
#    Un*x-like machines):
#         cd t
#         ./perl -I../lib porting/podcheck.t --regen
# 
#    That should cause all current potential problems to be accepted by
#    the program, so that the next time it runs, they won't be flagged.
#    For a few files, such as perltoc, certain issues will always be
#    expected, and more of the same will be added over time.  For those,
#    before you do the regen, you can edit
#    /home/core/smoke/perl-current/t/porting/known_pod_issues.dat
#    and find the entry for the module's file and specific error message,
#    and change the count of known potential problems to -1.
# temp file: /home/core/tmp/GOVm_Qw8OP
Subroutine Time::HiRes::constant redefined at (eval 37) line 1.
Subroutine Time::HiRes::usleep redefined at (eval 37) line 1.
Subroutine Time::HiRes::nanosleep redefined at (eval 37) line 1.
Subroutine Time::HiRes::sleep redefined at (eval 37) line 1.
Subroutine Time::HiRes::ualarm redefined at (eval 37) line 1.
Subroutine Time::HiRes::alarm redefined at (eval 37) line 1.
Subroutine Time::HiRes::gettimeofday redefined at (eval 37) line 1.
Subroutine Time::HiRes::time redefined at (eval 37) line 1.
Subroutine Time::HiRes::setitimer redefined at (eval 37) line 1.
Subroutine Time::HiRes::getitimer redefined at (eval 37) line 1.
Subroutine Time::HiRes::utime redefined at (eval 37) line 1.
Subroutine Time::HiRes::clock_gettime redefined at (eval 37) line 1.
Subroutine Time::HiRes::clock_getres redefined at (eval 37) line 1.
Subroutine Time::HiRes::clock_nanosleep redefined at (eval 37) line 1.
Subroutine Time::HiRes::clock redefined at (eval 37) line 1.
Subroutine Time::HiRes::lstat redefined at (eval 37) line 1.
Subroutine Time::HiRes::stat redefined at (eval 37) line 1.
*** Error 1 in /home/core/smoke/perl-current (makefile:841 'test_harness')

error while running harness target 'test_harness': 2 at /home/core/smoke/TestSmoke/Test/Smoke/App/RunSmoke.pm line 118.
[2022-03-24 16:38:46-0400] 
[2022-03-24 16:38:46-0400] ../t/porting/podcheck.t.....................................FAILED
[2022-03-24 16:38:46-0400]     270
[2022-03-24 16:38:46-0400] Archived results...
[2022-03-24 16:38:46-0400] Unskip tests from '/home/core/smoke/TestSmoke/smokecurrent.skiptests'
[2022-03-24 16:38:46-0400] 
[2022-03-24 16:38:46-0400] Configuration: -Dusedevel -Dcc=clang -Duseithreads -Duselongdouble -DDEBUGGING
[2022-03-24 16:38:46-0400] ------------------------------------------------------------------------------
[2022-03-24 16:38:46-0400] make distclean ...
[2022-03-24 16:39:23-0400] 
[2022-03-24 16:39:23-0400] Copy Policy.sh ...
[2022-03-24 16:39:23-0400] 
[2022-03-24 16:39:23-0400] Configure ...
[2022-03-24 16:40:51-0400] 
[2022-03-24 16:40:51-0400] make ...
Warning (mostly harmless): No library found for -lndbm
Warning (mostly harmless): No library found for -ldbm
Warning (mostly harmless): No library found for -lucb
Warning (mostly harmless): No library found for -lposix
Warning (mostly harmless): No library found for -lcposix
In file included from HiRes.xs:859:
./const-c.inc:351:42: warning: unused parameter 'iv_return' [-Wunused-parameter]
constant_19 (pTHX_ const char *name, IV *iv_return) {
                                         ^
1 warning generated.
[2022-03-24 16:53:50-0400] Skip tests from '/home/core/smoke/TestSmoke/smokecurrent.skiptests'
[2022-03-24 16:53:50-0400] 
[2022-03-24 16:53:50-0400]  Tests start here:
[2022-03-24 16:53:50-0400] TSTENV = stdio	
#   " outside of any" 
#     '=item' '=over' near line 1358 of pod/perlunicode.pod
# See end of this test output for your options on silencing this
# 
# HOW TO GET porting/podcheck.t TO PASS
# 
# There was 1 file that had new potential problems identified.
# Some of them may be real, and some of them may be false positives because
# this program isn't as smart as it likes to think it is.  You can teach this
# program to ignore the issues it has identified, and hence pass, by doing the
# following:
# 
# 1) If a problem is about a link to an unknown module or man page that
#    you know exists, re-run the command something like:
#       ./perl -I../lib porting/podcheck.t --add_link MODULE man_page ...
#    (MODULEs should look like Foo::Bar, and man_pages should look like
#    bar(3c); don't do this for a module or man page that you aren't sure
#    about; instead treat as another type of issue and follow the
#    instructions below.)
# 
# 2) For other issues, decide if each should be fixed now or not.  Fix the
#    ones you decided to, and rerun this test to verify that the fixes
#    worked.
# 
# 3) If there remain false positive or problems that you don't plan to fix right
#    now,
#    run this test script by hand, using the following formula (on
#    Un*x-like machines):
#         cd t
#         ./perl -I../lib porting/podcheck.t --regen
# 
#    That should cause all current potential problems to be accepted by
#    the program, so that the next time it runs, they won't be flagged.
#    For a few files, such as perltoc, certain issues will always be
#    expected, and more of the same will be added over time.  For those,
#    before you do the regen, you can edit
#    /home/core/smoke/perl-current/t/porting/known_pod_issues.dat
#    and find the entry for the module's file and specific error message,
#    and change the count of known potential problems to -1.
# temp file: /home/core/tmp/vDkHbc4rFB
Subroutine Time::HiRes::constant redefined at (eval 37) line 1.
Subroutine Time::HiRes::usleep redefined at (eval 37) line 1.
Subroutine Time::HiRes::nanosleep redefined at (eval 37) line 1.
Subroutine Time::HiRes::sleep redefined at (eval 37) line 1.
Subroutine Time::HiRes::ualarm redefined at (eval 37) line 1.
Subroutine Time::HiRes::alarm redefined at (eval 37) line 1.
Subroutine Time::HiRes::gettimeofday redefined at (eval 37) line 1.
Subroutine Time::HiRes::time redefined at (eval 37) line 1.
Subroutine Time::HiRes::setitimer redefined at (eval 37) line 1.
Subroutine Time::HiRes::getitimer redefined at (eval 37) line 1.
Subroutine Time::HiRes::utime redefined at (eval 37) line 1.
Subroutine Time::HiRes::clock_gettime redefined at (eval 37) line 1.
Subroutine Time::HiRes::clock_getres redefined at (eval 37) line 1.
Subroutine Time::HiRes::clock_nanosleep redefined at (eval 37) line 1.
Subroutine Time::HiRes::clock redefined at (eval 37) line 1.
Subroutine Time::HiRes::lstat redefined at (eval 37) line 1.
Subroutine Time::HiRes::stat redefined at (eval 37) line 1.
*** Error 1 in /home/core/smoke/perl-current (makefile:841 'test_harness')

error while running harness target 'test_harness': 2 at /home/core/smoke/TestSmoke/Test/Smoke/App/RunSmoke.pm line 118.
[2022-03-24 17:50:41-0400] 
[2022-03-24 17:50:41-0400] ../t/porting/podcheck.t.....................................FAILED
[2022-03-24 17:50:41-0400]     270
[2022-03-24 17:50:41-0400] Archived results...
[2022-03-24 17:50:41-0400] Unskip tests from '/home/core/smoke/TestSmoke/smokecurrent.skiptests'
[2022-03-24 17:50:41-0400] Finished smoking 0f7529f0ca9df6069f41f1b9bfacac94db2c7bed v5.35.10-14-g0f7529f0ca blead
[2022-03-24 17:50:41-0400] Reading smokeresult from /home/core/smoke/perl-current/mktest.out
[2022-03-24 17:50:41-0400] Processing [-Dcc=clang]
[2022-03-24 17:50:41-0400] Processing [-DDEBUGGING -Dcc=clang]
[2022-03-24 17:50:41-0400] Processing [-Dcc=clang -Duse64bitall]
[2022-03-24 17:50:41-0400] Processing [-DDEBUGGING -Dcc=clang -Duse64bitall]
[2022-03-24 17:50:41-0400] Processing [-Dcc=clang -Duselongdouble]
[2022-03-24 17:50:41-0400] Processing [-DDEBUGGING -Dcc=clang -Duselongdouble]
[2022-03-24 17:50:41-0400] Processing [-Dcc=clang -Duseithreads]
[2022-03-24 17:50:41-0400] Processing [-DDEBUGGING -Dcc=clang -Duseithreads]
[2022-03-24 17:50:41-0400] Processing [-Dcc=clang -Duseithreads -Duse64bitall]
[2022-03-24 17:50:41-0400] Processing [-DDEBUGGING -Dcc=clang -Duseithreads -Duse64bitall]
[2022-03-24 17:50:41-0400] Processing [-Dcc=clang -Duseithreads -Duselongdouble]
[2022-03-24 17:50:41-0400] Processing [-DDEBUGGING -Dcc=clang -Duseithreads -Duselongdouble]
[2022-03-24 17:50:41-0400] ==> Starting reporter
[2022-03-24 17:50:41-0400] Writing report to '/home/core/smoke/perl-current/mktest.rpt'
-- 
Report generated by Test::Smoke::Gateway v0.12