Show report
[2021-09-14 22:05:06+0200] ==> Skipping synctree
[2021-09-14 22:05:06+0200] ==> Starting runsmoke
[2021-09-14 22:05:06+0200] [tssmokeperl.pl] chdir(/pro/3gl/CPAN/perl-current)
[2021-09-14 22:05:06+0200] qx[/pro/bin/perl -e "require q[/pro/3gl/CPAN/perl-current/cpan/Test-Harness/lib/Test/Harness.pm];print Test::Harness->VERSION" 2>&1]
[2021-09-14 22:05:06+0200] Found: Test::Harness version 3.43.
[2021-09-14 22:05:06+0200] Reading build configurations from /pro/3gl/CPAN/smoke/p59.cfg
[2021-09-14 22:05:06+0200] Reading 'Policy.sh' from ../Policy.sh (v=1)
[2021-09-14 22:05:06+0200] Running test suite only with 'harness'
[2021-09-14 22:05:06+0200] make distclean ...
[2021-09-14 22:05:06+0200] Smoking patch 6128f436cec56eb058997a31b6565620b6d9109d v5.35.3-151-g6128f43
[2021-09-14 22:05:06+0200] Smoking branch blead
[2021-09-14 22:05:06+0200] Locally applied patches from '/pro/3gl/CPAN/perl-current/patchlevel.h'
[2021-09-14 22:05:06+0200] Patches: 'uncommitted-changes'
[2021-09-14 22:05:06+0200] Adding 'SMOKE6128f436cec56eb058997a31b6565620b6d9109d' to the registered patches.
[2021-09-14 22:05:06+0200] 
[2021-09-14 22:05:06+0200] Configuration: -Dusedevel -Duselongdouble
[2021-09-14 22:05:06+0200] ------------------------------------------------------------------------------
[2021-09-14 22:05:06+0200] make distclean ...
[2021-09-14 22:05:06+0200] 
[2021-09-14 22:05:06+0200] Copy Policy.sh ...
[2021-09-14 22:05:06+0200] 
[2021-09-14 22:05:06+0200] Configure ...
[2021-09-14 22:05:37+0200] 
[2021-09-14 22:05:37+0200] make ...
Cannot open(/pro/3gl/CPAN/smoke/p59.skip): No such file or directory at /pro/3gl/CPAN/smoke/lib/Test/Smoke/App/RunSmoke.pm line 118.
[2021-09-14 22:06:31+0200] 
[2021-09-14 22:06:31+0200]  Tests start here:
[2021-09-14 22:06:31+0200] TSTENV = stdio	
No saved state, selection will be empty
# temp file: /tmp/LXbXAXqH6b
# 
# BASE_LEN  = 9
# BASE      = 1000000000
# MAX_VAL   = 999999999
# AND_BITS  = 29
# XOR_BITS  = 29
# OR_BITS   = 29
# MAX_EXP_F = 9
# MAX_EXP_I = 9
# USE_INT   = 0
# 
# BASE_LEN  = 1
# BASE      = 10
# MAX_VAL   = 9
# AND_BITS  = 3
# XOR_BITS  = 3
# OR_BITS   = 3
# MAX_EXP_F = 9
# MAX_EXP_I = 9
# USE_INT   = 0
# 
# BASE_LEN  = 9
# BASE      = 1000000000
# MAX_VAL   = 999999999
# AND_BITS  = 29
# XOR_BITS  = 29
# OR_BITS   = 29
# MAX_EXP_F = 9
# MAX_EXP_I = 9
# USE_INT   = 1
No such file or directory
No such file or directory
No such file or directory
No such file or directory
No such file or directory
No such file or directory
No such file or directory
[2021-09-14 22:09:38+0200] 
[2021-09-14 22:09:38+0200] All tests successful.
[2021-09-14 22:09:38+0200] Archived results...
[2021-09-14 22:09:38+0200] TSTENV = perlio	
# 
# BASE_LEN  = 9
# BASE      = 1000000000
# MAX_VAL   = 999999999
# AND_BITS  = 29
# XOR_BITS  = 29
# OR_BITS   = 29
# MAX_EXP_F = 9
# MAX_EXP_I = 9
# USE_INT   = 1
# 
# BASE_LEN  = 9
# BASE      = 1000000000
# MAX_VAL   = 999999999
# AND_BITS  = 29
# XOR_BITS  = 29
# OR_BITS   = 29
# MAX_EXP_F = 9
# MAX_EXP_I = 9
# USE_INT   = 0
# 
# BASE_LEN  = 1
# BASE      = 10
# MAX_VAL   = 9
# AND_BITS  = 3
# XOR_BITS  = 3
# OR_BITS   = 3
# MAX_EXP_F = 9
# MAX_EXP_I = 9
# USE_INT   = 0
# temp file: /tmp/W7ukG8I5kv
[2021-09-14 22:12:32+0200] 
[2021-09-14 22:12:32+0200] All tests successful.
[2021-09-14 22:12:32+0200] Archived results...
[2021-09-14 22:12:32+0200] TSTENV = locale:en_US.utf8	
# 
# BASE_LEN  = 9
# BASE      = 1000000000
# MAX_VAL   = 999999999
# AND_BITS  = 29
# XOR_BITS  = 29
# OR_BITS   = 29
# MAX_EXP_F = 9
# MAX_EXP_I = 9
# USE_INT   = 1
# 
# BASE_LEN  = 9
# BASE      = 1000000000
# MAX_VAL   = 999999999
# AND_BITS  = 29
# XOR_BITS  = 29
# OR_BITS   = 29
# MAX_EXP_F = 9
# MAX_EXP_I = 9
# USE_INT   = 0
# temp file: /tmp/oxhRe9gL7k
# 
# BASE_LEN  = 1
# BASE      = 10
# MAX_VAL   = 9
# AND_BITS  = 3
# XOR_BITS  = 3
# OR_BITS   = 3
# MAX_EXP_F = 9
# MAX_EXP_I = 9
# USE_INT   = 0
[2021-09-14 22:15:25+0200] 
[2021-09-14 22:15:25+0200] All tests successful.
[2021-09-14 22:15:25+0200] Archived results...
Cannot open(/pro/3gl/CPAN/smoke/p59.skip): No such file or directory at /pro/3gl/CPAN/smoke/lib/Test/Smoke/App/RunSmoke.pm line 118.
[2021-09-14 22:15:25+0200] 
[2021-09-14 22:15:25+0200] Configuration: -Dusedevel -Duselongdouble -DDEBUGGING
[2021-09-14 22:15:25+0200] ------------------------------------------------------------------------------
[2021-09-14 22:15:25+0200] make distclean ...
[2021-09-14 22:15:34+0200] 
[2021-09-14 22:15:34+0200] Copy Policy.sh ...
[2021-09-14 22:15:34+0200] 
[2021-09-14 22:15:34+0200] Configure ...
[2021-09-14 22:16:06+0200] 
[2021-09-14 22:16:06+0200] make ...
Cannot open(/pro/3gl/CPAN/smoke/p59.skip): No such file or directory at /pro/3gl/CPAN/smoke/lib/Test/Smoke/App/RunSmoke.pm line 118.
[2021-09-14 22:17:24+0200] 
[2021-09-14 22:17:24+0200]  Tests start here:
[2021-09-14 22:17:24+0200] TSTENV = stdio	
No saved state, selection will be empty
# temp file: /tmp/TN8Qfj5ijq
# 
# BASE_LEN  = 9
# BASE      = 1000000000
# MAX_VAL   = 999999999
# AND_BITS  = 29
# XOR_BITS  = 29
# OR_BITS   = 29
# MAX_EXP_F = 9
# MAX_EXP_I = 9
# USE_INT   = 0
# 
# BASE_LEN  = 1
# BASE      = 10
# MAX_VAL   = 9
# AND_BITS  = 3
# XOR_BITS  = 3
# OR_BITS   = 3
# MAX_EXP_F = 9
# MAX_EXP_I = 9
# USE_INT   = 0
# 
# BASE_LEN  = 9
# BASE      = 1000000000
# MAX_VAL   = 999999999
# AND_BITS  = 29
# XOR_BITS  = 29
# OR_BITS   = 29
# MAX_EXP_F = 9
# MAX_EXP_I = 9
# USE_INT   = 1
No such file or directory
No such file or directory
No such file or directory
No such file or directory
No such file or directory
No such file or directory
No such file or directory
[2021-09-14 22:21:07+0200] 
[2021-09-14 22:21:07+0200] All tests successful.
[2021-09-14 22:21:07+0200] Archived results...
[2021-09-14 22:21:07+0200] TSTENV = perlio	
# 
# BASE_LEN  = 9
# BASE      = 1000000000
# MAX_VAL   = 999999999
# AND_BITS  = 29
# XOR_BITS  = 29
# OR_BITS   = 29
# MAX_EXP_F = 9
# MAX_EXP_I = 9
# USE_INT   = 1
# 
# BASE_LEN  = 9
# BASE      = 1000000000
# MAX_VAL   = 999999999
# AND_BITS  = 29
# XOR_BITS  = 29
# OR_BITS   = 29
# MAX_EXP_F = 9
# MAX_EXP_I = 9
# USE_INT   = 0
# temp file: /tmp/SkcwacBAtR
# 
# BASE_LEN  = 1
# BASE      = 10
# MAX_VAL   = 9
# AND_BITS  = 3
# XOR_BITS  = 3
# OR_BITS   = 3
# MAX_EXP_F = 9
# MAX_EXP_I = 9
# USE_INT   = 0
[2021-09-14 22:24:39+0200] 
[2021-09-14 22:24:39+0200] All tests successful.
[2021-09-14 22:24:39+0200] Archived results...
[2021-09-14 22:24:39+0200] TSTENV = locale:en_US.utf8	
# 
# BASE_LEN  = 9
# BASE      = 1000000000
# MAX_VAL   = 999999999
# AND_BITS  = 29
# XOR_BITS  = 29
# OR_BITS   = 29
# MAX_EXP_F = 9
# MAX_EXP_I = 9
# USE_INT   = 1
# 
# BASE_LEN  = 9
# BASE      = 1000000000
# MAX_VAL   = 999999999
# AND_BITS  = 29
# XOR_BITS  = 29
# OR_BITS   = 29
# MAX_EXP_F = 9
# MAX_EXP_I = 9
# USE_INT   = 0
# temp file: /tmp/wb4zUozAQh
# 
# BASE_LEN  = 1
# BASE      = 10
# MAX_VAL   = 9
# AND_BITS  = 3
# XOR_BITS  = 3
# OR_BITS   = 3
# MAX_EXP_F = 9
# MAX_EXP_I = 9
# USE_INT   = 0
[2021-09-14 22:28:06+0200] 
[2021-09-14 22:28:06+0200] All tests successful.
[2021-09-14 22:28:06+0200] Archived results...
Cannot open(/pro/3gl/CPAN/smoke/p59.skip): No such file or directory at /pro/3gl/CPAN/smoke/lib/Test/Smoke/App/RunSmoke.pm line 118.
[2021-09-14 22:28:06+0200] 
[2021-09-14 22:28:06+0200] Configuration: -Dusedevel -Duse64bitall
[2021-09-14 22:28:06+0200] ------------------------------------------------------------------------------
[2021-09-14 22:28:06+0200] make distclean ...
[2021-09-14 22:28:17+0200] 
[2021-09-14 22:28:17+0200] Copy Policy.sh ...
[2021-09-14 22:28:17+0200] 
[2021-09-14 22:28:17+0200] Configure ...
[2021-09-14 22:28:47+0200] 
[2021-09-14 22:28:47+0200] make ...
Cannot open(/pro/3gl/CPAN/smoke/p59.skip): No such file or directory at /pro/3gl/CPAN/smoke/lib/Test/Smoke/App/RunSmoke.pm line 118.
[2021-09-14 22:29:42+0200] 
[2021-09-14 22:29:42+0200]  Tests start here:
[2021-09-14 22:29:42+0200] TSTENV = stdio	
No saved state, selection will be empty
# temp file: /tmp/p43FlR1oZB
# 
# BASE_LEN  = 9
# BASE      = 1000000000
# MAX_VAL   = 999999999
# AND_BITS  = 29
# XOR_BITS  = 29
# OR_BITS   = 29
# MAX_EXP_F = 9
# MAX_EXP_I = 9
# USE_INT   = 0
# 
# BASE_LEN  = 1
# BASE      = 10
# MAX_VAL   = 9
# AND_BITS  = 3
# XOR_BITS  = 3
# OR_BITS   = 3
# MAX_EXP_F = 9
# MAX_EXP_I = 9
# USE_INT   = 0
# 
# BASE_LEN  = 9
# BASE      = 1000000000
# MAX_VAL   = 999999999
# AND_BITS  = 29
# XOR_BITS  = 29
# OR_BITS   = 29
# MAX_EXP_F = 9
# MAX_EXP_I = 9
# USE_INT   = 1
No such file or directory
No such file or directory
No such file or directory
No such file or directory
No such file or directory
No such file or directory
No such file or directory
[2021-09-14 22:32:48+0200] 
[2021-09-14 22:32:48+0200] All tests successful.
[2021-09-14 22:32:48+0200] Archived results...
[2021-09-14 22:32:48+0200] TSTENV = perlio	
# 
# BASE_LEN  = 9
# BASE      = 1000000000
# MAX_VAL   = 999999999
# AND_BITS  = 29
# XOR_BITS  = 29
# OR_BITS   = 29
# MAX_EXP_F = 9
# MAX_EXP_I = 9
# USE_INT   = 1
# 
# BASE_LEN  = 9
# BASE      = 1000000000
# MAX_VAL   = 999999999
# AND_BITS  = 29
# XOR_BITS  = 29
# OR_BITS   = 29
# MAX_EXP_F = 9
# MAX_EXP_I = 9
# USE_INT   = 0
# 
# BASE_LEN  = 1
# BASE      = 10
# MAX_VAL   = 9
# AND_BITS  = 3
# XOR_BITS  = 3
# OR_BITS   = 3
# MAX_EXP_F = 9
# MAX_EXP_I = 9
# USE_INT   = 0
# temp file: /tmp/EyvlsjYQLu
[2021-09-14 22:35:43+0200] 
[2021-09-14 22:35:43+0200] All tests successful.
[2021-09-14 22:35:43+0200] Archived results...
[2021-09-14 22:35:43+0200] TSTENV = locale:en_US.utf8	
# 
# BASE_LEN  = 9
# BASE      = 1000000000
# MAX_VAL   = 999999999
# AND_BITS  = 29
# XOR_BITS  = 29
# OR_BITS   = 29
# MAX_EXP_F = 9
# MAX_EXP_I = 9
# USE_INT   = 0
# 
# BASE_LEN  = 9
# BASE      = 1000000000
# MAX_VAL   = 999999999
# AND_BITS  = 29
# XOR_BITS  = 29
# OR_BITS   = 29
# MAX_EXP_F = 9
# MAX_EXP_I = 9
# USE_INT   = 1
# 
# BASE_LEN  = 1
# BASE      = 10
# MAX_VAL   = 9
# AND_BITS  = 3
# XOR_BITS  = 3
# OR_BITS   = 3
# MAX_EXP_F = 9
# MAX_EXP_I = 9
# USE_INT   = 0
# temp file: /tmp/TOSKZodCGq
[2021-09-14 22:38:34+0200] 
[2021-09-14 22:38:34+0200] All tests successful.
[2021-09-14 22:38:34+0200] Archived results...
Cannot open(/pro/3gl/CPAN/smoke/p59.skip): No such file or directory at /pro/3gl/CPAN/smoke/lib/Test/Smoke/App/RunSmoke.pm line 118.
[2021-09-14 22:38:34+0200] 
[2021-09-14 22:38:34+0200] Configuration: -Dusedevel -Duse64bitall -DDEBUGGING
[2021-09-14 22:38:34+0200] ------------------------------------------------------------------------------
[2021-09-14 22:38:34+0200] make distclean ...
[2021-09-14 22:38:44+0200] 
[2021-09-14 22:38:44+0200] Copy Policy.sh ...
[2021-09-14 22:38:44+0200] 
[2021-09-14 22:38:44+0200] Configure ...
[2021-09-14 22:39:14+0200] 
[2021-09-14 22:39:14+0200] make ...
Cannot open(/pro/3gl/CPAN/smoke/p59.skip): No such file or directory at /pro/3gl/CPAN/smoke/lib/Test/Smoke/App/RunSmoke.pm line 118.
[2021-09-14 22:40:32+0200] 
[2021-09-14 22:40:32+0200]  Tests start here:
[2021-09-14 22:40:32+0200] TSTENV = stdio	
No saved state, selection will be empty
# temp file: /tmp/ap6vZyndW7
# 
# BASE_LEN  = 9
# BASE      = 1000000000
# MAX_VAL   = 999999999
# AND_BITS  = 29
# XOR_BITS  = 29
# OR_BITS   = 29
# MAX_EXP_F = 9
# MAX_EXP_I = 9
# USE_INT   = 0
# 
# BASE_LEN  = 1
# BASE      = 10
# MAX_VAL   = 9
# AND_BITS  = 3
# XOR_BITS  = 3
# OR_BITS   = 3
# MAX_EXP_F = 9
# MAX_EXP_I = 9
# USE_INT   = 0
# 
# BASE_LEN  = 9
# BASE      = 1000000000
# MAX_VAL   = 999999999
# AND_BITS  = 29
# XOR_BITS  = 29
# OR_BITS   = 29
# MAX_EXP_F = 9
# MAX_EXP_I = 9
# USE_INT   = 1
No such file or directory
No such file or directory
No such file or directory
No such file or directory
No such file or directory
No such file or directory
No such file or directory
[2021-09-14 22:44:16+0200] 
[2021-09-14 22:44:16+0200] All tests successful.
[2021-09-14 22:44:16+0200] Archived results...
[2021-09-14 22:44:16+0200] TSTENV = perlio	
# 
# BASE_LEN  = 9
# BASE      = 1000000000
# MAX_VAL   = 999999999
# AND_BITS  = 29
# XOR_BITS  = 29
# OR_BITS   = 29
# MAX_EXP_F = 9
# MAX_EXP_I = 9
# USE_INT   = 1
# 
# BASE_LEN  = 9
# BASE      = 1000000000
# MAX_VAL   = 999999999
# AND_BITS  = 29
# XOR_BITS  = 29
# OR_BITS   = 29
# MAX_EXP_F = 9
# MAX_EXP_I = 9
# USE_INT   = 0
# temp file: /tmp/258epIImmg
# 
# BASE_LEN  = 1
# BASE      = 10
# MAX_VAL   = 9
# AND_BITS  = 3
# XOR_BITS  = 3
# OR_BITS   = 3
# MAX_EXP_F = 9
# MAX_EXP_I = 9
# USE_INT   = 0
[2021-09-14 22:47:46+0200] 
[2021-09-14 22:47:46+0200] All tests successful.
[2021-09-14 22:47:46+0200] Archived results...
[2021-09-14 22:47:46+0200] TSTENV = locale:en_US.utf8	
# 
# BASE_LEN  = 9
# BASE      = 1000000000
# MAX_VAL   = 999999999
# AND_BITS  = 29
# XOR_BITS  = 29
# OR_BITS   = 29
# MAX_EXP_F = 9
# MAX_EXP_I = 9
# USE_INT   = 0
# 
# BASE_LEN  = 9
# BASE      = 1000000000
# MAX_VAL   = 999999999
# AND_BITS  = 29
# XOR_BITS  = 29
# OR_BITS   = 29
# MAX_EXP_F = 9
# MAX_EXP_I = 9
# USE_INT   = 1
# temp file: /tmp/jgLsHrl10h
# 
# BASE_LEN  = 1
# BASE      = 10
# MAX_VAL   = 9
# AND_BITS  = 3
# XOR_BITS  = 3
# OR_BITS   = 3
# MAX_EXP_F = 9
# MAX_EXP_I = 9
# USE_INT   = 0
[2021-09-14 22:51:12+0200] 
[2021-09-14 22:51:12+0200] All tests successful.
[2021-09-14 22:51:12+0200] Archived results...
Cannot open(/pro/3gl/CPAN/smoke/p59.skip): No such file or directory at /pro/3gl/CPAN/smoke/lib/Test/Smoke/App/RunSmoke.pm line 118.
[2021-09-14 22:51:12+0200] 
[2021-09-14 22:51:12+0200] Configuration: -Dusedevel -Duseithreads -Duselongdouble
[2021-09-14 22:51:12+0200] ------------------------------------------------------------------------------
[2021-09-14 22:51:12+0200] make distclean ...
[2021-09-14 22:51:23+0200] 
[2021-09-14 22:51:23+0200] Copy Policy.sh ...
[2021-09-14 22:51:23+0200] 
[2021-09-14 22:51:23+0200] Configure ...
[2021-09-14 22:51:57+0200] 
[2021-09-14 22:51:57+0200] make ...
Cannot open(/pro/3gl/CPAN/smoke/p59.skip): No such file or directory at /pro/3gl/CPAN/smoke/lib/Test/Smoke/App/RunSmoke.pm line 118.
[2021-09-14 22:52:52+0200] 
[2021-09-14 22:52:52+0200]  Tests start here:
[2021-09-14 22:52:52+0200] TSTENV = stdio	
No saved state, selection will be empty
# temp file: /tmp/2W_4llJbGL
# Looks like you planned 56 tests but ran 57.
# 
# BASE_LEN  = 9
# BASE      = 1000000000
# MAX_VAL   = 999999999
# AND_BITS  = 29
# XOR_BITS  = 29
# OR_BITS   = 29
# MAX_EXP_F = 9
# MAX_EXP_I = 9
# USE_INT   = 0
# 
# BASE_LEN  = 1
# BASE      = 10
# MAX_VAL   = 9
# AND_BITS  = 3
# XOR_BITS  = 3
# OR_BITS   = 3
# MAX_EXP_F = 9
# MAX_EXP_I = 9
# USE_INT   = 0
# 
# BASE_LEN  = 9
# BASE      = 1000000000
# MAX_VAL   = 999999999
# AND_BITS  = 29
# XOR_BITS  = 29
# OR_BITS   = 29
# MAX_EXP_F = 9
# MAX_EXP_I = 9
# USE_INT   = 1
No such file or directory
No such file or directory
No such file or directory
No such file or directory
No such file or directory
No such file or directory
No such file or directory
make: *** [test_harness] Error 1

error while running harness target 'test_harness': 2 at /pro/3gl/CPAN/smoke/lib/Test/Smoke/App/RunSmoke.pm line 118.
[2021-09-14 22:56:19+0200] 
[2021-09-14 22:56:19+0200] ../cpan/Encode/t/Unicode.t..................................FAILED
[2021-09-14 22:56:19+0200]     57
[2021-09-14 22:56:19+0200] ../cpan/Encode/t/Unicode.t..................................FAILED
[2021-09-14 22:56:19+0200]     Non-zero exit status: 255
[2021-09-14 22:56:19+0200] ../cpan/Encode/t/Unicode.t..................................FAILED
[2021-09-14 22:56:19+0200]     Bad plan.  You planned 56 tests but ran 57.
[2021-09-14 22:56:19+0200] Archived results...
[2021-09-14 22:56:19+0200] TSTENV = perlio	
# 
# BASE_LEN  = 9
# BASE      = 1000000000
# MAX_VAL   = 999999999
# AND_BITS  = 29
# XOR_BITS  = 29
# OR_BITS   = 29
# MAX_EXP_F = 9
# MAX_EXP_I = 9
# USE_INT   = 1
# 
# BASE_LEN  = 9
# BASE      = 1000000000
# MAX_VAL   = 999999999
# AND_BITS  = 29
# XOR_BITS  = 29
# OR_BITS   = 29
# MAX_EXP_F = 9
# MAX_EXP_I = 9
# USE_INT   = 0
# temp file: /tmp/zk4EXFGxdP
# 
# BASE_LEN  = 1
# BASE      = 10
# MAX_VAL   = 9
# AND_BITS  = 3
# XOR_BITS  = 3
# OR_BITS   = 3
# MAX_EXP_F = 9
# MAX_EXP_I = 9
# USE_INT   = 0
[2021-09-14 22:59:36+0200] 
[2021-09-14 22:59:36+0200] All tests successful.
[2021-09-14 22:59:36+0200] Archived results...
[2021-09-14 22:59:36+0200] TSTENV = locale:en_US.utf8	
# 
# BASE_LEN  = 9
# BASE      = 1000000000
# MAX_VAL   = 999999999
# AND_BITS  = 29
# XOR_BITS  = 29
# OR_BITS   = 29
# MAX_EXP_F = 9
# MAX_EXP_I = 9
# USE_INT   = 0
# 
# BASE_LEN  = 9
# BASE      = 1000000000
# MAX_VAL   = 999999999
# AND_BITS  = 29
# XOR_BITS  = 29
# OR_BITS   = 29
# MAX_EXP_F = 9
# MAX_EXP_I = 9
# USE_INT   = 1
# temp file: /tmp/tngHl266LF
# 
# BASE_LEN  = 1
# BASE      = 10
# MAX_VAL   = 9
# AND_BITS  = 3
# XOR_BITS  = 3
# OR_BITS   = 3
# MAX_EXP_F = 9
# MAX_EXP_I = 9
# USE_INT   = 0
[2021-09-14 23:02:48+0200] 
[2021-09-14 23:02:48+0200] All tests successful.
[2021-09-14 23:02:48+0200] Archived results...
Cannot open(/pro/3gl/CPAN/smoke/p59.skip): No such file or directory at /pro/3gl/CPAN/smoke/lib/Test/Smoke/App/RunSmoke.pm line 118.
[2021-09-14 23:02:48+0200] 
[2021-09-14 23:02:48+0200] Configuration: -Dusedevel -Duseithreads -Duselongdouble -DDEBUGGING
[2021-09-14 23:02:48+0200] ------------------------------------------------------------------------------
[2021-09-14 23:02:48+0200] make distclean ...
[2021-09-14 23:02:59+0200] 
[2021-09-14 23:02:59+0200] Copy Policy.sh ...
[2021-09-14 23:02:59+0200] 
[2021-09-14 23:02:59+0200] Configure ...
[2021-09-14 23:03:32+0200] 
[2021-09-14 23:03:32+0200] make ...
Cannot open(/pro/3gl/CPAN/smoke/p59.skip): No such file or directory at /pro/3gl/CPAN/smoke/lib/Test/Smoke/App/RunSmoke.pm line 118.
[2021-09-14 23:04:53+0200] 
[2021-09-14 23:04:53+0200]  Tests start here:
[2021-09-14 23:04:53+0200] TSTENV = stdio	
No saved state, selection will be empty
# temp file: /tmp/iax1Li5pMw
# 
# BASE_LEN  = 9
# BASE      = 1000000000
# MAX_VAL   = 999999999
# AND_BITS  = 29
# XOR_BITS  = 29
# OR_BITS   = 29
# MAX_EXP_F = 9
# MAX_EXP_I = 9
# USE_INT   = 0
# 
# BASE_LEN  = 1
# BASE      = 10
# MAX_VAL   = 9
# AND_BITS  = 3
# XOR_BITS  = 3
# OR_BITS   = 3
# MAX_EXP_F = 9
# MAX_EXP_I = 9
# USE_INT   = 0
# 
# BASE_LEN  = 9
# BASE      = 1000000000
# MAX_VAL   = 999999999
# AND_BITS  = 29
# XOR_BITS  = 29
# OR_BITS   = 29
# MAX_EXP_F = 9
# MAX_EXP_I = 9
# USE_INT   = 1
No such file or directory
No such file or directory
No such file or directory
No such file or directory
No such file or directory
No such file or directory
No such file or directory
[2021-09-14 23:09:02+0200] 
[2021-09-14 23:09:02+0200] All tests successful.
[2021-09-14 23:09:02+0200] Archived results...
[2021-09-14 23:09:02+0200] TSTENV = perlio	
# 
# BASE_LEN  = 9
# BASE      = 1000000000
# MAX_VAL   = 999999999
# AND_BITS  = 29
# XOR_BITS  = 29
# OR_BITS   = 29
# MAX_EXP_F = 9
# MAX_EXP_I = 9
# USE_INT   = 1
# 
# BASE_LEN  = 9
# BASE      = 1000000000
# MAX_VAL   = 999999999
# AND_BITS  = 29
# XOR_BITS  = 29
# OR_BITS   = 29
# MAX_EXP_F = 9
# MAX_EXP_I = 9
# USE_INT   = 0
# 
# BASE_LEN  = 1
# BASE      = 10
# MAX_VAL   = 9
# AND_BITS  = 3
# XOR_BITS  = 3
# OR_BITS   = 3
# MAX_EXP_F = 9
# MAX_EXP_I = 9
# USE_INT   = 0
# temp file: /tmp/DWyF6R0yRs
[2021-09-14 23:12:55+0200] 
[2021-09-14 23:12:55+0200] All tests successful.
[2021-09-14 23:12:55+0200] Archived results...
[2021-09-14 23:12:55+0200] TSTENV = locale:en_US.utf8	
# 
# BASE_LEN  = 9
# BASE      = 1000000000
# MAX_VAL   = 999999999
# AND_BITS  = 29
# XOR_BITS  = 29
# OR_BITS   = 29
# MAX_EXP_F = 9
# MAX_EXP_I = 9
# USE_INT   = 0
# 
# BASE_LEN  = 9
# BASE      = 1000000000
# MAX_VAL   = 999999999
# AND_BITS  = 29
# XOR_BITS  = 29
# OR_BITS   = 29
# MAX_EXP_F = 9
# MAX_EXP_I = 9
# USE_INT   = 1
# temp file: /tmp/GKwl5xqtZS
# 
# BASE_LEN  = 1
# BASE      = 10
# MAX_VAL   = 9
# AND_BITS  = 3
# XOR_BITS  = 3
# OR_BITS   = 3
# MAX_EXP_F = 9
# MAX_EXP_I = 9
# USE_INT   = 0
[2021-09-14 23:16:45+0200] 
[2021-09-14 23:16:45+0200] All tests successful.
[2021-09-14 23:16:45+0200] Archived results...
Cannot open(/pro/3gl/CPAN/smoke/p59.skip): No such file or directory at /pro/3gl/CPAN/smoke/lib/Test/Smoke/App/RunSmoke.pm line 118.
[2021-09-14 23:16:45+0200] 
[2021-09-14 23:16:45+0200] Configuration: -Dusedevel -Duseithreads -Duse64bitall
[2021-09-14 23:16:45+0200] ------------------------------------------------------------------------------
[2021-09-14 23:16:45+0200] make distclean ...
[2021-09-14 23:16:56+0200] 
[2021-09-14 23:16:56+0200] Copy Policy.sh ...
[2021-09-14 23:16:56+0200] 
[2021-09-14 23:16:56+0200] Configure ...
[2021-09-14 23:17:28+0200] 
[2021-09-14 23:17:28+0200] make ...
Cannot open(/pro/3gl/CPAN/smoke/p59.skip): No such file or directory at /pro/3gl/CPAN/smoke/lib/Test/Smoke/App/RunSmoke.pm line 118.
[2021-09-14 23:18:23+0200] 
[2021-09-14 23:18:23+0200]  Tests start here:
[2021-09-14 23:18:23+0200] TSTENV = stdio	
No saved state, selection will be empty
# temp file: /tmp/dxp68Zq2BJ
# 
# BASE_LEN  = 9
# BASE      = 1000000000
# MAX_VAL   = 999999999
# AND_BITS  = 29
# XOR_BITS  = 29
# OR_BITS   = 29
# MAX_EXP_F = 9
# MAX_EXP_I = 9
# USE_INT   = 0
# 
# BASE_LEN  = 1
# BASE      = 10
# MAX_VAL   = 9
# AND_BITS  = 3
# XOR_BITS  = 3
# OR_BITS   = 3
# MAX_EXP_F = 9
# MAX_EXP_I = 9
# USE_INT   = 0
# 
# BASE_LEN  = 9
# BASE      = 1000000000
# MAX_VAL   = 999999999
# AND_BITS  = 29
# XOR_BITS  = 29
# OR_BITS   = 29
# MAX_EXP_F = 9
# MAX_EXP_I = 9
# USE_INT   = 1
No such file or directory
No such file or directory
No such file or directory
No such file or directory
No such file or directory
No such file or directory
No such file or directory
[2021-09-14 23:21:47+0200] 
[2021-09-14 23:21:47+0200] All tests successful.
[2021-09-14 23:21:47+0200] Archived results...
[2021-09-14 23:21:47+0200] TSTENV = perlio	
# 
# BASE_LEN  = 9
# BASE      = 1000000000
# MAX_VAL   = 999999999
# AND_BITS  = 29
# XOR_BITS  = 29
# OR_BITS   = 29
# MAX_EXP_F = 9
# MAX_EXP_I = 9
# USE_INT   = 1
# 
# BASE_LEN  = 9
# BASE      = 1000000000
# MAX_VAL   = 999999999
# AND_BITS  = 29
# XOR_BITS  = 29
# OR_BITS   = 29
# MAX_EXP_F = 9
# MAX_EXP_I = 9
# USE_INT   = 0
# temp file: /tmp/6KrldDiLHD
# 
# BASE_LEN  = 1
# BASE      = 10
# MAX_VAL   = 9
# AND_BITS  = 3
# XOR_BITS  = 3
# OR_BITS   = 3
# MAX_EXP_F = 9
# MAX_EXP_I = 9
# USE_INT   = 0
[2021-09-14 23:25:00+0200] 
[2021-09-14 23:25:00+0200] All tests successful.
[2021-09-14 23:25:00+0200] Archived results...
[2021-09-14 23:25:00+0200] TSTENV = locale:en_US.utf8	
# 
# BASE_LEN  = 9
# BASE      = 1000000000
# MAX_VAL   = 999999999
# AND_BITS  = 29
# XOR_BITS  = 29
# OR_BITS   = 29
# MAX_EXP_F = 9
# MAX_EXP_I = 9
# USE_INT   = 1
# 
# BASE_LEN  = 9
# BASE      = 1000000000
# MAX_VAL   = 999999999
# AND_BITS  = 29
# XOR_BITS  = 29
# OR_BITS   = 29
# MAX_EXP_F = 9
# MAX_EXP_I = 9
# USE_INT   = 0
# 
# BASE_LEN  = 1
# BASE      = 10
# MAX_VAL   = 9
# AND_BITS  = 3
# XOR_BITS  = 3
# OR_BITS   = 3
# MAX_EXP_F = 9
# MAX_EXP_I = 9
# USE_INT   = 0
# temp file: /tmp/iRecH6fRvv
[2021-09-14 23:28:10+0200] 
[2021-09-14 23:28:10+0200] All tests successful.
[2021-09-14 23:28:10+0200] Archived results...
Cannot open(/pro/3gl/CPAN/smoke/p59.skip): No such file or directory at /pro/3gl/CPAN/smoke/lib/Test/Smoke/App/RunSmoke.pm line 118.
[2021-09-14 23:28:10+0200] 
[2021-09-14 23:28:10+0200] Configuration: -Dusedevel -Duseithreads -Duse64bitall -DDEBUGGING
[2021-09-14 23:28:10+0200] ------------------------------------------------------------------------------
[2021-09-14 23:28:10+0200] make distclean ...
[2021-09-14 23:28:20+0200] 
[2021-09-14 23:28:20+0200] Copy Policy.sh ...
[2021-09-14 23:28:20+0200] 
[2021-09-14 23:28:20+0200] Configure ...
[2021-09-14 23:28:53+0200] 
[2021-09-14 23:28:53+0200] make ...
Cannot open(/pro/3gl/CPAN/smoke/p59.skip): No such file or directory at /pro/3gl/CPAN/smoke/lib/Test/Smoke/App/RunSmoke.pm line 118.
[2021-09-14 23:30:14+0200] 
[2021-09-14 23:30:14+0200]  Tests start here:
[2021-09-14 23:30:14+0200] TSTENV = stdio	
No saved state, selection will be empty
# temp file: /tmp/QSytJB3oFN
# 
# BASE_LEN  = 9
# BASE      = 1000000000
# MAX_VAL   = 999999999
# AND_BITS  = 29
# XOR_BITS  = 29
# OR_BITS   = 29
# MAX_EXP_F = 9
# MAX_EXP_I = 9
# USE_INT   = 0
# 
# BASE_LEN  = 1
# BASE      = 10
# MAX_VAL   = 9
# AND_BITS  = 3
# XOR_BITS  = 3
# OR_BITS   = 3
# MAX_EXP_F = 9
# MAX_EXP_I = 9
# USE_INT   = 0
# 
# BASE_LEN  = 9
# BASE      = 1000000000
# MAX_VAL   = 999999999
# AND_BITS  = 29
# XOR_BITS  = 29
# OR_BITS   = 29
# MAX_EXP_F = 9
# MAX_EXP_I = 9
# USE_INT   = 1
No such file or directory
No such file or directory
No such file or directory
No such file or directory
No such file or directory
No such file or directory
No such file or directory
[2021-09-14 23:34:18+0200] 
[2021-09-14 23:34:18+0200] All tests successful.
[2021-09-14 23:34:18+0200] Archived results...
[2021-09-14 23:34:18+0200] TSTENV = perlio	
# 
# BASE_LEN  = 9
# BASE      = 1000000000
# MAX_VAL   = 999999999
# AND_BITS  = 29
# XOR_BITS  = 29
# OR_BITS   = 29
# MAX_EXP_F = 9
# MAX_EXP_I = 9
# USE_INT   = 1
# 
# BASE_LEN  = 9
# BASE      = 1000000000
# MAX_VAL   = 999999999
# AND_BITS  = 29
# XOR_BITS  = 29
# OR_BITS   = 29
# MAX_EXP_F = 9
# MAX_EXP_I = 9
# USE_INT   = 0
# temp file: /tmp/jzeaNNWghg
# 
# BASE_LEN  = 1
# BASE      = 10
# MAX_VAL   = 9
# AND_BITS  = 3
# XOR_BITS  = 3
# OR_BITS   = 3
# MAX_EXP_F = 9
# MAX_EXP_I = 9
# USE_INT   = 0
[2021-09-14 23:38:08+0200] 
[2021-09-14 23:38:08+0200] All tests successful.
[2021-09-14 23:38:08+0200] Archived results...
[2021-09-14 23:38:08+0200] TSTENV = locale:en_US.utf8	
# 
# BASE_LEN  = 9
# BASE      = 1000000000
# MAX_VAL   = 999999999
# AND_BITS  = 29
# XOR_BITS  = 29
# OR_BITS   = 29
# MAX_EXP_F = 9
# MAX_EXP_I = 9
# USE_INT   = 1
# 
# BASE_LEN  = 9
# BASE      = 1000000000
# MAX_VAL   = 999999999
# AND_BITS  = 29
# XOR_BITS  = 29
# OR_BITS   = 29
# MAX_EXP_F = 9
# MAX_EXP_I = 9
# USE_INT   = 0
# temp file: /tmp/NnOoCzWam6
# 
# BASE_LEN  = 1
# BASE      = 10
# MAX_VAL   = 9
# AND_BITS  = 3
# XOR_BITS  = 3
# OR_BITS   = 3
# MAX_EXP_F = 9
# MAX_EXP_I = 9
# USE_INT   = 0
[2021-09-14 23:41:56+0200] 
[2021-09-14 23:41:56+0200] All tests successful.
[2021-09-14 23:41:56+0200] Archived results...
Cannot open(/pro/3gl/CPAN/smoke/p59.skip): No such file or directory at /pro/3gl/CPAN/smoke/lib/Test/Smoke/App/RunSmoke.pm line 118.
[2021-09-14 23:41:56+0200] Finished smoking 6128f436cec56eb058997a31b6565620b6d9109d v5.35.3-151-g6128f43 blead
[2021-09-14 23:41:56+0200] Reading smokeresult from /pro/3gl/CPAN/perl-current/mktest.out
[2021-09-14 23:41:56+0200] Processing [-Duselongdouble]
[2021-09-14 23:41:56+0200] Processing [-DDEBUGGING -Duselongdouble]
[2021-09-14 23:41:56+0200] Processing [-Duse64bitall]
[2021-09-14 23:41:56+0200] Processing [-DDEBUGGING -Duse64bitall]
[2021-09-14 23:41:56+0200] Processing [-Duseithreads -Duselongdouble]
[2021-09-14 23:41:56+0200] Processing [-DDEBUGGING -Duseithreads -Duselongdouble]
[2021-09-14 23:41:56+0200] Processing [-Duseithreads -Duse64bitall]
[2021-09-14 23:41:56+0200] Processing [-DDEBUGGING -Duseithreads -Duse64bitall]
[2021-09-14 23:41:56+0200] ==> Starting reporter
[2021-09-14 23:41:56+0200] Writing report to '/pro/3gl/CPAN/perl-current/mktest.rpt'
[2021-09-14 23:41:56+0200] Locally applied patches from '/pro/3gl/CPAN/perl-current/patchlevel.h'
[2021-09-14 23:41:56+0200] Patches: 'uncommitted-changes'
[2021-09-14 23:41:56+0200] Looking for cc messages: 'gcc'
-- 
Report generated by Test::Smoke::Gateway v0.09