Show logfile
Automated smoke report for branch blead 5.31.6 patch 16b18492a3b13a32fa4c894a24245b7f615366e4 v5.31.5-318-g16b1849
i3: PPC_POWER5 (PPC/1 cpus)
    on        AIX 5.3.0.0/TL12-05
    using     gcc -maix32 version 4.2.4 (*1)
    using     gcc -maix64 version 4.2.4 (*2)
    smoketime 1 day 54 minutes (average 3 hours 6 minutes)

Summary: FAIL(F)

O = OK  F = Failure(s), extended report at the bottom
X = Failure(s) under TEST but not under harness
? = still running or test results not (yet) available
Build failures during:       - = unknown or N/A
c = Configure, m = make, M = make (after miniperl), t = make test-prep

v5.31.5-318-g16b1849
---------------------- ----------------------------------------------------
F  F  F  F  F  F        -Dcc=gcc (*1)
-  -  -  -  -  -        -Dcc=gcc -Duse64bitall (*1)
F  F  F  F  F  F        -Dcc=gcc -Duseithreads (*1)
-  -  -  -  -  -        -Dcc=gcc -Duseithreads -Duse64bitall (*1)
-  -  -  -  -  -        -Dcc=gcc (*2)
F  F  F  F  F  F        -Dcc=gcc -Duse64bitall (*2)
-  -  -  -  -  -        -Dcc=gcc -Duseithreads (*2)
F  F  F  F  F  F        -Dcc=gcc -Duseithreads -Duse64bitall (*2)
|  |  |  |  |  |
|  |  |  |  |  +------  locale:EN_US.UTF-8 DEBUGGING
|  |  |  |  +---------  perlio DEBUGGING
|  |  |  +------------  stdio DEBUGGING
|  |  +---------------  locale:EN_US.UTF-8
|  +------------------  perlio
+---------------------  stdio

Applied patches:
  SMOKE16b18492a3b13a32fa4c894a24245b7f615366e4

Skipped tests:
  None

Test failures:
~~ ../t/re/pat.t ............................................... FAILED 964
  [locale:EN_US.UTF-8] -Dcc=gcc
  [locale:EN_US.UTF-8] -Dcc=gcc -Duse64bitall
  [locale:EN_US.UTF-8] -Dcc=gcc -Duseithreads -Duse64bitall DEBUGGING
  [locale:EN_US.UTF-8] -Dcc=gcc -Duseithreads DEBUGGING
  [locale:EN_US.UTF-8] -Dcc=gcc -Duseithreads
  [locale:EN_US.UTF-8] -Dcc=gcc DEBUGGING
  [locale:EN_US.UTF-8] -Dcc=gcc -Duse64bitall DEBUGGING
  [locale:EN_US.UTF-8] -Dcc=gcc -Duseithreads -Duse64bitall
~~ ../cpan/ExtUtils-MakeMaker/t/03-xsstatic.t .................. FAILED 5 11 17 23 29 35 Non-zero exit status: 6
  [stdio/perlio/locale:EN_US.UTF-8] -Dcc=gcc
  [stdio/perlio/locale:EN_US.UTF-8] -Dcc=gcc -Duse64bitall
  [stdio/perlio/locale:EN_US.UTF-8] -Dcc=gcc -Duseithreads -Duse64bitall DEBUGGING
  [stdio/perlio/locale:EN_US.UTF-8] -Dcc=gcc -Duseithreads DEBUGGING
  [stdio/perlio/locale:EN_US.UTF-8] -Dcc=gcc -Duseithreads
  [stdio/perlio/locale:EN_US.UTF-8] -Dcc=gcc DEBUGGING
  [stdio/perlio/locale:EN_US.UTF-8] -Dcc=gcc -Duse64bitall DEBUGGING
  [stdio/perlio/locale:EN_US.UTF-8] -Dcc=gcc -Duseithreads -Duse64bitall
~~ ../cpan/IO-Socket-IP/t/31nonblocking-connect-internet.t ..... FAILED Non-zero exit status: 55 No plan found in TAP output
  [locale:EN_US.UTF-8] -Dcc=gcc
  [perlio] -Dcc=gcc -Duse64bitall
  [perlio/locale:EN_US.UTF-8] -Dcc=gcc -Duse64bitall DEBUGGING
~~ ../ext/XS-APItest/t/subsignature.t .......................... FAILED 2 Non-zero exit status: 1
  [stdio/perlio/locale:EN_US.UTF-8] -Dcc=gcc
  [stdio/perlio/locale:EN_US.UTF-8] -Dcc=gcc -Duse64bitall
  [stdio/perlio/locale:EN_US.UTF-8] -Dcc=gcc -Duseithreads -Duse64bitall DEBUGGING
  [stdio/perlio/locale:EN_US.UTF-8] -Dcc=gcc -Duseithreads DEBUGGING
  [stdio/perlio/locale:EN_US.UTF-8] -Dcc=gcc -Duseithreads
  [stdio/perlio/locale:EN_US.UTF-8] -Dcc=gcc DEBUGGING
  [stdio/perlio/locale:EN_US.UTF-8] -Dcc=gcc -Duse64bitall DEBUGGING
  [stdio/perlio/locale:EN_US.UTF-8] -Dcc=gcc -Duseithreads -Duse64bitall
~~ ../t/re/pat_thr.t ........................................... FAILED 964
  [locale:EN_US.UTF-8] -Dcc=gcc -Duseithreads
  [locale:EN_US.UTF-8] -Dcc=gcc -Duseithreads -Duse64bitall DEBUGGING
  [locale:EN_US.UTF-8] -Dcc=gcc -Duseithreads DEBUGGING
  [locale:EN_US.UTF-8] -Dcc=gcc -Duseithreads -Duse64bitall
~~ ../cpan/Socket/t/Socket.t ................................... FAILED Non-zero exit status: 255 Bad plan.  You planned 6 tests but ran 2.
  [locale:EN_US.UTF-8] -Dcc=gcc
  [locale:EN_US.UTF-8] -Dcc=gcc -Duse64bitall
  [locale:EN_US.UTF-8] -Dcc=gcc -Duseithreads -Duse64bitall DEBUGGING
  [locale:EN_US.UTF-8] -Dcc=gcc -Duseithreads DEBUGGING
  [locale:EN_US.UTF-8] -Dcc=gcc -Duseithreads
  [locale:EN_US.UTF-8] -Dcc=gcc DEBUGGING
  [locale:EN_US.UTF-8] -Dcc=gcc -Duse64bitall DEBUGGING
  [locale:EN_US.UTF-8] -Dcc=gcc -Duseithreads -Duse64bitall

Test todo-passed:

MANIFEST messages:
  MANIFEST did not declare 'rm.sh'
  MANIFEST did not declare 'rmf.sh'

Compiler messages:
  op.c: In function 'Perl_ck_eval':
  op.c:12513: warning: value computed is not used
  op.c: In function 'Perl_report_redefined_cv':
  op.c:18099: warning: passing argument 1 of 'Perl_CvGV' discards qualifiers from pointer target type
  op.c: In function 'Perl_pmruntime':
  op.c:6866: warning: 't_cp' may be used uninitialized in this function
  op.c:6866: note: 't_cp' was declared here
  op.c:6866: warning: 'r_cp' may be used uninitialized in this function
  op.c:6866: note: 'r_cp' was declared here
  op.c:6865: warning: 'r_map' may be used uninitialized in this function
  op.c:6865: note: 'r_map' was declared here
  intrpvar.h: In function 'S_init_interp':
  intrpvar.h:806: warning: 'Perl_sv_nounlocking' is deprecated (declared at proto.h:3456)
  proto.h:6261: warning: 'S_parse_ident' declared inline after being called
  proto.h:6261: warning: previous declaration of 'S_parse_ident' was here
  toke.c: In function 'Perl_scan_num':
  toke.c:11474: warning: 'b' may be used uninitialized in this function
  regcomp.c: In function 'S_study_chunk':
  regcomp.c:5479: warning: comparison between signed and unsigned
  regcomp.c: In function 'S_regpiece':
  regcomp.c:12565: warning: comparison between signed and unsigned
  regcomp.c: In function 'S_regtail':
  regcomp.c:20054: warning: comparison between signed and unsigned
  dump.c: In function 'Perl_do_sv_dump':
  dump.c:2308: warning: passing argument 1 of 'Perl_CvGV' discards qualifiers from pointer target type
  sv.c: In function 'Perl_sv_setpviv_mg':
  sv.c:10739: warning: 'Perl_sv_setpviv' is deprecated (declared at sv.c:10709)
  pp.c: In function 'Perl_pp_argelem':
  pp.c:7050: warning: value computed is not used
  pp_sys.c: In function 'Perl_pp_stat':
  pp_sys.c:2945: warning: comparison of unsigned expression < 0 is always false
  regexec.c: In function 'S_regmatch':
  regexec.c:8145: warning: comparison between signed and unsigned
  regexec.c:8168: warning: comparison between signed and unsigned
  universal.c: In function 'Perl_croak_xs_usage':
  universal.c:343: warning: passing argument 1 of 'Perl_CvGV' discards qualifiers from pointer target type
  mathoms.c: In function 'Perl_sv_pvbyten':
  mathoms.c:470: warning: 'Perl_sv_pvn' is deprecated (declared at mathoms.c:387)
  mathoms.c: In function 'Perl_sv_pvutf8n':
  mathoms.c:506: warning: 'Perl_sv_pvn' is deprecated (declared at mathoms.c:387)
  B.c: In function 'XS_B__PADNAME_TYPE':
  B.xs:2210: warning: 'ret' may be used uninitialized in this function
  B.xs:2210: note: 'ret' was declared here
  bzlib.c: In function 'default_bzalloc':
  bzlib.c:102: warning: unused parameter 'opaque'
  bzlib.c: In function 'default_bzfree':
  bzlib.c:109: warning: unused parameter 'opaque'
  RealPPPort.xs: In function 'XS_Devel__PPPort_sprintf_ivmax':
  RealPPPort.xs:1006: warning: format '%ld' expects type 'long int', but argument 2 has type 'int'
  RealPPPort.xs: In function 'XS_Devel__PPPort_sprintf_uvmax':
  RealPPPort.xs:1013: warning: format '%lu' expects type 'long unsigned int', but argument 2 has type 'unsigned int'
  RealPPPort.xs: In function 'XS_Devel__PPPort_check_HeUTF8':
  RealPPPort.xs:1983: warning: value computed is not used
  RealPPPort.c: In function 'XS_Devel__PPPort_isASCII_utf8_safe':
  RealPPPort.c:4932: warning: unused variable 'offset'
  RealPPPort.c: In function 'XS_Devel__PPPort_isASCII_LC_utf8_safe':
  RealPPPort.c:5638: warning: unused variable 'offset'
  Encode.c: In function 'XS_Encode_decode':
  Encode.c:1356: warning: unused variable 'ix'
  Encode.c: In function 'XS_Encode_encode':
  Encode.c:1398: warning: unused variable 'ix'
  ODBM_File.c: In function 'XS_ODBM_File_FETCH':
  ODBM_File.c:387: warning: request for implicit conversion from 'void *' to 'const char * const' not permitted in C++
  ODBM_File.xs: In function 'XS_ODBM_File_STORE':
  ODBM_File.xs:176: warning: format '%s' expects type 'char *', but argument 4 has type 'void *'
  e.c: In function 'XS_ODBM_File_FIRSTKEY':
  ODBM_File.c:524: warning: request for implicit conversion from 'void *' to 'const char * const' not permitted in C++
  ODBM_File.c: In function 'XS_ODBM_File_NEXTKEY':
  ODBM_File.c:566: warning: request for implicit conversion from 'void *' to 'const char * const' not permitted in C++
  ./const-xs.inc: In function 'boot_Socket':
  ./const-xs.inc:986: warning: missing braces around initializer
  ./const-xs.inc:986: warning: (near initialization for 'ip6_address.u6_addr')
  ./const-xs.inc:995: warning: missing braces around initializer
  ./const-xs.inc:995: warning: (near initialization for 'ip6_address.u6_addr')
  Storable.xs: In function 'get_regexp':
  Storable.xs:3440: warning: format '%d' expects type 'int', but argument 2 has type 'I32'
  Storable.xs: In function 'retrieve_regexp':
  Storable.xs:6854: warning: format '%d' expects type 'int', but argument 2 has type 'I32'
  const-c.inc: In function 'constant_19':
  const-c.inc:351: warning: unused parameter 'iv_return'
  APItest.xs: In function 'THX_parse_keyword_subsignature':
  APItest.xs:1085: warning: format '%d' expects type 'int', but argument 2 has type 'line_t'
  re_exec.c: In function 'S_regmatch':
  re_exec.c:8145: warning: comparison between signed and unsigned
  re_exec.c:8168: warning: comparison between signed and unsigned
  re_exec.c: In function 'S_regtry':
  re_exec.c:6401: warning: 'fold_array' may be used uninitialized in this function
  re_exec.c:6401: note: 'fold_array' was declared here
  re_exec.c:6400: warning: 'folder' may be used uninitialized in this function
  re_exec.c:6400: note: 'folder' was declared here
  re_comp.c: In function 'S_study_chunk':
  re_comp.c:5479: warning: comparison between signed and unsigned
  re_comp.c: In function 'S_regpiece':
  re_comp.c:12565: warning: comparison between signed and unsigned
  re_comp.c: In function 'S_regtail':
  re_comp.c:20054: warning: comparison between signed and unsigned
  re_comp.c: In function 'S_regtail_study':
  re_comp.c:20168: warning: comparison between signed and unsigned
  op.c:18102: warning: passing argument 1 of 'Perl_CvGV' discards qualifiers from pointer target type
  op.c:18103: warning: passing argument 1 of 'Perl_CvGV' discards qualifiers from pointer target type
  op.c:18104: warning: passing argument 1 of 'Perl_CvGV' discards qualifiers from pointer target type
  op.c: In function 'S_pmtrans':
  pad.c: In function 'S_cv_dump':
  pad.c:1857: warning: passing argument 1 of 'Perl_CvGV' discards qualifiers from pointer target type
  pad.c:1865: warning: passing argument 1 of 'Perl_CvGV' discards qualifiers from pointer target type
  pad.c:1871: warning: passing argument 1 of 'Perl_CvGV' discards qualifiers from pointer target type
  regcomp.c: In function 'S_regtail_study':
  regcomp.c:20168: warning: comparison between signed and unsigned
  dump.c:2315: warning: passing argument 1 of 'Perl_CvGV' discards qualifiers from pointer target type
  regexec.c: In function 'S_regtry':
  regexec.c:6401: warning: 'fold_array' may be used uninitialized in this function
  regexec.c:6401: note: 'fold_array' was declared here
  regexec.c:6400: warning: 'folder' may be used uninitialized in this function
  regexec.c:6400: note: 'folder' was declared here
  DynaLoader.xs: In function 'XS_DynaLoader_dl_load_file':
  DynaLoader.xs:704: warning: format '%x' expects type 'unsigned int', but argument 3 has type 'void *'
  DynaLoader.xs: In function 'XS_DynaLoader_dl_unload_file':
  DynaLoader.xs:716: warning: format '%lx' expects type 'long unsigned int', but argument 3 has type 'void *'
  DynaLoader.xs: In function 'XS_DynaLoader_dl_find_symbol':
  DynaLoader.xs:732: warning: format '%x' expects type 'unsigned int', but argument 3 has type 'void *'
  DynaLoader.xs:735: warning: format '%x' expects type 'unsigned int', but argument 3 has type 'void *'
  DynaLoader.xs: In function 'XS_DynaLoader_dl_install_xsub':
  DynaLoader.xs:758: warning: format '%x' expects type 'unsigned int', but argument 4 has type 'void *'
  ODBM_File.c: In function 'XS_ODBM_File_FIRSTKEY':
  Storable.xs: In function 'store_hook':
  Storable.xs:4081: warning: format '%d' expects type 'int', but argument 3 has type 'I32'
  Storable.xs: In function 'store':
  Storable.xs:4456: warning: format '%d' expects type 'int', but argument 3 has type 'I32'
  const-c.inc: In function '_constant_8':
  const-c.inc:583: warning: cast from pointer to integer of different size
  op.c:18099: warning: passing argument 2 of 'Perl_CvGV' discards qualifiers from pointer target type
  perl.c: In function 'S_init_tls_and_interp':
  perl.c:90: warning: implicit declaration of function 'pthread_init'
  dump.c:2308: warning: passing argument 2 of 'Perl_CvGV' discards qualifiers from pointer target type
  pp_sys.c: In function 'Perl_pp_gprotoent':
  pp_sys.c:5155: warning: left-hand operand of comma expression has no effect
  pp_sys.c:5163: warning: left-hand operand of comma expression has no effect
  pp_sys.c:5170: warning: left-hand operand of comma expression has no effect
  pp_sys.c: In function 'Perl_pp_gservent':
  pp_sys.c:5219: warning: left-hand operand of comma expression has no effect
  pp_sys.c:5229: warning: left-hand operand of comma expression has no effect
  pp_sys.c:5236: warning: left-hand operand of comma expression has no effect
  pp_sys.c: In function 'Perl_pp_shostent':
  pp_sys.c:5284: warning: value computed is not used
  pp_sys.c:5291: warning: value computed is not used
  pp_sys.c:5298: warning: value computed is not used
  universal.c:343: warning: passing argument 2 of 'Perl_CvGV' discards qualifiers from pointer target type
  B.xs:2210: warning: 'r[2019-11-18 11:29:10MET] Skip tests from '/pro/3gl/CPAN/smoke/p59.skip'
  shared.xs: In function 'sharedsv_scalar_store':
  shared.xs:830: warning: value computed is not used
  shared.xs: In function 'sharedsv_array_mg_CLEAR':
  shared.xs:1149: warning: 'iter' may be used uninitialized in this function
  op.c:18102: warning: passing argument 2 of 'Perl_CvGV' discards qualifiers from pointer target type
  op.c:18103: warning: passing argument 2 of 'Perl_CvGV' discards qualifiers from pointer target type
  op.c:18104: warning: passing argument 2 of 'Perl_CvGV' discards qualifiers from pointer target type
  pad.c:1857: warning: passing argument 2 of 'Perl_CvGV' discards qualifiers from pointer target type
  pad.c:1865: warning: passing argument 2 of 'Perl_CvGV' discards qualifiers from pointer target type
  pad.c:1871: warning: passing argument 2 of 'Perl_CvGV' discards qualifiers from pointer target type
  dump.c:2315: warning: passing argument 2 of 'Perl_CvGV' discards qualifiers from pointer target type
  bzlib.c:102: warning: unused p[2019-11-18 18:08:40MET] Skip tests from '/pro/3gl/CPAN/smoke/p59.skip'

About this smoke:
    smoking-perl: 5.14.2
  smoker-version: 1.72_06/0.046
       timestamp: 2019-11-17 23:07:09+00
          tester: merijn

Status overview available here: https://tux.nl/perl5/smoke/
-- 
Report generated by Test::Smoke::Gateway v0.09_01