Show logfile
Automated smoke report for branch blead 5.31.6 patch cc288b7a2732c37504039083ebb98241954636be v5.31.5-316-gcc288b7a27
Dell-Latitude-E6530: Intel(R) Core(TM) i7-3740QM CPU @ 2.70GHz(~2691 MHz) (Intel64/8 cpus)
    on        MSWin32 Win10 Business
    using     cl version 19.23.28106.4 (*1)
    smoketime 5 hours 24 minutes (average 40 minutes 31 seconds)

Summary: FAIL(F)

O = OK  F = Failure(s), extended report at the bottom
X = Failure(s) under TEST but not under harness
? = still running or test results not (yet) available
Build failures during:       - = unknown or N/A
c = Configure, m = make, M = make (after miniperl), t = make test-prep

v5.31.5-316-gcc288b7a27
---------------------- ----------------------------------------------------
F  F                     (*1)
F  F                    -Duselargefiles (*1)
F  F                    -Duseithreads (*1)
F  F                    -Duseithreads -Duselargefiles (*1)
|  |
|  +------------------  stdio DEBUGGING
+---------------------  stdio

Applied patches:
  SMOKEcc288b7a2732c37504039083ebb98241954636be

Skipped tests:
  None

Test failures:
~~ ../t/porting/customized.t ................................... FAILED 1-31
  [stdio] 
  [stdio] -Duseithreads -Duselargefiles
  [stdio] -Duseithreads DEBUGGING
  [stdio] -Duselargefiles
  [stdio] -Duseithreads -Duselargefiles DEBUGGING
  [stdio]  DEBUGGING
  [stdio] -Duseithreads
  [stdio] -Duselargefiles DEBUGGING
~~ ../cpan/CPAN-Meta-YAML/t/31_local_tml.t ..................... FAILED Non-zero exit status: 2 No plan found in TAP output
  [stdio] 
  [stdio] -Duseithreads -Duselargefiles
  [stdio] -Duseithreads DEBUGGING
  [stdio] -Duselargefiles
  [stdio] -Duseithreads -Duselargefiles DEBUGGING
  [stdio]  DEBUGGING
  [stdio] -Duseithreads
  [stdio] -Duselargefiles DEBUGGING
~~ ../cpan/IO-Compress/t/105oneshot-zip-only.t ................. FAILED 227 Non-zero exit status: 1
  [stdio] 
  [stdio] -Duseithreads -Duselargefiles
  [stdio] -Duseithreads DEBUGGING
  [stdio] -Duselargefiles
  [stdio] -Duseithreads -Duselargefiles DEBUGGING
  [stdio]  DEBUGGING
  [stdio] -Duseithreads
  [stdio] -Duselargefiles DEBUGGING
~~ ../cpan/CPAN-Meta-YAML/t/30_yaml_spec_tml.t ................. FAILED Non-zero exit status: 2 No plan found in TAP output
  [stdio] 
  [stdio] -Duseithreads -Duselargefiles
  [stdio] -Duseithreads DEBUGGING
  [stdio] -Duselargefiles
  [stdio] -Duseithreads -Duselargefiles DEBUGGING
  [stdio]  DEBUGGING
  [stdio] -Duseithreads
  [stdio] -Duselargefiles DEBUGGING
~~ ../cpan/CPAN-Meta-YAML/t/32_world_tml.t ..................... FAILED Non-zero exit status: 2 No plan found in TAP output
  [stdio] 
  [stdio] -Duseithreads -Duselargefiles
  [stdio] -Duseithreads DEBUGGING
  [stdio] -Duselargefiles
  [stdio] -Duseithreads -Duselargefiles DEBUGGING
  [stdio]  DEBUGGING
  [stdio] -Duseithreads
  [stdio] -Duselargefiles DEBUGGING
~~ ../cpan/Pod-Simple/t/JustPod_corpus.t ....................... FAILED 3-7 Non-zero exit status: 15
  [stdio] 
  [stdio] -Duseithreads -Duselargefiles
  [stdio] -Duseithreads DEBUGGING
  [stdio] -Duselargefiles
  [stdio] -Duseithreads -Duselargefiles DEBUGGING
  [stdio]  DEBUGGING
  [stdio] -Duseithreads
  [stdio] -Duselargefiles DEBUGGING
~~ ../t/porting/pod_rules.t .................................... FAILED 2-6 Bad plan.  You planned 8 tests but ran 6.
  [stdio] 
  [stdio] -Duseithreads -Duselargefiles
  [stdio] -Duseithreads DEBUGGING
  [stdio] -Duselargefiles
  [stdio] -Duseithreads -Duselargefiles DEBUGGING
  [stdio]  DEBUGGING
  [stdio] -Duseithreads
  [stdio] -Duselargefiles DEBUGGING
~~ ../t/porting/regen.t ........................................ FAILED 12 Non-zero exit status: 255 Bad plan.  You planned 45 tests but ran 12.
  [stdio] 
  [stdio] -Duseithreads -Duselargefiles
  [stdio] -Duseithreads DEBUGGING
  [stdio] -Duselargefiles
  [stdio] -Duseithreads -Duselargefiles DEBUGGING
  [stdio]  DEBUGGING
  [stdio] -Duseithreads
  [stdio] -Duselargefiles DEBUGGING
~~ ../cpan/ExtUtils-MakeMaker/t/02-xsdynamic.t ................. FAILED 17 Non-zero exit status: 4
  [stdio] 
  [stdio] -Duselargefiles
  [stdio]  DEBUGGING
  [stdio] -Duselargefiles DEBUGGING
~~ ../dist/Net-Ping/t/450_service.t ............................ FAILED 9 Non-zero exit status: 1
  [stdio] 
  [stdio] -Duseithreads -Duselargefiles
  [stdio] -Duseithreads DEBUGGING
  [stdio] -Duselargefiles
  [stdio] -Duseithreads -Duselargefiles DEBUGGING
  [stdio]  DEBUGGING
  [stdio] -Duseithreads
  [stdio] -Duselargefiles DEBUGGING
~~ ../cpan/podlators/t/text/encoding.t ......................... FAILED Non-zero exit status: 255 Bad plan.  You planned 7 tests but ran 1.
  [stdio] 
  [stdio] -Duseithreads -Duselargefiles
  [stdio] -Duseithreads DEBUGGING
  [stdio] -Duselargefiles
  [stdio] -Duseithreads -Duselargefiles DEBUGGING
  [stdio]  DEBUGGING
  [stdio] -Duseithreads
  [stdio] -Duselargefiles DEBUGGING

Test todo-passed:
~~ ../ext/IPC-Open3/t/IPC-Open3.t .............................. PASSED 25
  [stdio] 
  [stdio] -Duseithreads -Duselargefiles
  [stdio] -Duseithreads DEBUGGING
  [stdio] -Duselargefiles
  [stdio] -Duseithreads -Duselargefiles DEBUGGING
  [stdio]  DEBUGGING
  [stdio] -Duseithreads
  [stdio] -Duselargefiles DEBUGGING

MANIFEST messages:

Compiler messages:
  [2019-11-16 18:27:49Z] perlio.obj : warning LNK4197: export 'PerlIO_pending' specified multiple times; using first specification
  [2019-11-16 18:27:49Z] perlio.obj : warning LNK4197: export 'PerlIO_perlio' specified multiple times; using first specification
  [2019-11-16 18:27:49Z] LINK : warning LNK4281: undesirable base address 0x28000000 for x64 image; set base address above 4GB for best ASLR optimization
  # Test.obj : error LNK2001: unresolved external symbol PL_curpad
  # Test.obj : error LNK2001: unresolved external symbol PL_op
  # Test.obj : error LNK2001: unresolved external symbol PL_stack_base
  # Test.obj : error LNK2001: unresolved external symbol PL_tainted
  # Test.obj : error LNK2001: unresolved external symbol PL_markstack_ptr
  # Test.obj : error LNK2001: unresolved external symbol PL_stack_sp
  # blib\arch\auto\XS\Test\Test.dll : fatal error LNK1120: 6 unresolved externals
  # NMAKE : fatal error U1077: '"C:\Program Files (x86)\Microsoft Visual Studio\2019\Community\VC\Tools\MSVC\14.23.28105\bin\HostX64\x64\link.EXE"' : return code '0x460'
  # Other.obj : error LNK2001: unresolved external symbol PL_curpad
  # Other.obj : error LNK2001: unresolved external symbol PL_op
  # Other.obj : error LNK2001: unresolved external symbol PL_stack_base
  # Other.obj : error LNK2001: unresolved external symbol PL_tainted
  # Other.obj : error LNK2001: unresolved external symbol PL_markstack_ptr
  # Other.obj : error LNK2001: unresolved external symbol PL_stack_sp
  # blib\arch\auto\XS\Other\Other.dll : fatal error LNK1120: 6 unresolved externals
  [2019-11-16 18:56:30Z] perlio.obj : warning LNK4197: export 'PerlIO_perlio' specified multiple times; using first specification
  [2019-11-16 18:56:30Z] perlio.obj : warning LNK4197: export 'PerlIO_pending' specified multiple times; using first specification
  [2019-11-16 18:56:30Z] LINK : warning LNK4281: undesirable base address 0x28000000 for x64 image; set base address above 4GB for best ASLR optimization
  [2019-11-16 18:56:30Z] c:\perl\smoke\perl\mswin32-win10-blead\build\ext\POSIX\POSIX.xs(1090) : warning C4715: 'my_rint': not all control paths return a value
  # Test.obj : error LNK2001: unresolved external symbol PL_markstack
  # Test.obj : error LNK2001: unresolved external symbol PL_debug
  # blib\arch\auto\XS\Test\Test.dll : fatal error LNK1120: 7 unresolved externals
  # Other.obj : error LNK2001: unresolved external symbol PL_markstack
  # Other.obj : error LNK2001: unresolved external symbol PL_debug
  # blib\arch\auto\XS\Other\Other.dll : fatal error LNK1120: 7 unresolved externals
  [2019-11-16 19:38:30Z] perlio.obj : warning LNK4197: export 'PerlIO_pending' specified multiple times; using first specification
  [2019-11-16 19:38:30Z] perlio.obj : warning LNK4197: export 'PerlIO_perlio' specified multiple times; using first specification
  [2019-11-16 19:38:30Z] LINK : warning LNK4281: undesirable base address 0x28000000 for x64 image; set base address above 4GB for best ASLR optimization
  [2019-11-16 20:09:39Z] perlio.obj : warning LNK4197: export 'PerlIO_perlio' specified multiple times; using first specification
  [2019-11-16 20:09:39Z] perlio.obj : warning LNK4197: export 'PerlIO_pending' specified multiple times; using first specification
  [2019-11-16 20:09:39Z] LINK : warning LNK4281: undesirable base address 0x28000000 for x64 image; set base address above 4GB for best ASLR optimization
  [2019-11-16 20:09:39Z] c:\perl\smoke\perl\mswin32-win10-blead\build\ext\POSIX\POSIX.xs(1090) : warning C4715: 'my_rint': not all control paths return a value
  [2019-11-16 20:53:03Z] perlio.obj : warning LNK4197: export 'PerlIO_pending' specified multiple times; using first specification
  [2019-11-16 20:53:03Z] perlio.obj : warning LNK4197: export 'PerlIO_perlio' specified multiple times; using first specification
  [2019-11-16 20:53:03Z] LINK : warning LNK4281: undesirable base address 0x28000000 for x64 image; set base address above 4GB for best ASLR optimization
  [2019-11-16 21:31:34Z] perlio.obj : warning LNK4197: export 'PerlIO_perlio' specified multiple times; using first specification
  [2019-11-16 21:31:34Z] perlio.obj : warning LNK4197: export 'PerlIO_pending' specified multiple times; using first specification
  [2019-11-16 21:31:34Z] LINK : warning LNK4281: undesirable base address 0x28000000 for x64 image; set base address above 4GB for best ASLR optimization
  [2019-11-16 21:31:34Z] c:\perl\smoke\perl\mswin32-win10-blead\build\ext\POSIX\POSIX.xs(1090) : warning C4715: 'my_rint': not all control paths return a value
  [2019-11-16 22:23:24Z] perlio.obj : warning LNK4197: export 'PerlIO_pending' specified multiple times; using first specification
  [2019-11-16 22:23:24Z] perlio.obj : warning LNK4197: export 'PerlIO_perlio' specified multiple times; using first specification
  [2019-11-16 22:23:24Z] LINK : warning LNK4281: undesirable base address 0x28000000 for x64 image; set base address above 4GB for best ASLR optimization
  [2019-11-16 22:59:50Z] perlio.obj : warning LNK4197: export 'PerlIO_perlio' specified multiple times; using first specification
  [2019-11-16 22:59:50Z] perlio.obj : warning LNK4197: export 'PerlIO_pending' specified multiple times; using first specification
  [2019-11-16 22:59:50Z] LINK : warning LNK4281: undesirable base address 0x28000000 for x64 image; set base address above 4GB for best ASLR optimization
  [2019-11-16 22:59:50Z] c:\perl\smoke\perl\mswin32-win10-blead\build\ext\POSIX\POSIX.xs(1090) : warning C4715: 'my_rint': not all control paths return a value

About this smoke:
    smoking-perl: 5.28.1
  smoker-version: 1.72/0.046
       timestamp: 2019-11-16 18:23:08+00
          tester: greer

[smoke setup in testing] Smoke logs available at http://m-l.org/~perl/smoke/perl/mswin32-x64-multi-thread-win10/mswin32-win10-blead/logcc288b7a2732c37504039083ebb98241954636be.log.gz
-- 
Report generated by Test::Smoke::Gateway v0.09_01