Show logfile
Automated smoke report for branch blead 5.31.6 patch 8b4eae17ee698efd0058dcf19153c32fdaa2b02e v5.31.5-212-g8b4eae17ee
vier.local: Intel(R) Core(TM) i7-3820 CPU @ 3.60GHz (GenuineIntel 3702MHz) (x86_64/1[8 cores] cpus)
    on        linux 5.2.7-200.fc30.x86_64 [Fedora 30]
    using     clang++ version 4.2.1 Compatible Clang 8.0.0 (Fedora 8.0.0-3.fc30) (*1)
    smoketime 6 days 20 minutes (average 9 hours 1 minute)

Summary: FAIL(F)

O = OK  F = Failure(s), extended report at the bottom
X = Failure(s) under TEST but not under harness
? = still running or test results not (yet) available
Build failures during:       - = unknown or N/A
c = Configure, m = make, M = make (after miniperl), t = make test-prep

v5.31.5-212-g8b4eae17ee
---------------------- ----------------------------------------------------
F  F  F  F  F  F        -Dcc=clang++ -Accflags="-Werror=declaration-after-statement -g -fno-omit-frame-pointer -fsanitize=address  -fno-common -fsanitize-blacklist=`pwd`/asan_ignore" -Aldflags="-fsanitize=address" -Accflags=-DNO_MATHOMS (*1)
F  F  F  F  F  F        -Dcc=clang++ -Accflags="-Werror=declaration-after-statement -g -fno-omit-frame-pointer -fsanitize=address  -fno-common -fsanitize-blacklist=`pwd`/asan_ignore" -Aldflags="-fsanitize=address" -Accflags=-DPERL_POISON (*1)
F  F  F  F  F  F        -Dcc=clang++ -Accflags="-Werror=declaration-after-statement -g -fno-omit-frame-pointer -fsanitize=address  -fno-common -fsanitize-blacklist=`pwd`/asan_ignore" -Aldflags="-fsanitize=address" -Duse64bitall (*1)
F  F  F  F  F  F        -Dcc=clang++ -Accflags="-Werror=declaration-after-statement -g -fno-omit-frame-pointer -fsanitize=address  -fno-common -fsanitize-blacklist=`pwd`/asan_ignore" -Aldflags="-fsanitize=address" -Dusemorebits (*1)
F  F  F  F  F  F        -Dcc=clang++ -Accflags="-Werror=declaration-after-statement -g -fno-omit-frame-pointer -fsanitize=address  -fno-common -fsanitize-blacklist=`pwd`/asan_ignore" -Aldflags="-fsanitize=address" -Duseithreads -Accflags=-DNO_MATHOMS (*1)
F  F  F  F  F  F        -Dcc=clang++ -Accflags="-Werror=declaration-after-statement -g -fno-omit-frame-pointer -fsanitize=address  -fno-common -fsanitize-blacklist=`pwd`/asan_ignore" -Aldflags="-fsanitize=address" -Duseithreads -Accflags=-DPERL_POISON (*1)
F  F  F  F  F  F        -Dcc=clang++ -Accflags="-Werror=declaration-after-statement -g -fno-omit-frame-pointer -fsanitize=address  -fno-common -fsanitize-blacklist=`pwd`/asan_ignore" -Aldflags="-fsanitize=address" -Duseithreads -Duse64bitall (*1)
F  F  F  F  F  F        -Dcc=clang++ -Accflags="-Werror=declaration-after-statement -g -fno-omit-frame-pointer -fsanitize=address  -fno-common -fsanitize-blacklist=`pwd`/asan_ignore" -Aldflags="-fsanitize=address" -Duseithreads -Dusemorebits (*1)
|  |  |  |  |  |
|  |  |  |  |  +------  locale:en_US.utf8 DEBUGGING
|  |  |  |  +---------  perlio DEBUGGING
|  |  |  +------------  stdio DEBUGGING
|  |  +---------------  locale:en_US.utf8
|  +------------------  perlio
+---------------------  stdio

Applied patches:
  SMOKE8b4eae17ee698efd0058dcf19153c32fdaa2b02e

Skipped tests:
  None

Test failures:
~~ ../t/uni/tr_utf8.t .......................................... FAILED Non-zero exit status: 1
  [stdio/perlio/locale:en_US.utf8] -Dcc=clang++ -Accflags="-Werror=declaration-after-statement -g -fno-omit-frame-pointer -fsanitize=address  -fno-common -fsanitize-blacklist=`pwd`/asan_ignore" -Aldflags="-fsanitize=address" -Duseithreads -Duse64bitall DEBUGGING
  [stdio/perlio/locale:en_US.utf8] -Dcc=clang++ -Accflags="-Werror=declaration-after-statement -g -fno-omit-frame-pointer -fsanitize=address  -fno-common -fsanitize-blacklist=`pwd`/asan_ignore" -Aldflags="-fsanitize=address" -Duseithreads -Accflags=-DPERL_POISON DEBUGGING
  [stdio/perlio/locale:en_US.utf8] -Dcc=clang++ -Accflags="-Werror=declaration-after-statement -g -fno-omit-frame-pointer -fsanitize=address  -fno-common -fsanitize-blacklist=`pwd`/asan_ignore" -Aldflags="-fsanitize=address" -Duseithreads -Accflags=-DNO_MATHOMS
  [stdio/perlio/locale:en_US.utf8] -Dcc=clang++ -Accflags="-Werror=declaration-after-statement -g -fno-omit-frame-pointer -fsanitize=address  -fno-common -fsanitize-blacklist=`pwd`/asan_ignore" -Aldflags="-fsanitize=address" -Duse64bitall DEBUGGING
  [stdio/perlio/locale:en_US.utf8] -Dcc=clang++ -Accflags="-Werror=declaration-after-statement -g -fno-omit-frame-pointer -fsanitize=address  -fno-common -fsanitize-blacklist=`pwd`/asan_ignore" -Aldflags="-fsanitize=address" -Accflags=-DNO_MATHOMS DEBUGGING
  [stdio/perlio/locale:en_US.utf8] -Dcc=clang++ -Accflags="-Werror=declaration-after-statement -g -fno-omit-frame-pointer -fsanitize=address  -fno-common -fsanitize-blacklist=`pwd`/asan_ignore" -Aldflags="-fsanitize=address" -Accflags=-DNO_MATHOMS
  [stdio/perlio/locale:en_US.utf8] -Dcc=clang++ -Accflags="-Werror=declaration-after-statement -g -fno-omit-frame-pointer -fsanitize=address  -fno-common -fsanitize-blacklist=`pwd`/asan_ignore" -Aldflags="-fsanitize=address" -Accflags=-DPERL_POISON
  [stdio/perlio/locale:en_US.utf8] -Dcc=clang++ -Accflags="-Werror=declaration-after-statement -g -fno-omit-frame-pointer -fsanitize=address  -fno-common -fsanitize-blacklist=`pwd`/asan_ignore" -Aldflags="-fsanitize=address" -Dusemorebits
  [stdio/perlio/locale:en_US.utf8] -Dcc=clang++ -Accflags="-Werror=declaration-after-statement -g -fno-omit-frame-pointer -fsanitize=address  -fno-common -fsanitize-blacklist=`pwd`/asan_ignore" -Aldflags="-fsanitize=address" -Duseithreads -Dusemorebits
  [stdio/perlio/locale:en_US.utf8] -Dcc=clang++ -Accflags="-Werror=declaration-after-statement -g -fno-omit-frame-pointer -fsanitize=address  -fno-common -fsanitize-blacklist=`pwd`/asan_ignore" -Aldflags="-fsanitize=address" -Duse64bitall
  [stdio/perlio/locale:en_US.utf8] -Dcc=clang++ -Accflags="-Werror=declaration-after-statement -g -fno-omit-frame-pointer -fsanitize=address  -fno-common -fsanitize-blacklist=`pwd`/asan_ignore" -Aldflags="-fsanitize=address" -Accflags=-DPERL_POISON DEBUGGING
  [stdio/perlio/locale:en_US.utf8] -Dcc=clang++ -Accflags="-Werror=declaration-after-statement -g -fno-omit-frame-pointer -fsanitize=address  -fno-common -fsanitize-blacklist=`pwd`/asan_ignore" -Aldflags="-fsanitize=address" -Duseithreads -Accflags=-DNO_MATHOMS DEBUGGING
  [stdio/perlio/locale:en_US.utf8] -Dcc=clang++ -Accflags="-Werror=declaration-after-statement -g -fno-omit-frame-pointer -fsanitize=address  -fno-common -fsanitize-blacklist=`pwd`/asan_ignore" -Aldflags="-fsanitize=address" -Dusemorebits DEBUGGING
  [stdio/perlio/locale:en_US.utf8] -Dcc=clang++ -Accflags="-Werror=declaration-after-statement -g -fno-omit-frame-pointer -fsanitize=address  -fno-common -fsanitize-blacklist=`pwd`/asan_ignore" -Aldflags="-fsanitize=address" -Duseithreads -Dusemorebits DEBUGGING
  [stdio/perlio/locale:en_US.utf8] -Dcc=clang++ -Accflags="-Werror=declaration-after-statement -g -fno-omit-frame-pointer -fsanitize=address  -fno-common -fsanitize-blacklist=`pwd`/asan_ignore" -Aldflags="-fsanitize=address" -Duseithreads -Duse64bitall
  [stdio/perlio/locale:en_US.utf8] -Dcc=clang++ -Accflags="-Werror=declaration-after-statement -g -fno-omit-frame-pointer -fsanitize=address  -fno-common -fsanitize-blacklist=`pwd`/asan_ignore" -Aldflags="-fsanitize=address" -Duseithreads -Accflags=-DPERL_POISON
~~ ../t/op/tr.t ................................................ FAILED Non-zero exit status: 1
  [stdio/perlio/locale:en_US.utf8] -Dcc=clang++ -Accflags="-Werror=declaration-after-statement -g -fno-omit-frame-pointer -fsanitize=address  -fno-common -fsanitize-blacklist=`pwd`/asan_ignore" -Aldflags="-fsanitize=address" -Duseithreads -Duse64bitall DEBUGGING
  [stdio/perlio/locale:en_US.utf8] -Dcc=clang++ -Accflags="-Werror=declaration-after-statement -g -fno-omit-frame-pointer -fsanitize=address  -fno-common -fsanitize-blacklist=`pwd`/asan_ignore" -Aldflags="-fsanitize=address" -Duseithreads -Accflags=-DPERL_POISON DEBUGGING
  [stdio/perlio/locale:en_US.utf8] -Dcc=clang++ -Accflags="-Werror=declaration-after-statement -g -fno-omit-frame-pointer -fsanitize=address  -fno-common -fsanitize-blacklist=`pwd`/asan_ignore" -Aldflags="-fsanitize=address" -Duseithreads -Accflags=-DNO_MATHOMS
  [stdio/perlio/locale:en_US.utf8] -Dcc=clang++ -Accflags="-Werror=declaration-after-statement -g -fno-omit-frame-pointer -fsanitize=address  -fno-common -fsanitize-blacklist=`pwd`/asan_ignore" -Aldflags="-fsanitize=address" -Duse64bitall DEBUGGING
  [stdio/perlio/locale:en_US.utf8] -Dcc=clang++ -Accflags="-Werror=declaration-after-statement -g -fno-omit-frame-pointer -fsanitize=address  -fno-common -fsanitize-blacklist=`pwd`/asan_ignore" -Aldflags="-fsanitize=address" -Accflags=-DNO_MATHOMS DEBUGGING
  [stdio/perlio/locale:en_US.utf8] -Dcc=clang++ -Accflags="-Werror=declaration-after-statement -g -fno-omit-frame-pointer -fsanitize=address  -fno-common -fsanitize-blacklist=`pwd`/asan_ignore" -Aldflags="-fsanitize=address" -Accflags=-DNO_MATHOMS
  [stdio/perlio/locale:en_US.utf8] -Dcc=clang++ -Accflags="-Werror=declaration-after-statement -g -fno-omit-frame-pointer -fsanitize=address  -fno-common -fsanitize-blacklist=`pwd`/asan_ignore" -Aldflags="-fsanitize=address" -Accflags=-DPERL_POISON
  [stdio/perlio/locale:en_US.utf8] -Dcc=clang++ -Accflags="-Werror=declaration-after-statement -g -fno-omit-frame-pointer -fsanitize=address  -fno-common -fsanitize-blacklist=`pwd`/asan_ignore" -Aldflags="-fsanitize=address" -Dusemorebits
  [stdio/perlio/locale:en_US.utf8] -Dcc=clang++ -Accflags="-Werror=declaration-after-statement -g -fno-omit-frame-pointer -fsanitize=address  -fno-common -fsanitize-blacklist=`pwd`/asan_ignore" -Aldflags="-fsanitize=address" -Duseithreads -Dusemorebits
  [stdio/perlio/locale:en_US.utf8] -Dcc=clang++ -Accflags="-Werror=declaration-after-statement -g -fno-omit-frame-pointer -fsanitize=address  -fno-common -fsanitize-blacklist=`pwd`/asan_ignore" -Aldflags="-fsanitize=address" -Duse64bitall
  [stdio/perlio/locale:en_US.utf8] -Dcc=clang++ -Accflags="-Werror=declaration-after-statement -g -fno-omit-frame-pointer -fsanitize=address  -fno-common -fsanitize-blacklist=`pwd`/asan_ignore" -Aldflags="-fsanitize=address" -Accflags=-DPERL_POISON DEBUGGING
  [stdio/perlio/locale:en_US.utf8] -Dcc=clang++ -Accflags="-Werror=declaration-after-statement -g -fno-omit-frame-pointer -fsanitize=address  -fno-common -fsanitize-blacklist=`pwd`/asan_ignore" -Aldflags="-fsanitize=address" -Duseithreads -Accflags=-DNO_MATHOMS DEBUGGING
  [stdio/perlio/locale:en_US.utf8] -Dcc=clang++ -Accflags="-Werror=declaration-after-statement -g -fno-omit-frame-pointer -fsanitize=address  -fno-common -fsanitize-blacklist=`pwd`/asan_ignore" -Aldflags="-fsanitize=address" -Dusemorebits DEBUGGING
  [stdio/perlio/locale:en_US.utf8] -Dcc=clang++ -Accflags="-Werror=declaration-after-statement -g -fno-omit-frame-pointer -fsanitize=address  -fno-common -fsanitize-blacklist=`pwd`/asan_ignore" -Aldflags="-fsanitize=address" -Duseithreads -Dusemorebits DEBUGGING
  [stdio/perlio/locale:en_US.utf8] -Dcc=clang++ -Accflags="-Werror=declaration-after-statement -g -fno-omit-frame-pointer -fsanitize=address  -fno-common -fsanitize-blacklist=`pwd`/asan_ignore" -Aldflags="-fsanitize=address" -Duseithreads -Duse64bitall
  [stdio/perlio/locale:en_US.utf8] -Dcc=clang++ -Accflags="-Werror=declaration-after-statement -g -fno-omit-frame-pointer -fsanitize=address  -fno-common -fsanitize-blacklist=`pwd`/asan_ignore" -Aldflags="-fsanitize=address" -Duseithreads -Accflags=-DPERL_POISON
~~ ../lib/warnings.t ........................................... FAILED 527
  [stdio/perlio/locale:en_US.utf8] -Dcc=clang++ -Accflags="-Werror=declaration-after-statement -g -fno-omit-frame-pointer -fsanitize=address  -fno-common -fsanitize-blacklist=`pwd`/asan_ignore" -Aldflags="-fsanitize=address" -Duseithreads -Duse64bitall DEBUGGING
  [stdio/perlio/locale:en_US.utf8] -Dcc=clang++ -Accflags="-Werror=declaration-after-statement -g -fno-omit-frame-pointer -fsanitize=address  -fno-common -fsanitize-blacklist=`pwd`/asan_ignore" -Aldflags="-fsanitize=address" -Duseithreads -Accflags=-DPERL_POISON DEBUGGING
  [stdio/perlio/locale:en_US.utf8] -Dcc=clang++ -Accflags="-Werror=declaration-after-statement -g -fno-omit-frame-pointer -fsanitize=address  -fno-common -fsanitize-blacklist=`pwd`/asan_ignore" -Aldflags="-fsanitize=address" -Duseithreads -Accflags=-DNO_MATHOMS
  [stdio/perlio/locale:en_US.utf8] -Dcc=clang++ -Accflags="-Werror=declaration-after-statement -g -fno-omit-frame-pointer -fsanitize=address  -fno-common -fsanitize-blacklist=`pwd`/asan_ignore" -Aldflags="-fsanitize=address" -Duse64bitall DEBUGGING
  [stdio/perlio/locale:en_US.utf8] -Dcc=clang++ -Accflags="-Werror=declaration-after-statement -g -fno-omit-frame-pointer -fsanitize=address  -fno-common -fsanitize-blacklist=`pwd`/asan_ignore" -Aldflags="-fsanitize=address" -Accflags=-DNO_MATHOMS DEBUGGING
  [stdio/perlio/locale:en_US.utf8] -Dcc=clang++ -Accflags="-Werror=declaration-after-statement -g -fno-omit-frame-pointer -fsanitize=address  -fno-common -fsanitize-blacklist=`pwd`/asan_ignore" -Aldflags="-fsanitize=address" -Accflags=-DNO_MATHOMS
  [stdio/perlio/locale:en_US.utf8] -Dcc=clang++ -Accflags="-Werror=declaration-after-statement -g -fno-omit-frame-pointer -fsanitize=address  -fno-common -fsanitize-blacklist=`pwd`/asan_ignore" -Aldflags="-fsanitize=address" -Accflags=-DPERL_POISON
  [stdio/perlio/locale:en_US.utf8] -Dcc=clang++ -Accflags="-Werror=declaration-after-statement -g -fno-omit-frame-pointer -fsanitize=address  -fno-common -fsanitize-blacklist=`pwd`/asan_ignore" -Aldflags="-fsanitize=address" -Dusemorebits
  [stdio/perlio/locale:en_US.utf8] -Dcc=clang++ -Accflags="-Werror=declaration-after-statement -g -fno-omit-frame-pointer -fsanitize=address  -fno-common -fsanitize-blacklist=`pwd`/asan_ignore" -Aldflags="-fsanitize=address" -Duseithreads -Dusemorebits
  [stdio/perlio/locale:en_US.utf8] -Dcc=clang++ -Accflags="-Werror=declaration-after-statement -g -fno-omit-frame-pointer -fsanitize=address  -fno-common -fsanitize-blacklist=`pwd`/asan_ignore" -Aldflags="-fsanitize=address" -Duse64bitall
  [stdio/perlio/locale:en_US.utf8] -Dcc=clang++ -Accflags="-Werror=declaration-after-statement -g -fno-omit-frame-pointer -fsanitize=address  -fno-common -fsanitize-blacklist=`pwd`/asan_ignore" -Aldflags="-fsanitize=address" -Accflags=-DPERL_POISON DEBUGGING
  [stdio/perlio/locale:en_US.utf8] -Dcc=clang++ -Accflags="-Werror=declaration-after-statement -g -fno-omit-frame-pointer -fsanitize=address  -fno-common -fsanitize-blacklist=`pwd`/asan_ignore" -Aldflags="-fsanitize=address" -Duseithreads -Accflags=-DNO_MATHOMS DEBUGGING
  [stdio/perlio/locale:en_US.utf8] -Dcc=clang++ -Accflags="-Werror=declaration-after-statement -g -fno-omit-frame-pointer -fsanitize=address  -fno-common -fsanitize-blacklist=`pwd`/asan_ignore" -Aldflags="-fsanitize=address" -Dusemorebits DEBUGGING
  [stdio/perlio/locale:en_US.utf8] -Dcc=clang++ -Accflags="-Werror=declaration-after-statement -g -fno-omit-frame-pointer -fsanitize=address  -fno-common -fsanitize-blacklist=`pwd`/asan_ignore" -Aldflags="-fsanitize=address" -Duseithreads -Dusemorebits DEBUGGING
  [stdio/perlio/locale:en_US.utf8] -Dcc=clang++ -Accflags="-Werror=declaration-after-statement -g -fno-omit-frame-pointer -fsanitize=address  -fno-common -fsanitize-blacklist=`pwd`/asan_ignore" -Aldflags="-fsanitize=address" -Duseithreads -Duse64bitall
  [stdio/perlio/locale:en_US.utf8] -Dcc=clang++ -Accflags="-Werror=declaration-after-statement -g -fno-omit-frame-pointer -fsanitize=address  -fno-common -fsanitize-blacklist=`pwd`/asan_ignore" -Aldflags="-fsanitize=address" -Duseithreads -Accflags=-DPERL_POISON

Test todo-passed:
~~ ../lib/warnings.t ........................................... PASSED 158
  [locale:en_US.utf8] -Dcc=clang++ -Accflags="-Werror=declaration-after-statement -g -fno-omit-frame-pointer -fsanitize=address  -fno-common -fsanitize-blacklist=`pwd`/asan_ignore" -Aldflags="-fsanitize=address" -Dusemorebits DEBUGGING
  [locale:en_US.utf8] -Dcc=clang++ -Accflags="-Werror=declaration-after-statement -g -fno-omit-frame-pointer -fsanitize=address  -fno-common -fsanitize-blacklist=`pwd`/asan_ignore" -Aldflags="-fsanitize=address" -Duse64bitall DEBUGGING
  [locale:en_US.utf8] -Dcc=clang++ -Accflags="-Werror=declaration-after-statement -g -fno-omit-frame-pointer -fsanitize=address  -fno-common -fsanitize-blacklist=`pwd`/asan_ignore" -Aldflags="-fsanitize=address" -Accflags=-DNO_MATHOMS DEBUGGING
  [locale:en_US.utf8] -Dcc=clang++ -Accflags="-Werror=declaration-after-statement -g -fno-omit-frame-pointer -fsanitize=address  -fno-common -fsanitize-blacklist=`pwd`/asan_ignore" -Aldflags="-fsanitize=address" -Accflags=-DNO_MATHOMS
  [locale:en_US.utf8] -Dcc=clang++ -Accflags="-Werror=declaration-after-statement -g -fno-omit-frame-pointer -fsanitize=address  -fno-common -fsanitize-blacklist=`pwd`/asan_ignore" -Aldflags="-fsanitize=address" -Accflags=-DPERL_POISON
  [locale:en_US.utf8] -Dcc=clang++ -Accflags="-Werror=declaration-after-statement -g -fno-omit-frame-pointer -fsanitize=address  -fno-common -fsanitize-blacklist=`pwd`/asan_ignore" -Aldflags="-fsanitize=address" -Dusemorebits
  [locale:en_US.utf8] -Dcc=clang++ -Accflags="-Werror=declaration-after-statement -g -fno-omit-frame-pointer -fsanitize=address  -fno-common -fsanitize-blacklist=`pwd`/asan_ignore" -Aldflags="-fsanitize=address" -Duse64bitall
  [locale:en_US.utf8] -Dcc=clang++ -Accflags="-Werror=declaration-after-statement -g -fno-omit-frame-pointer -fsanitize=address  -fno-common -fsanitize-blacklist=`pwd`/asan_ignore" -Aldflags="-fsanitize=address" -Accflags=-DPERL_POISON DEBUGGING

MANIFEST messages:

Compiler messages:
  regcomp.c:14606:43: warning: result of comparison of constant 223 with expression of type 'char' is always false [-Wtautological-constant-out-of-range-compare]
  ./perl.h:3594:58: note: expanded from macro 'UNLIKELY'
  ./handy.h:111:24: note: expanded from macro 'cBOOL'
  ./perl.h:3573:62: note: expanded from macro 'EXPECT'
  regcomp.c:15105:5: warning: unused typedef '_static_assertion_failed_15105' [-Wunused-local-typedef]
  ./perl.h:3628:39: note: expanded from macro 'STATIC_ASSERT_DECL'
  ./perl.h:3627:41: note: expanded from macro 'STATIC_ASSERT_1'
  ./perl.h:3626:7: note: expanded from macro 'STATIC_ASSERT_2'
  :291:1: note: expanded from here
  regcomp.c:19417:21: warning: unused typedef '_static_assertion_failed_19417' [-Wunused-local-typedef]
  ./perl.h:3633:52: note: expanded from macro 'STATIC_ASSERT_STMT'
  :72:1: note: expanded from here
  regcomp.c:19418:21: warning: unused typedef '_static_assertion_failed_19418' [-Wunused-local-typedef]
  :75:1: note: expanded from here
  pp_hot.c:1188:9: warning: unused typedef '_static_assertion_failed_1188' [-Wunused-local-typedef]
  :90:1: note: expanded from here
  sv.c:12530:41: warning: adding 'int' to a string does not append to the string [-Wstring-plus-int]
  ./handy.h:538:37: note: expanded from macro 'strnEQ'
  sv.c:12530:41: note: use array indexing to silence this warning
  sv.c:1287:2: warning: unused typedef '_static_assertion_failed_1287' [-Wunused-local-typedef]
  sv.c:1288:2: warning: unused typedef '_static_assertion_failed_1288' [-Wunused-local-typedef]
  :78:1: note: expanded from here
  sv.c:4247:5: warning: unused typedef '_static_assertion_failed_4247' [-Wunused-local-typedef]
  :101:1: note: expanded from here
  sv.c:4248:5: warning: unused typedef '_static_assertion_failed_4248' [-Wunused-local-typedef]
  :104:1: note: expanded from here
  sv.c:4333:3: warning: unused typedef '_static_assertion_failed_4333' [-Wunused-local-typedef]
  :107:1: note: expanded from here
  sv.c:9654:5: warning: unused typedef '_static_assertion_failed_9654' [-Wunused-local-typedef]
  :112:1: note: expanded from here
  sv.c:9693:5: warning: unused typedef '_static_assertion_failed_9693' [-Wunused-local-typedef]
  :115:1: note: expanded from here
  sv.c:9748:5: warning: unused typedef '_static_assertion_failed_9748' [-Wunused-local-typedef]
  :118:1: note: expanded from here
  pp.c:3120:5: warning: unused typedef '_static_assertion_failed_3120' [-Wunused-local-typedef]
  :161:1: note: expanded from here
  pp_sys.c:527:5: warning: unused typedef '_static_assertion_failed_527' [-Wunused-local-typedef]
  pp_sys.c:528:5: warning: unused typedef '_static_assertion_failed_528' [-Wunused-local-typedef]
  :93:1: note: expanded from here
  pp_sys.c:529:5: warning: unused typedef '_static_assertion_failed_529' [-Wunused-local-typedef]
  :96:1: note: expanded from here
  locale.c:1740:27: warning: array subscript is of type 'char' [-Wchar-subscripts]
  locale.c:1741:27: warning: array subscript is of type 'char' [-Wchar-subscripts]
  op.c:3019:5: warning: unused typedef '_static_assertion_failed_3020' [-Wunused-local-typedef]
  :82:1: note: expanded from here
  op.c:3021:5: warning: unused typedef '_static_assertion_failed_3022' [-Wunused-local-typedef]
  :85:1: note: expanded from here
  op.c:7729:13: warning: unused typedef '_static_assertion_failed_7729' [-Wunused-local-typedef]
  :98:1: note: expanded from here
  op.c:16852:21: warning: unused typedef '_static_assertion_failed_16852' [-Wunused-local-typedef]
  :106:1: note: expanded from here
  toke.c:777:5: warning: unused typedef '_static_assertion_failed_778' [-Wunused-local-typedef]
  DynaLoader.c:535:1: warning: duplicate 'extern' declaration specifier [-Wduplicate-decl-specifier]
  ../../XSUB.h:134:29: note: expanded from macro 'XS_EXTERNAL'
  B.c:3518:1: warning: duplicate 'extern' declaration specifier [-Wduplicate-decl-specifier]
  bzlib.c:102:31: warning: unused parameter 'opaque' [-Wunused-parameter]
  bzlib.c:109:29: warning: unused parameter 'opaque' [-Wunused-parameter]
  deflate.c:1240:5: warning: 'register' storage class specifier is deprecated and incompatible with C++17 [-Wdeprecated-register]
  deflate.c:1241:5: warning: 'register' storage class specifier is deprecated and incompatible with C++17 [-Wdeprecated-register]
  deflate.c:1242:5: warning: 'register' storage class specifier is deprecated and incompatible with C++17 [-Wdeprecated-register]
  deflate.c:1261:5: warning: 'register' storage class specifier is deprecated and incompatible with C++17 [-Wdeprecated-register]
  deflate.c:1262:5: warning: 'register' storage class specifier is deprecated and incompatible with C++17 [-Wdeprecated-register]
  deflate.c:1263:5: warning: 'register' storage class specifier is deprecated and incompatible with C++17 [-Wdeprecated-register]
  deflate.c:54:12: warning: unused variable 'deflate_copyright' [-Wunused-const-variable]
  compress.c:190:13: warning: 'register' storage class specifier is deprecated and incompatible with C++17 [-Wdeprecated-register]
  compress.c:191:13: warning: 'register' storage class specifier is deprecated and incompatible with C++17 [-Wdeprecated-register]
  compress.c:192:13: warning: 'register' storage class specifier is deprecated and incompatible with C++17 [-Wdeprecated-register]
  compress.c:198:16: warning: 'register' storage class specifier is deprecated and incompatible with C++17 [-Wdeprecated-register]
  compress.c:360:13: warning: 'register' storage class specifier is deprecated and incompatible with C++17 [-Wdeprecated-register]
  compress.c:361:13: warning: 'register' storage class specifier is deprecated and incompatible with C++17 [-Wdeprecated-register]
  inftrees.c:11:12: warning: unused variable 'inflate_copyright' [-Wunused-const-variable]
  trees.c:1164:5: warning: 'register' storage class specifier is deprecated and incompatible with C++17 [-Wdeprecated-register]
  Cwd.c:1079:1: warning: duplicate 'extern' declaration specifier [-Wduplicate-decl-specifier]
  Bzip2.c:1669:1: warning: duplicate 'extern' declaration specifier [-Wduplicate-decl-specifier]
  Zlib.c:3713:1: warning: duplicate 'extern' declaration specifier [-Wduplicate-decl-specifier]
  Dumper.c:1930:1: warning: duplicate 'extern' declaration specifier [-Wduplicate-decl-specifier]
  Peek.c:840:1: warning: duplicate 'extern' declaration specifier [-Wduplicate-decl-specifier]
  MD5.c:1054:1: warning: duplicate 'extern' declaration specifier [-Wduplicate-decl-specifier]
  SHA.c:723:1: warning: duplicate 'extern' declaration specifier [-Wduplicate-decl-specifier]
  RealPPPort.c:6633:1: warning: duplicate 'extern' declaration specifier [-Wduplicate-decl-specifier]
  Fcntl.c:316:1: warning: duplicate 'extern' declaration specifier [-Wduplicate-decl-specifier]
  Byte.c:187:1: warning: duplicate 'extern' declaration specifier [-Wduplicate-decl-specifier]
  ../../../XSUB.h:134:29: note: expanded from macro 'XS_EXTERNAL'
  Encode.c:1356:5: warning: unused variable 'ix' [-Wunused-variable]
  ../../XSUB.h:185:20: note: expanded from macro 'dXSI32'
  Encode.c:1398:5: warning: unused variable 'ix' [-Wunused-variable]
  Encode.c:1579:1: warning: duplicate 'extern' declaration specifier [-Wduplicate-decl-specifier]
  DosGlob.c:208:1: warning: duplicate 'extern' declaration specifier [-Wduplicate-decl-specifier]
  Glob.c:706:1: warning: duplicate 'extern' declaration specifier [-Wduplicate-decl-specifier]
  Call.c:464:1: warning: duplicate 'extern' declaration specifier [-Wduplicate-decl-specifier]
  Util.c:720:1: warning: duplicate 'extern' declaration specifier [-Wduplicate-decl-specifier]
  FieldHash.c:718:1: warning: duplicate 'extern' declaration specifier [-Wduplicate-decl-specifier]
  Langinfo.c:313:1: warning: duplicate 'extern' declaration specifier [-Wduplicate-decl-specifier]
  IO.c:991:1: warning: duplicate 'extern' declaration specifier [-Wduplicate-decl-specifier]
  SysV.c:829:1: warning: duplicate 'extern' declaration specifier [-Wduplicate-decl-specifier]
  SysV.xs:82:20: warning: unused variable 's_sysv_unimpl' [-Wunused-variable]
  ListUtil.c:2220:1: warning: duplicate 'extern' declaration specifier [-Wduplicate-decl-specifier]
  CN.c:192:1: warning: duplicate 'extern' declaration specifier [-Wduplicate-decl-specifier]
  Base64.xs:189:2: warning: 'register' storage class specifier is deprecated and incompatible with C++17 [-Wdeprecated-register]
  Base64.xs:285:2: warning: 'register' storage class specifier is deprecated and incompatible with C++17 [-Wdeprecated-register]
  Base64.c:728:1: warning: duplicate 'extern' declaration specifier [-Wduplicate-decl-specifier]
  EBCDIC.c:187:1: warning: duplicate 'extern' declaration specifier [-Wduplicate-decl-specifier]
  Opcode.c:867:1: warning: duplicate 'extern' declaration specifier [-Wduplicate-decl-specifier]
  POSIX.c:5603:1: warning: duplicate 'extern' declaration specifier [-Wduplicate-decl-specifier]
  encoding.c:792:1: warning: duplicate 'extern' declaration specifier [-Wduplicate-decl-specifier]
  mmap.c:449:1: warning: duplicate 'extern' declaration specifier [-Wduplicate-decl-specifier]
  scalar.c:601:1: warning: duplicate 'extern' declaration specifier [-Wduplicate-decl-specifier]
  via.c:843:1: warning: duplicate 'extern' declaration specifier [-Wduplicate-decl-specifier]
  SDBM_File.c:583:1: warning: duplicate 'extern' declaration specifier [-Wduplicate-decl-specifier]
  Socket.c:1848:1: warning: duplicate 'extern' declaration specifier [-Wduplicate-decl-specifier]
  ./const-xs.inc:131:42: warning: AI_IDN_ALLOW_UNASSIGNED is deprecated [-W#pragma-messages]
  /usr/include/netdb.h:609:3: note: expanded from macro 'AI_IDN_ALLOW_UNASSIGNED'
  /usr/include/sys/cdefs.h:503:3: note: expanded from macro '__glibc_macro_warning'
  /usr/include/sys/cdefs.h:501:42: note: expanded from macro '__glibc_macro_warning1'
  :98:6: note: expanded from here
  ./const-xs.inc:134:46: warning: AI_IDN_USE_STD3_ASCII_RULES is deprecated [-W#pragma-messages]
  /usr/include/netdb.h:611:3: note: expanded from macro 'AI_IDN_USE_STD3_ASCII_RULES'
  :101:6: note: expanded from here
  ./const-xs.inc:386:42: warning: NI_IDN_ALLOW_UNASSIGNED is deprecated [-W#pragma-messages]
  /usr/include/netdb.h:650:3: note: expanded from macro 'NI_IDN_ALLOW_UNASSIGNED'
  :104:6: note: expanded from here
  ./const-xs.inc:389:46: warning: NI_IDN_USE_STD3_ASCII_RULES is deprecated [-W#pragma-messages]
  /usr/include/netdb.h:652:3: note: expanded from macro 'NI_IDN_USE_STD3_ASCII_RULES'
  :107:6: note: expanded from here
  JP.c:193:1: warning: duplicate 'extern' declaration specifier [-Wduplicate-decl-specifier]
  Storable.c:8153:1: warning: duplicate 'extern' declaration specifier [-Wduplicate-decl-specifier]
  Hostname.c:243:1: warning: duplicate 'extern' declaration specifier [-Wduplicate-decl-specifier]
  Syslog.c:532:1: warning: duplicate 'extern' declaration specifier [-Wduplicate-decl-specifier]
  NamedCapture.c:350:1: warning: duplicate 'extern' declaration specifier [-Wduplicate-decl-specifier]
  Piece.c:1424:1: warning: duplicate 'extern' declaration specifier [-Wduplicate-decl-specifier]
  KR.c:191:1: warning: duplicate 'extern' declaration specifier [-Wduplicate-decl-specifier]
  Symbol.c:187:1: warning: duplicate 'extern' declaration specifier [-Wduplicate-decl-specifier]
  HiRes.c:2370:1: warning: duplicate 'extern' declaration specifier [-Wduplicate-decl-specifier]
  Collate.c:1048:1: warning: duplicate 'extern' declaration specifier [-Wduplicate-decl-specifier]
  APItest.c:3273:2: warning: 'Perl_ptr_table_clear' is deprecated [-Wdeprecated-declarations]
  ../../embed.h:442:28: note: expanded from macro 'ptr_table_clear'
  ../../proto.h:2675:4: note: 'Perl_ptr_table_clear' has been explicitly marked deprecated here
  ../../perl.h:3501:60: note: expanded from macro '__attribute__deprecated__'
  APItest.c:13140:1: warning: duplicate 'extern' declaration specifier [-Wduplicate-decl-specifier]
  Typemap.c:1919:1: warning: duplicate 'extern' declaration specifier [-Wduplicate-decl-specifier]
  attributes.c:465:1: warning: duplicate 'extern' declaration specifier [-Wduplicate-decl-specifier]
  TW.c:190:1: warning: duplicate 'extern' declaration specifier [-Wduplicate-decl-specifier]
  mro.c:928:1: warning: duplicate 'extern' declaration specifier [-Wduplicate-decl-specifier]
  Unicode.c:704:1: warning: duplicate 'extern' declaration specifier [-Wduplicate-decl-specifier]
  XSUB-undef-XS_VERSION.c:194:1: warning: duplicate 'extern' declaration specifier [-Wduplicate-decl-specifier]
  XSUB-redefined-macros.c:216:1: warning: duplicate 'extern' declaration specifier [-Wduplicate-decl-specifier]
  threads.c:2193:1: warning: duplicate 'extern' declaration specifier [-Wduplicate-decl-specifier]
  shared.c:2147:1: warning: duplicate 'extern' declaration specifier [-Wduplicate-decl-specifier]
  re_comp.c:14606:43: warning: result of comparison of constant 223 with expression of type 'char' is always false [-Wtautological-constant-out-of-range-compare]
  ../../perl.h:3594:58: note: expanded from macro 'UNLIKELY'
  ../../handy.h:111:24: note: expanded from macro 'cBOOL'
  ../../perl.h:3573:62: note: expanded from macro 'EXPECT'
  FastCalc.c:628:1: warning: duplicate 'extern' declaration specifier [-Wduplicate-decl-specifier]
  re.c:304:1: warning: duplicate 'extern' declaration specifier [-Wduplicate-decl-specifier]
  Normalize.c:1289:1: warning: duplicate 'extern' declaration specifier [-Wduplicate-decl-specifier]
  XSTest.c:340:1: warning: duplicate 'extern' declaration specifier [-Wduplicate-decl-specifier]
  /home/perl/smoke/perl/blead_clang++_sanitize=address/build/XSUB.h:134:29: note: expanded from macro 'XS_EXTERNAL'
  XSMore.c:525:1: warning: duplicate 'extern' declaration specifier [-Wduplicate-decl-specifier]
  XSUsage.c:301:1: warning: duplicate 'extern' declaration specifier [-Wduplicate-decl-specifier]
  ExtTest.c:660:1: warning: duplicate 'extern' declaration specifier [-Wduplicate-decl-specifier]
  ../../../../XSUB.h:134:29: note: expanded from macro 'XS_EXTERNAL'
  ExtTest.c:356:1: warning: duplicate 'extern' declaration specifier [-Wduplicate-decl-specifier]
  ExtTest.c:442:1: warning: duplicate 'extern' declaration specifier [-Wduplicate-decl-specifier]
  ExtTest.c:376:1: warning: duplicate 'extern' declaration specifier [-Wduplicate-decl-specifier]
  ExtTest.c:460:1: warning: duplicate 'extern' declaration specifier [-Wduplicate-decl-specifier]
  ExtTest.c:441:1: warning: duplicate 'extern' declaration specifier [-Wduplicate-decl-specifier]
  ExtTest.c:417:1: warning: duplicate 'extern' declaration specifier [-Wduplicate-decl-specifier]

About this smoke:
    smoking-perl: 5.28.2
  smoker-version: 1.72/0.046
       timestamp: 2019-11-07 19:20:03+00
          tester: perl

Enabled stack-use-after-return (Linux/Darwin) and leak-detection (Linux).  Smoke logs available at http://m-l.org/~perl/smoke/perl/linux/blead_clang++_sanitize=address/log8b4eae17ee698efd0058dcf19153c32fdaa2b02e.log.gz
-- 
Report generated by Test::Smoke::Gateway v0.09_01