Show logfile
Automated smoke report for branch blead 5.31.6 patch 9e0c85b92fb133a122394815017a828f27c7e530 v5.31.5-277-g9e0c85b
i3: PPC_POWER5 (PPC/1 cpus)
    on        AIX 5.3.0.0/TL12-05
    using     xlc -q32 version 12.1.0.12 (*1)
    using     xlc -q64 version 12.1.0.12 (*2)
    using     xlc_r -q32 version 12.1.0.12 (*3)
    using     xlc_r -q64 version 12.1.0.12 (*4)
    smoketime 1 day 10 hours 11 minutes (average 2 hours 50 minutes)

Summary: FAIL(F)

O = OK  F = Failure(s), extended report at the bottom
X = Failure(s) under TEST but not under harness
? = still running or test results not (yet) available
Build failures during:       - = unknown or N/A
c = Configure, m = make, M = make (after miniperl), t = make test-prep

v5.31.5-277-g9e0c85b
---------------------- ----------------------------------------------------
F  F  F  F  F  F         (*1)
F  F  F  F  F  F        -Duse64bitint (*1)
-  -  -  -  -  -        -Duse64bitall (*1)
-  -  -  -  -  -        -Duseithreads (*1)
-  -  -  -  -  -        -Duseithreads -Duse64bitint (*1)
-  -  -  -  -  -        -Duseithreads -Duse64bitall (*1)
-  -  -  -  -  -         (*2)
-  -  -  -  -  -        -Duse64bitint (*2)
F  F  F  F  F  F        -Duse64bitall (*2)
-  -  -  -  -  -        -Duseithreads (*2)
-  -  -  -  -  -        -Duseithreads -Duse64bitint (*2)
-  -  -  -  -  -        -Duseithreads -Duse64bitall (*2)
-  -  -  -  -  -         (*3)
-  -  -  -  -  -        -Duse64bitint (*3)
-  -  -  -  -  -        -Duse64bitall (*3)
F  F  F  F  F  F        -Duseithreads (*3)
F  F  F  F  F  F        -Duseithreads -Duse64bitint (*3)
-  -  -  -  -  -        -Duseithreads -Duse64bitall (*3)
-  -  -  -  -  -         (*4)
-  -  -  -  -  -        -Duse64bitint (*4)
-  -  -  -  -  -        -Duse64bitall (*4)
-  -  -  -  -  -        -Duseithreads (*4)
-  -  -  -  -  -        -Duseithreads -Duse64bitint (*4)
F  F  F  F  F  F        -Duseithreads -Duse64bitall (*4)
|  |  |  |  |  |
|  |  |  |  |  +------  locale:EN_US.UTF-8 DEBUGGING
|  |  |  |  +---------  perlio DEBUGGING
|  |  |  +------------  stdio DEBUGGING
|  |  +---------------  locale:EN_US.UTF-8
|  +------------------  perlio
+---------------------  stdio

Applied patches:
  SMOKE9e0c85b92fb133a122394815017a828f27c7e530

Skipped tests:
  None

Test failures:
~~ ../dist/Data-Dumper/t/dumper.t .............................. FAILED 199 201 352 354 358 360 457 459
  [stdio/perlio/locale:EN_US.UTF-8] -Duseithreads -Duse64bitint DEBUGGING
  [stdio/perlio/locale:EN_US.UTF-8] -Duseithreads -Duse64bitint
  [stdio/perlio/locale:EN_US.UTF-8] -Duse64bitint DEBUGGING
  [stdio/perlio/locale:EN_US.UTF-8] -Duse64bitint
~~ ../t/op/read.t .............................................. FAILED 2117-2380 Bad plan.  You planned 2116 tests but ran 2380.
  [locale:EN_US.UTF-8] -Duseithreads -Duse64bitint DEBUGGING
  [locale:EN_US.UTF-8] -Duseithreads -Duse64bitint
  [locale:EN_US.UTF-8] -Duse64bitint DEBUGGING
  [locale:EN_US.UTF-8] -Duse64bitint
~~ ../cpan/ExtUtils-MakeMaker/t/03-xsstatic.t .................. FAILED 5 11 17 23 29 35 Non-zero exit status: 6
  [stdio/perlio/locale:EN_US.UTF-8] -Duseithreads -Duse64bitint DEBUGGING
  [stdio/perlio/locale:EN_US.UTF-8] 
  [stdio/perlio/locale:EN_US.UTF-8] -Duseithreads DEBUGGING
  [stdio/perlio/locale:EN_US.UTF-8] -Duseithreads -Duse64bitall DEBUGGING
  [stdio/perlio/locale:EN_US.UTF-8] -Duse64bitall DEBUGGING
  [stdio/perlio/locale:EN_US.UTF-8]  DEBUGGING
  [stdio/perlio/locale:EN_US.UTF-8] -Duseithreads -Duse64bitint
  [stdio/perlio/locale:EN_US.UTF-8] -Duse64bitint DEBUGGING
  [stdio/perlio/locale:EN_US.UTF-8] -Duse64bitint
  [stdio/perlio/locale:EN_US.UTF-8] -Duseithreads
  [stdio/perlio/locale:EN_US.UTF-8] -Duseithreads -Duse64bitall
  [stdio/perlio/locale:EN_US.UTF-8] -Duse64bitall
~~ ../lib/B/Deparse.t .......................................... FAILED 132-135
  [stdio/perlio/locale:EN_US.UTF-8] -Duseithreads -Duse64bitint DEBUGGING
  [stdio/perlio/locale:EN_US.UTF-8] -Duseithreads -Duse64bitint
  [stdio/perlio/locale:EN_US.UTF-8] -Duse64bitint DEBUGGING
  [stdio/perlio/locale:EN_US.UTF-8] -Duse64bitint
~~ ../t/re/pat_thr.t ........................................... FAILED 964
  [locale:EN_US.UTF-8] -Duseithreads -Duse64bitint DEBUGGING
  [locale:EN_US.UTF-8] -Duseithreads DEBUGGING
  [locale:EN_US.UTF-8] -Duseithreads -Duse64bitall DEBUGGING
  [locale:EN_US.UTF-8] -Duseithreads -Duse64bitall
  [locale:EN_US.UTF-8] -Duseithreads -Duse64bitint
  [locale:EN_US.UTF-8] -Duseithreads
~~ ../ext/XS-APItest/t/utf8.t .................................. FAILED Non-zero exit status: 255 No plan found in TAP output
  [stdio/perlio/locale:EN_US.UTF-8] -Duseithreads -Duse64bitint DEBUGGING
  [stdio/perlio/locale:EN_US.UTF-8] -Duseithreads -Duse64bitint
  [stdio/perlio/locale:EN_US.UTF-8] -Duse64bitint DEBUGGING
  [stdio/perlio/locale:EN_US.UTF-8] -Duse64bitint
~~ ../dist/Data-Dumper/t/quotekeys.t ........................... FAILED 15 17 Non-zero exit status: 2
  [stdio/perlio/locale:EN_US.UTF-8] -Duseithreads -Duse64bitint DEBUGGING
  [stdio/perlio/locale:EN_US.UTF-8] -Duseithreads -Duse64bitint
  [stdio/perlio/locale:EN_US.UTF-8] -Duse64bitint DEBUGGING
  [stdio/perlio/locale:EN_US.UTF-8] -Duse64bitint
~~ ../t/op/read.t .............................................. FAILED 1856 1858-1860 1872 1874-1876 1880 1882-1884 1888 1890-1892 1896 1898-1900 1904 1906-1908 1912 1914-1916 1920 1922-1924 1928 1930-1932 2000 2002-2004 2008 2010-2012 2016 2018-2020 2024 2026-2028 2032 2034-2036 2040 2042-2044 2048 2050-2052 2056 2058-2060 2117-2380 Bad plan.  You planned 2116 tests but ran 2380.
  [stdio/perlio] -Duseithreads -Duse64bitint DEBUGGING
  [stdio/perlio] -Duseithreads -Duse64bitint
  [stdio/perlio] -Duse64bitint DEBUGGING
  [stdio/perlio] -Duse64bitint
~~ ../cpan/Digest-SHA/t/methods.t .............................. FAILED 8
  [stdio/perlio/locale:EN_US.UTF-8] -Duseithreads -Duse64bitint DEBUGGING
  [stdio/perlio/locale:EN_US.UTF-8] -Duseithreads -Duse64bitint
  [stdio/perlio/locale:EN_US.UTF-8] -Duse64bitint DEBUGGING
  [stdio/perlio/locale:EN_US.UTF-8] -Duse64bitint
~~ ../lib/warnings.t ........................................... FAILED 460
  [stdio/perlio/locale:EN_US.UTF-8] -Duseithreads -Duse64bitint DEBUGGING
  [stdio/perlio/locale:EN_US.UTF-8] -Duseithreads -Duse64bitint
  [stdio/perlio/locale:EN_US.UTF-8] -Duse64bitint DEBUGGING
  [stdio/perlio/locale:EN_US.UTF-8] -Duse64bitint
~~ ../t/op/quotemeta.t ......................................... FAILED 2
  [stdio/perlio/locale:EN_US.UTF-8] -Duseithreads -Duse64bitint DEBUGGING
  [stdio/perlio/locale:EN_US.UTF-8] -Duseithreads -Duse64bitint
  [stdio/perlio/locale:EN_US.UTF-8] -Duse64bitint DEBUGGING
  [stdio/perlio/locale:EN_US.UTF-8] -Duse64bitint
~~ ../cpan/Socket/t/Socket.t ................................... FAILED Non-zero exit status: 255 Bad plan.  You planned 6 tests but ran 2.
  [locale:EN_US.UTF-8] -Duseithreads -Duse64bitint DEBUGGING
  [locale:EN_US.UTF-8] 
  [locale:EN_US.UTF-8] -Duseithreads DEBUGGING
  [locale:EN_US.UTF-8] -Duseithreads -Duse64bitall DEBUGGING
  [locale:EN_US.UTF-8] -Duse64bitall DEBUGGING
  [locale:EN_US.UTF-8]  DEBUGGING
  [locale:EN_US.UTF-8] -Duseithreads -Duse64bitint
  [locale:EN_US.UTF-8] -Duse64bitint DEBUGGING
  [locale:EN_US.UTF-8] -Duse64bitint
  [locale:EN_US.UTF-8] -Duseithreads
  [locale:EN_US.UTF-8] -Duseithreads -Duse64bitall
  [locale:EN_US.UTF-8] -Duse64bitall
~~ ../t/re/pat.t ............................................... FAILED 964
  [locale:EN_US.UTF-8] -Duseithreads -Duse64bitint DEBUGGING
  [locale:EN_US.UTF-8] 
  [locale:EN_US.UTF-8] -Duseithreads DEBUGGING
  [locale:EN_US.UTF-8] -Duseithreads -Duse64bitall DEBUGGING
  [locale:EN_US.UTF-8] -Duse64bitall DEBUGGING
  [locale:EN_US.UTF-8]  DEBUGGING
  [locale:EN_US.UTF-8] -Duseithreads -Duse64bitint
  [locale:EN_US.UTF-8] -Duse64bitint DEBUGGING
  [locale:EN_US.UTF-8] -Duse64bitint
  [locale:EN_US.UTF-8] -Duseithreads
  [locale:EN_US.UTF-8] -Duseithreads -Duse64bitall
  [locale:EN_US.UTF-8] -Duse64bitall
~~ ../t/op/tr.t ................................................ FAILED 10-32 50-88 93-96 179 194-195 212 240
  [stdio/perlio/locale:EN_US.UTF-8] -Duseithreads -Duse64bitint DEBUGGING
  [stdio/perlio/locale:EN_US.UTF-8] -Duseithreads -Duse64bitint
  [stdio/perlio/locale:EN_US.UTF-8] -Duse64bitint DEBUGGING
  [stdio/perlio/locale:EN_US.UTF-8] -Duse64bitint
~~ ../cpan/IO-Socket-IP/t/31nonblocking-connect-internet.t ..... FAILED Non-zero exit status: 55 No plan found in TAP output
  [stdio] 
  [perlio]  DEBUGGING
~~ ../ext/XS-APItest/t/subsignature.t .......................... FAILED 2 Non-zero exit status: 1
  [stdio/perlio/locale:EN_US.UTF-8] -Duseithreads -Duse64bitint DEBUGGING
  [stdio/perlio/locale:EN_US.UTF-8] 
  [stdio/perlio/locale:EN_US.UTF-8] -Duseithreads DEBUGGING
  [stdio/perlio/locale:EN_US.UTF-8] -Duseithreads -Duse64bitall DEBUGGING
  [stdio/perlio/locale:EN_US.UTF-8] -Duse64bitall DEBUGGING
  [stdio/perlio/locale:EN_US.UTF-8]  DEBUGGING
  [stdio/perlio/locale:EN_US.UTF-8] -Duseithreads -Duse64bitint
  [stdio/perlio/locale:EN_US.UTF-8] -Duse64bitint DEBUGGING
  [stdio/perlio/locale:EN_US.UTF-8] -Duse64bitint
  [stdio/perlio/locale:EN_US.UTF-8] -Duseithreads
  [stdio/perlio/locale:EN_US.UTF-8] -Duseithreads -Duse64bitall
  [stdio/perlio/locale:EN_US.UTF-8] -Duse64bitall

Test todo-passed:

MANIFEST messages:
  MANIFEST did not declare 'rm.sh'
  MANIFEST did not declare 'rmf.sh'

Compiler messages:

About this smoke:
    smoking-perl: 5.14.2
  smoker-version: 1.72_06/0.046
       timestamp: 2019-11-10 22:22:34+00
          tester: merijn

Status overview available here: https://tux.nl/perl5/smoke/
-- 
Report generated by Test::Smoke::Gateway v0.09_01