Show logfile
Automated smoke report for branch blead 5.31.6 patch 1462134e8b9d0b0b9184117b33a82887ad9711aa v5.31.5-215-g1462134e8b
cjg-netbsd8: Intel 686-class (amd64/1 cpus)
    on        netbsd 8.1
    using     gcc version 5.5.0 (*1)
    smoketime 5 hours 11 minutes (average 38 minutes 56 seconds)

Summary: PASS

O = OK  F = Failure(s), extended report at the bottom
X = Failure(s) under TEST but not under harness
? = still running or test results not (yet) available
Build failures during:       - = unknown or N/A
c = Configure, m = make, M = make (after miniperl), t = make test-prep

v5.31.5-215-g1462134e8b
---------------------- ----------------------------------------------------
O  O                    -Dcc=gcc (*1)
O  O                    -Dcc=gcc -Duse64bitall (*1)
O  O                    -Dcc=gcc -Duseithreads (*1)
O  O                    -Dcc=gcc -Duseithreads -Duse64bitall (*1)
|  |
|  +------------------  stdio DEBUGGING
+---------------------  stdio

Applied patches:
  SMOKE1462134e8b9d0b0b9184117b33a82887ad9711aa

Skipped tests:
      # One test name on a line

Test failures:

Test todo-passed:

MANIFEST messages:

Compiler messages:
  regcomp.c: In function 'S_regatom':
  regcomp.c:14606:43: warning: comparison is always false due to limited range of data type [-Wtype-limits]
  perl.h:3573:62: note: in definition of macro 'EXPECT'
  perl.h:3594:52: note: in expansion of macro 'cBOOL'
  regcomp.c:14606:29: note: in expansion of macro 'UNLIKELY'
  /usr/include/sys/cdefs_elf.h:67:20: error: missing binary operator before token "("
  /usr/include/sys/cdefs_elf.h:73:20: error: missing binary operator before token "("
  /usr/include/sys/cdefs_elf.h:79:20: error: missing binary operator before token "("
  bzlib.c: In function 'default_bzalloc':
  bzlib.c:102:31: warning: unused parameter 'opaque' [-Wunused-parameter]
  bzlib.c: In function 'default_bzfree':
  bzlib.c:109:29: warning: unused parameter 'opaque' [-Wunused-parameter]
  compress.c: In function 'sendMTFValues':
  compress.c:243:19: warning: variable 'nBytes' set but not used [-Wunused-but-set-variable]
  Encode.c: In function 'XS_Encode_decode':
  ../../XSUB.h:185:20: warning: unused variable 'ix' [-Wunused-variable]
  Encode.c:1356:5: note: in expansion of macro 'dXSI32'
  Encode.c: In function 'XS_Encode_encode':
  Encode.c:1398:5: note: in expansion of macro 'dXSI32'
  Socket.c: In function 'XS_Socket_pack_ip_mreq_source':
  Socket.c:1673:7: warning: variable 'interface' set but not used [-Wunused-but-set-variable]
  const-c.inc: In function 'constant_19':
  const-c.inc:351:42: warning: unused parameter 'iv_return' [-Wunused-parameter]
  re_exec.c: In function 'S_regtry':
  re_exec.c:6497:30: warning: 'fold_array' may be used uninitialized in this function [-Wmaybe-uninitialized]
  re_exec.c:6401:17: note: 'fold_array' was declared here
  re_exec.c:6503:22: warning: 'folder' may be used uninitialized in this function [-Wmaybe-uninitialized]
  re_exec.c:6400:16: note: 'folder' was declared here
  re_comp.c: In function 'S_regatom':
  re_comp.c:14606:43: warning: comparison is always false due to limited range of data type [-Wtype-limits]
  ../../perl.h:3573:62: note: in definition of macro 'EXPECT'
  ../../perl.h:3594:52: note: in expansion of macro 'cBOOL'
  re_comp.c:14606:29: note: in expansion of macro 'UNLIKELY'
  op.c: In function 'S_pmtrans':
  op.c:7046:22: warning: 'r_map' may be used uninitialized in this function [-Wmaybe-uninitialized]
  regexec.c: In function 'S_regtry':
  regexec.c:6497:30: warning: 'fold_array' may be used uninitialized in this function [-Wmaybe-uninitialized]
  regexec.c:6401:17: note: 'fold_array' was declared here
  regexec.c:6503:22: warning: 'folder' may be used uninitialized in this function [-Wmaybe-uninitialized]
  regexec.c:6400:16: note: 'folder' was declared here

About this smoke:
    smoking-perl: 5.26.1
  smoker-version: 1.71/0.046
       timestamp: 2019-11-08 10:44:29+00
          tester: core

-- 
Report generated by Test::Smoke::Gateway v0.09_01