Show logfile
Automated smoke report for branch smoke-me/sawyerx/findbin-duallife 5.31.6 patch c17ef2234f77508f5ca8e9c333f1a34dfca22a8f v5.31.5-180-gc17ef2234f
cjg-netbsd7: Intel 686-class (amd64/1 cpus)
    on        netbsd 7.2
    using     gcc version 4.8.5 (*1)
    smoketime 4 hours 41 minutes (average 35 minutes 10 seconds)

Summary: FAIL(F)

O = OK  F = Failure(s), extended report at the bottom
X = Failure(s) under TEST but not under harness
? = still running or test results not (yet) available
Build failures during:       - = unknown or N/A
c = Configure, m = make, M = make (after miniperl), t = make test-prep

v5.31.5-180-gc17ef2234f
---------------------- ----------------------------------------------------
F  F                    -Dcc=gcc (*1)
F  F                    -Dcc=gcc -Duse64bitall (*1)
F  F                    -Dcc=gcc -Duseithreads (*1)
F  F                    -Dcc=gcc -Duseithreads -Duse64bitall (*1)
|  |
|  +------------------  stdio DEBUGGING
+---------------------  stdio

Applied patches:
  SMOKEc17ef2234f77508f5ca8e9c333f1a34dfca22a8f

Skipped tests:
      # One test name on a line

Test failures:
~~ ../dist/FindBin/t/FindBin.t ................................. FAILED Non-zero exit status: 2 No plan found in TAP output
  [stdio] -Dcc=gcc
  [stdio] -Dcc=gcc -Duse64bitall
  [stdio] -Dcc=gcc -Duseithreads -Duse64bitall DEBUGGING
  [stdio] -Dcc=gcc -Duseithreads DEBUGGING
  [stdio] -Dcc=gcc -Duseithreads
  [stdio] -Dcc=gcc DEBUGGING
  [stdio] -Dcc=gcc -Duse64bitall DEBUGGING
  [stdio] -Dcc=gcc -Duseithreads -Duse64bitall

Test todo-passed:

MANIFEST messages:

Compiler messages:
  regcomp.c: In function 'S_regatom':
  regcomp.c:14744:25: warning: comparison is always false due to limited range of data type [-Wtype-limits]
  /usr/include/sys/cdefs_elf.h:67:20: error: missing binary operator before token "("
  /usr/include/sys/cdefs_elf.h:73:20: error: missing binary operator before token "("
  /usr/include/sys/cdefs_elf.h:79:20: error: missing binary operator before token "("
  Encode.c: In function 'XS_Encode_decode':
  ../../XSUB.h:185:20: warning: unused variable 'ix' [-Wunused-variable]
  Encode.c:1356:5: note: in expansion of macro 'dXSI32'
  Encode.c: In function 'XS_Encode_encode':
  Encode.c:1398:5: note: in expansion of macro 'dXSI32'
  Socket.c: In function 'XS_Socket_pack_ip_mreq_source':
  Socket.c:1673:7: warning: variable 'interface' set but not used [-Wunused-but-set-variable]
  const-c.inc: In function 'constant_19':
  const-c.inc:351:42: warning: unused parameter 'iv_return' [-Wunused-parameter]
  Piece.xs: In function '_strptime':
  Piece.xs:719:8: warning: 'len' may be used uninitialized in this function [-Wmaybe-uninitialized]
  re_exec.c: In function 'S_regtry':
  re_exec.c:6497:30: warning: 'fold_array' may be used uninitialized in this function [-Wmaybe-uninitialized]
  re_exec.c:6401:17: note: 'fold_array' was declared here
  re_exec.c:6503:28: warning: 'folder' may be used uninitialized in this function [-Wmaybe-uninitialized]
  re_exec.c:6400:16: note: 'folder' was declared here
  re_comp.c: In function 'S_regatom':
  re_comp.c:14744:25: warning: comparison is always false due to limited range of data type [-Wtype-limits]
  regexec.c: In function 'S_regtry':
  regexec.c:6497:30: warning: 'fold_array' may be used uninitialized in this function [-Wmaybe-uninitialized]
  regexec.c:6401:17: note: 'fold_array' was declared here
  regexec.c:6503:28: warning: 'folder' may be used uninitialized in this function [-Wmaybe-uninitialized]
  regexec.c:6400:16: note: 'folder' was declared here

About this smoke:
    smoking-perl: 5.26.1
  smoker-version: 1.71/0.046
       timestamp: 2019-11-08 09:35:16+00
          tester: core

-- 
Report generated by Test::Smoke::Gateway v0.09_01