Show logfile
Automated smoke report for branch blead 5.31.6 patch 1462134e8b9d0b0b9184117b33a82887ad9711aa v5.31.5-215-g1462134e8b
vier.local: Intel(R) Core(TM) i7-3820 CPU @ 3.60GHz (GenuineIntel 3702MHz) (x86_64/1[8 cores] cpus)
    on        linux 5.2.7-200.fc30.x86_64 [Fedora 30]
    using     clang version 4.2.1 Compatible Clang 8.0.0 (Fedora 8.0.0-3.fc30) (*1)
    smoketime 3 hours 22 minutes (average 50 minutes 44 seconds)

Summary: FAIL(F)

O = OK  F = Failure(s), extended report at the bottom
X = Failure(s) under TEST but not under harness
? = still running or test results not (yet) available
Build failures during:       - = unknown or N/A
c = Configure, m = make, M = make (after miniperl), t = make test-prep

v5.31.5-215-g1462134e8b
---------------------- ----------------------------------------------------
F  F                    -Dcc=clang -Accflags="-Werror=declaration-after-statement -g -fno-omit-frame-pointer -fsanitize=address  -fno-common -fsanitize-blacklist=`pwd`/asan_ignore" -Aldflags="-fsanitize=address" (*1)
F  F                    -Dcc=clang -Accflags="-Werror=declaration-after-statement -g -fno-omit-frame-pointer -fsanitize=address  -fno-common -fsanitize-blacklist=`pwd`/asan_ignore" -Aldflags="-fsanitize=address" -Duseithreads (*1)
|  |
|  +------------------  stdio DEBUGGING
+---------------------  stdio

Applied patches:
  SMOKE1462134e8b9d0b0b9184117b33a82887ad9711aa

Skipped tests:
  None

Test failures:
~~ ../t/uni/tr_utf8.t .......................................... FAILED Non-zero exit status: 1
  [stdio] -Dcc=clang -Accflags="-Werror=declaration-after-statement -g -fno-omit-frame-pointer -fsanitize=address  -fno-common -fsanitize-blacklist=`pwd`/asan_ignore" -Aldflags="-fsanitize=address" -Duseithreads DEBUGGING
  [stdio] -Dcc=clang -Accflags="-Werror=declaration-after-statement -g -fno-omit-frame-pointer -fsanitize=address  -fno-common -fsanitize-blacklist=`pwd`/asan_ignore" -Aldflags="-fsanitize=address" -Duseithreads
  [stdio] -Dcc=clang -Accflags="-Werror=declaration-after-statement -g -fno-omit-frame-pointer -fsanitize=address  -fno-common -fsanitize-blacklist=`pwd`/asan_ignore" -Aldflags="-fsanitize=address" DEBUGGING
  [stdio] -Dcc=clang -Accflags="-Werror=declaration-after-statement -g -fno-omit-frame-pointer -fsanitize=address  -fno-common -fsanitize-blacklist=`pwd`/asan_ignore" -Aldflags="-fsanitize=address"
~~ ../t/op/tr.t ................................................ FAILED Non-zero exit status: 1
  [stdio] -Dcc=clang -Accflags="-Werror=declaration-after-statement -g -fno-omit-frame-pointer -fsanitize=address  -fno-common -fsanitize-blacklist=`pwd`/asan_ignore" -Aldflags="-fsanitize=address" -Duseithreads DEBUGGING
  [stdio] -Dcc=clang -Accflags="-Werror=declaration-after-statement -g -fno-omit-frame-pointer -fsanitize=address  -fno-common -fsanitize-blacklist=`pwd`/asan_ignore" -Aldflags="-fsanitize=address" -Duseithreads
  [stdio] -Dcc=clang -Accflags="-Werror=declaration-after-statement -g -fno-omit-frame-pointer -fsanitize=address  -fno-common -fsanitize-blacklist=`pwd`/asan_ignore" -Aldflags="-fsanitize=address" DEBUGGING
  [stdio] -Dcc=clang -Accflags="-Werror=declaration-after-statement -g -fno-omit-frame-pointer -fsanitize=address  -fno-common -fsanitize-blacklist=`pwd`/asan_ignore" -Aldflags="-fsanitize=address"
~~ ../lib/warnings.t ........................................... FAILED 527
  [stdio] -Dcc=clang -Accflags="-Werror=declaration-after-statement -g -fno-omit-frame-pointer -fsanitize=address  -fno-common -fsanitize-blacklist=`pwd`/asan_ignore" -Aldflags="-fsanitize=address" -Duseithreads DEBUGGING
  [stdio] -Dcc=clang -Accflags="-Werror=declaration-after-statement -g -fno-omit-frame-pointer -fsanitize=address  -fno-common -fsanitize-blacklist=`pwd`/asan_ignore" -Aldflags="-fsanitize=address" -Duseithreads
  [stdio] -Dcc=clang -Accflags="-Werror=declaration-after-statement -g -fno-omit-frame-pointer -fsanitize=address  -fno-common -fsanitize-blacklist=`pwd`/asan_ignore" -Aldflags="-fsanitize=address" DEBUGGING
  [stdio] -Dcc=clang -Accflags="-Werror=declaration-after-statement -g -fno-omit-frame-pointer -fsanitize=address  -fno-common -fsanitize-blacklist=`pwd`/asan_ignore" -Aldflags="-fsanitize=address"

Test todo-passed:

MANIFEST messages:

Compiler messages:
  regcomp.c:14606:43: warning: result of comparison of constant 223 with expression of type 'char' is always false [-Wtautological-constant-out-of-range-compare]
  ./perl.h:3594:58: note: expanded from macro 'UNLIKELY'
  ./handy.h:111:24: note: expanded from macro 'cBOOL'
  ./perl.h:3573:62: note: expanded from macro 'EXPECT'
  sv.c:12530:41: warning: adding 'int' to a string does not append to the string [-Wstring-plus-int]
  ./handy.h:538:37: note: expanded from macro 'strnEQ'
  sv.c:12530:41: note: use array indexing to silence this warning
  bzlib.c:102:31: warning: unused parameter 'opaque' [-Wunused-parameter]
  bzlib.c:109:29: warning: unused parameter 'opaque' [-Wunused-parameter]
  Encode.c:1356:5: warning: unused variable 'ix' [-Wunused-variable]
  ../../XSUB.h:185:20: note: expanded from macro 'dXSI32'
  Encode.c:1398:5: warning: unused variable 'ix' [-Wunused-variable]
  ./const-xs.inc:131:42: warning: AI_IDN_ALLOW_UNASSIGNED is deprecated [-W#pragma-messages]
  /usr/include/netdb.h:609:3: note: expanded from macro 'AI_IDN_ALLOW_UNASSIGNED'
  /usr/include/sys/cdefs.h:503:3: note: expanded from macro '__glibc_macro_warning'
  /usr/include/sys/cdefs.h:501:42: note: expanded from macro '__glibc_macro_warning1'
  :130:6: note: expanded from here
  ./const-xs.inc:134:46: warning: AI_IDN_USE_STD3_ASCII_RULES is deprecated [-W#pragma-messages]
  /usr/include/netdb.h:611:3: note: expanded from macro 'AI_IDN_USE_STD3_ASCII_RULES'
  :133:6: note: expanded from here
  ./const-xs.inc:386:42: warning: NI_IDN_ALLOW_UNASSIGNED is deprecated [-W#pragma-messages]
  /usr/include/netdb.h:650:3: note: expanded from macro 'NI_IDN_ALLOW_UNASSIGNED'
  :136:6: note: expanded from here
  ./const-xs.inc:389:46: warning: NI_IDN_USE_STD3_ASCII_RULES is deprecated [-W#pragma-messages]
  /usr/include/netdb.h:652:3: note: expanded from macro 'NI_IDN_USE_STD3_ASCII_RULES'
  :139:6: note: expanded from here
  re_comp.c:14606:43: warning: result of comparison of constant 223 with expression of type 'char' is always false [-Wtautological-constant-out-of-range-compare]
  ../../perl.h:3594:58: note: expanded from macro 'UNLIKELY'
  ../../handy.h:111:24: note: expanded from macro 'cBOOL'
  ../../perl.h:3573:62: note: expanded from macro 'EXPECT'

About this smoke:
    smoking-perl: 5.28.2
  smoker-version: 1.72/0.046
       timestamp: 2019-11-08 04:15:14+00
          tester: perl

Enabled stack-use-after-return (Linux/Darwin) and leak-detection (Linux).  Smoke logs available at http://m-l.org/~perl/smoke/perl/linux/blead_clang_quick_sanitize=address/log1462134e8b9d0b0b9184117b33a82887ad9711aa.log.gz
-- 
Report generated by Test::Smoke::Gateway v0.09_01