Automated smoke report for branch blead 5.31.6 patch 16536ca15a88b421f73a11f49289c74192a13962 v5.31.5-127-g16536ca15a
MacPro4,1-dhoekman: Mac Pro (2.8 GHz) (Quad-Core Intel Xeon/2[8 cores] cpus)
    on        darwin 15.6.0 (Mac OS X - OS X 10.11.6 (15G22010))
    using     cc version 4.2.1 Compatible Apple LLVM 8.0.0 (clang-800.0.42.1) (*1)
    smoketime 14 hours 45 minutes (average 1 hour 13 minutes)

Summary: FAIL(F)

O = OK  F = Failure(s), extended report at the bottom
X = Failure(s) under TEST but not under harness
? = still running or test results not (yet) available
Build failures during:       - = unknown or N/A
c = Configure, m = make, M = make (after miniperl), t = make test-prep

v5.31.5-127-g16536ca15a
---------------------- ----------------------------------------------------
F  F  F  F               (*1)
F  F  F  F              -Duse64bitint (*1)
F  F  F  F              -Duselongdouble (*1)
F  F  F  F              -Duseithreads (*1)
F  F  F  F              -Duseithreads -Duse64bitint (*1)
F  F  F  F              -Duseithreads -Duselongdouble (*1)
|  |  |  |
|  |  |  +------------  perlio DEBUGGING
|  |  +---------------  stdio DEBUGGING
|  +------------------  perlio
+---------------------  stdio

Applied patches:
  SMOKE16536ca15a88b421f73a11f49289c74192a13962

Skipped tests:
      # 2018-04-15 using this brings up other errors...
      # One test name on a line
      #t/porting/pending-author.t

Test failures:
~~ ../cpan/IO-Compress/t/105oneshot-zip-only.t ................. FAILED 13 Non-zero exit status: 5
  [stdio] 
~~ ../cpan/IO-Compress/t/105oneshot-zip-only.t ................. FAILED 13 Non-zero exit status: 4
  [perlio] 
~~ ../t/porting/pending-author.t ............................... FAILED 1
  [stdio/perlio] -Duseithreads -Duse64bitint DEBUGGING
  [perlio] 
  [stdio/perlio] -Duseithreads DEBUGGING
  [stdio/perlio] -Duseithreads -Duselongdouble DEBUGGING
  [stdio/perlio] -Duselongdouble DEBUGGING
  [perlio/stdio]  DEBUGGING
  [stdio/perlio] -Duseithreads -Duse64bitint
  [stdio/perlio] -Duse64bitint DEBUGGING
  [stdio/perlio] -Duse64bitint
  [stdio/perlio] -Duseithreads
  [stdio/perlio] -Duseithreads -Duselongdouble
  [stdio/perlio] -Duselongdouble

Test todo-passed:

MANIFEST messages:

Compiler messages:
  regcomp.c:14742:43: warning: comparison of constant 223 with expression of type 'char' is always false [-Wtautological-constant-out-of-range-compare]
  ./perl.h:3594:58: note: expanded from macro 'UNLIKELY'
  ./handy.h:111:24: note: expanded from macro 'cBOOL'
  ./perl.h:3573:62: note: expanded from macro 'EXPECT'
  Encode.c:1356:5: warning: unused variable 'ix' [-Wunused-variable]
  ../../XSUB.h:185:20: note: expanded from macro 'dXSI32'
  Encode.c:1398:5: warning: unused variable 'ix' [-Wunused-variable]
  ./const-c.inc:351:42: warning: unused parameter 'iv_return' [-Wunused-parameter]
  re_comp.c:14742:43: warning: comparison of constant 223 with expression of type 'char' is always false [-Wtautological-constant-out-of-range-compare]
  ../../perl.h:3594:58: note: expanded from macro 'UNLIKELY'
  ../../handy.h:111:24: note: expanded from macro 'cBOOL'
  ../../perl.h:3573:62: note: expanded from macro 'EXPECT'

About this smoke:
    smoking-perl: 5.30.0
  smoker-version: 1.72/0.046
       timestamp: 2019-11-03 08:01:18+00
          tester: dhoekman

David H. / moc.noyclah@namkeohd
-- 
Report generated by Test::Smoke::Gateway v0.09_01