Show logfile
Automated smoke report for branch smoke-me/khw-ppport 5.31.6 patch fe562149e302b936aab507154dfc257e49d8d669 v5.31.5-126-gfe562149e3
Dell-Latitude-E6530: Intel(R) Core(TM) i7-3740QM CPU @ 2.70GHz(~2691 MHz) (Intel64/8 cpus)
    on        MSWin32 Win10 Business
    using     cl version 19.23.28106.4 (*1)
    smoketime 2 hours 42 minutes (average 20 minutes 19 seconds)

Summary: FAIL(FM)

O = OK  F = Failure(s), extended report at the bottom
X = Failure(s) under TEST but not under harness
? = still running or test results not (yet) available
Build failures during:       - = unknown or N/A
c = Configure, m = make, M = make (after miniperl), t = make test-prep

v5.31.5-126-gfe562149e3
---------------------- ----------------------------------------------------
-  F  M  -               (*1)
-  F  M  -              -Duselargefiles (*1)
-  F  M  -              -Duseithreads (*1)
-  F  M  -              -Duseithreads -Duselargefiles (*1)
|  |  |  |
|  |  |  +------------  stdio DEBUGGING
|  |  +---------------  minitest DEBUGGING
|  +------------------  stdio
+---------------------  minitest

Applied patches:
  SMOKEfe562149e302b936aab507154dfc257e49d8d669

Skipped tests:
  None

Test failures:
~~ ../cpan/CPAN-Meta-YAML/t/31_local_tml.t ..................... FAILED Non-zero exit status: 2 No plan found in TAP output
  [stdio] 
  [stdio] -Duseithreads -Duselargefiles
  [stdio] -Duselargefiles
  [stdio] -Duseithreads
~~ ../cpan/CPAN-Meta-YAML/t/30_yaml_spec_tml.t ................. FAILED Non-zero exit status: 2 No plan found in TAP output
  [stdio] 
  [stdio] -Duseithreads -Duselargefiles
  [stdio] -Duselargefiles
  [stdio] -Duseithreads
~~ ../cpan/CPAN-Meta-YAML/t/32_world_tml.t ..................... FAILED Non-zero exit status: 2 No plan found in TAP output
  [stdio] 
  [stdio] -Duseithreads -Duselargefiles
  [stdio] -Duselargefiles
  [stdio] -Duseithreads
~~ ../t/porting/customized.t ................................... FAILED 1-29
  [stdio] 
  [stdio] -Duseithreads -Duselargefiles
  [stdio] -Duselargefiles
  [stdio] -Duseithreads
~~ ../cpan/Pod-Simple/t/JustPod_corpus.t ....................... FAILED 3-7 Non-zero exit status: 15
  [stdio] 
  [stdio] -Duseithreads -Duselargefiles
  [stdio] -Duselargefiles
  [stdio] -Duseithreads
~~ ../t/porting/pod_rules.t .................................... FAILED 2-6 Bad plan.  You planned 8 tests but ran 6.
  [stdio] 
  [stdio] -Duseithreads -Duselargefiles
  [stdio] -Duselargefiles
  [stdio] -Duseithreads
~~ ../t/porting/regen.t ........................................ FAILED 12 Non-zero exit status: 255 Bad plan.  You planned 45 tests but ran 12.
  [stdio] 
  [stdio] -Duseithreads -Duselargefiles
  [stdio] -Duselargefiles
  [stdio] -Duseithreads
~~ ../cpan/IO-Compress/t/105oneshot-zip-only.t ................. FAILED 219 Non-zero exit status: 1
  [stdio] 
  [stdio] -Duseithreads -Duselargefiles
  [stdio] -Duselargefiles
  [stdio] -Duseithreads
~~ ../cpan/ExtUtils-MakeMaker/t/02-xsdynamic.t ................. FAILED 17 Non-zero exit status: 4
  [stdio] 
  [stdio] -Duselargefiles
~~ ../dist/Net-Ping/t/450_service.t ............................ FAILED 9 Non-zero exit status: 1
  [stdio] 
  [stdio] -Duseithreads -Duselargefiles
  [stdio] -Duselargefiles
  [stdio] -Duseithreads
~~ ../cpan/podlators/t/text/encoding.t ......................... FAILED Non-zero exit status: 255 Bad plan.  You planned 7 tests but ran 1.
  [stdio] 
  [stdio] -Duseithreads -Duselargefiles
  [stdio] -Duselargefiles
  [stdio] -Duseithreads

Test todo-passed:
~~ ../ext/IPC-Open3/t/IPC-Open3.t .............................. PASSED 25
  [stdio] 
  [stdio] -Duseithreads -Duselargefiles
  [stdio] -Duselargefiles
  [stdio] -Duseithreads

MANIFEST messages:

Compiler messages:
  [2019-11-03 15:43:52Z] perlio.obj : warning LNK4197: export 'PerlIO_pending' specified multiple times; using first specification
  [2019-11-03 15:43:52Z] perlio.obj : warning LNK4197: export 'PerlIO_perlio' specified multiple times; using first specification
  [2019-11-03 15:43:52Z] LINK : warning LNK4281: undesirable base address 0x28000000 for x64 image; set base address above 4GB for best ASLR optimization
  # Test.obj : error LNK2001: unresolved external symbol PL_curpad
  # Test.obj : error LNK2001: unresolved external symbol PL_op
  # Test.obj : error LNK2001: unresolved external symbol PL_stack_base
  # Test.obj : error LNK2001: unresolved external symbol PL_tainted
  # Test.obj : error LNK2001: unresolved external symbol PL_markstack_ptr
  # Test.obj : error LNK2001: unresolved external symbol PL_stack_sp
  # blib\arch\auto\XS\Test\Test.dll : fatal error LNK1120: 6 unresolved externals
  # NMAKE : fatal error U1077: '"C:\Program Files (x86)\Microsoft Visual Studio\2019\Community\VC\Tools\MSVC\14.23.28105\bin\HostX64\x64\link.EXE"' : return code '0x460'
  # Other.obj : error LNK2001: unresolved external symbol PL_curpad
  # Other.obj : error LNK2001: unresolved external symbol PL_op
  # Other.obj : error LNK2001: unresolved external symbol PL_stack_base
  # Other.obj : error LNK2001: unresolved external symbol PL_tainted
  # Other.obj : error LNK2001: unresolved external symbol PL_markstack_ptr
  # Other.obj : error LNK2001: unresolved external symbol PL_stack_sp
  # blib\arch\auto\XS\Other\Other.dll : fatal error LNK1120: 6 unresolved externals
  [2019-11-03 16:21:18Z] perlio.obj : warning LNK4197: export 'PerlIO_pending' specified multiple times; using first specification
  [2019-11-03 16:21:18Z] perlio.obj : warning LNK4197: export 'PerlIO_perlio' specified multiple times; using first specification
  [2019-11-03 16:21:18Z] LINK : warning LNK4281: undesirable base address 0x28000000 for x64 image; set base address above 4GB for best ASLR optimization
  [2019-11-03 17:00:33Z] perlio.obj : warning LNK4197: export 'PerlIO_pending' specified multiple times; using first specification
  [2019-11-03 17:00:33Z] perlio.obj : warning LNK4197: export 'PerlIO_perlio' specified multiple times; using first specification
  [2019-11-03 17:00:33Z] LINK : warning LNK4281: undesirable base address 0x28000000 for x64 image; set base address above 4GB for best ASLR optimization
  [2019-11-03 17:41:40Z] perlio.obj : warning LNK4197: export 'PerlIO_pending' specified multiple times; using first specification
  [2019-11-03 17:41:40Z] perlio.obj : warning LNK4197: export 'PerlIO_perlio' specified multiple times; using first specification
  [2019-11-03 17:41:40Z] LINK : warning LNK4281: undesirable base address 0x28000000 for x64 image; set base address above 4GB for best ASLR optimization

About this smoke:
    smoking-perl: 5.28.1
  smoker-version: 1.72/0.046
       timestamp: 2019-11-03 15:38:28+00
          tester: greer

Smoke logs available at http://m-l.org/~perl/smoke/perl/mswin32-win10/mswin32-win10-smoke-me/Karl%20Williamson/logfe562149e302b936aab507154dfc257e49d8d669.log.gz
-- 
Report generated by Test::Smoke::Gateway v0.09_01