Show logfile
Automated smoke report for branch smoke-me/khw-tr 5.31.6 patch b6a2e3648f6f5f82fde30021a3f79439dee40d64 v5.31.5-123-gb6a2e3648f
Dell-Latitude-E6530: Intel(R) Core(TM) i7-3740QM CPU @ 2.70GHz(~2691 MHz) (Intel64/8 cpus)
    on        MSWin32 Win10 Business
    using     cl version 19.23.28106.4 (*1)
    smoketime 2 hours 31 minutes (average 18 minutes 56 seconds)

Summary: FAIL(FM)

O = OK  F = Failure(s), extended report at the bottom
X = Failure(s) under TEST but not under harness
? = still running or test results not (yet) available
Build failures during:       - = unknown or N/A
c = Configure, m = make, M = make (after miniperl), t = make test-prep

v5.31.5-123-gb6a2e3648f
---------------------- ----------------------------------------------------
-  F  M  -               (*1)
-  F  M  -              -Duselargefiles (*1)
-  F  M  -              -Duseithreads (*1)
-  F  M  -              -Duseithreads -Duselargefiles (*1)
|  |  |  |
|  |  |  +------------  stdio DEBUGGING
|  |  +---------------  minitest DEBUGGING
|  +------------------  stdio
+---------------------  minitest

Applied patches:
  SMOKEb6a2e3648f6f5f82fde30021a3f79439dee40d64

Skipped tests:
  None

Test failures:
~~ ../dist/Data-Dumper/t/toaster.t ............................. FAILED Non-zero exit status: 2 No plan found in TAP output
  [stdio] 
  [stdio] -Duseithreads -Duselargefiles
  [stdio] -Duselargefiles
  [stdio] -Duseithreads
~~ ../cpan/Test-Simple/t/Test2/modules/Event/Subtest.t ......... FAILED Non-zero exit status: 2 No plan found in TAP output
  [stdio] 
  [stdio] -Duseithreads -Duselargefiles
  [stdio] -Duselargefiles
  [stdio] -Duseithreads
~~ ../dist/Data-Dumper/t/pair.t ................................ FAILED 1 Non-zero exit status: 255 Bad plan.  You planned 9 tests but ran 1.
  [stdio] 
  [stdio] -Duseithreads -Duselargefiles
  [stdio] -Duselargefiles
  [stdio] -Duseithreads
~~ ../lib/Benchmark.t .......................................... FAILED Non-zero exit status: 2 Bad plan.  You planned 213 tests but ran 0.
  [stdio] 
  [stdio] -Duseithreads -Duselargefiles
  [stdio] -Duselargefiles
  [stdio] -Duseithreads
~~ ../dist/Data-Dumper/t/perl-74170.t .......................... FAILED Non-zero exit status: 2 Bad plan.  You planned 1 tests but ran 0.
  [stdio] 
  [stdio] -Duseithreads -Duselargefiles
  [stdio] -Duselargefiles
  [stdio] -Duseithreads
~~ ../cpan/Test-Simple/t/Test2/modules/Util/ExternalMeta.t ..... FAILED Non-zero exit status: 2 No plan found in TAP output
  [stdio] 
  [stdio] -Duseithreads -Duselargefiles
  [stdio] -Duselargefiles
  [stdio] -Duseithreads
~~ ../cpan/Test-Simple/t/Test2/modules/EventFacet/Amnesty.t .... FAILED Non-zero exit status: 2 No plan found in TAP output
  [stdio] 
  [stdio] -Duseithreads -Duselargefiles
  [stdio] -Duselargefiles
  [stdio] -Duseithreads
~~ ../cpan/ExtUtils-MakeMaker/t/prereq_print.t ................. FAILED 1-2 Bad plan.  You planned 0 tests but ran 2.
  [stdio] 
  [stdio] -Duseithreads -Duselargefiles
  [stdio] -Duselargefiles
  [stdio] -Duseithreads
~~ ../cpan/Archive-Tar/t/02_methods.t .......................... FAILED Non-zero exit status: 2 No plan found in TAP output
  [stdio] 
  [stdio] -Duseithreads -Duselargefiles
  [stdio] -Duselargefiles
  [stdio] -Duseithreads
~~ ../dist/Filter-Simple/t/code_no_comments.t .................. FAILED Non-zero exit status: 255 No plan found in TAP output
  [stdio] 
  [stdio] -Duseithreads -Duselargefiles
  [stdio] -Duselargefiles
  [stdio] -Duseithreads
~~ ../cpan/Test-Simple/t/Test2/modules/Event/Ok.t .............. FAILED 1-3 Non-zero exit status: 3
  [stdio] 
  [stdio] -Duseithreads -Duselargefiles
  [stdio] -Duselargefiles
  [stdio] -Duseithreads
~~ ../cpan/Text-Balanced/t/03_extcbk.t ......................... FAILED Non-zero exit status: 255 Bad plan.  You planned 41 tests but ran 0.
  [stdio] 
  [stdio] -Duseithreads -Duselargefiles
  [stdio] -Duselargefiles
  [stdio] -Duseithreads
~~ ../cpan/Test-Simple/t/Legacy/run_test.t ..................... FAILED Non-zero exit status: 2 No plan found in TAP output
  [stdio] 
  [stdio] -Duseithreads -Duselargefiles
  [stdio] -Duselargefiles
  [stdio] -Duseithreads
~~ ../cpan/Test-Simple/t/Test2/modules/Event/Pass.t ............ FAILED Non-zero exit status: 2 No plan found in TAP output
  [stdio] 
  [stdio] -Duseithreads -Duselargefiles
  [stdio] -Duselargefiles
  [stdio] -Duseithreads
~~ ../cpan/Test-Simple/t/Test2/behavior/Subtest_callback.t ..... FAILED Non-zero exit status: 2 No plan found in TAP output
  [stdio] 
  [stdio] -Duseithreads -Duselargefiles
  [stdio] -Duselargefiles
  [stdio] -Duseithreads
~~ ../dist/Data-Dumper/t/overload.t ............................ FAILED Non-zero exit status: 2 No plan found in TAP output
  [stdio] 
  [stdio] -Duseithreads -Duselargefiles
  [stdio] -Duselargefiles
  [stdio] -Duseithreads
~~ ../t/porting/pod_rules.t .................................... FAILED 2-6 Bad plan.  You planned 8 tests but ran 6.
  [stdio] 
  [stdio] -Duseithreads -Duselargefiles
  [stdio] -Duselargefiles
  [stdio] -Duseithreads
~~ ../cpan/ExtUtils-MakeMaker/t/metafile_data.t ................ FAILED Non-zero exit status: 2 No plan found in TAP output
  [stdio] 
  [stdio] -Duseithreads -Duselargefiles
  [stdio] -Duselargefiles
  [stdio] -Duseithreads
~~ ../cpan/Test-Simple/t/Test2/modules/Event/Plan.t ............ FAILED Non-zero exit status: 2 No plan found in TAP output
  [stdio] 
  [stdio] -Duseithreads -Duselargefiles
  [stdio] -Duselargefiles
  [stdio] -Duseithreads
~~ ../cpan/CPAN-Meta-YAML/t/31_local_tml.t ..................... FAILED Non-zero exit status: 2 No plan found in TAP output
  [stdio] 
  [stdio] -Duseithreads -Duselargefiles
  [stdio] -Duselargefiles
  [stdio] -Duseithreads
~~ ../lib/charnames.t .......................................... FAILED Non-zero exit status: 255 No plan found in TAP output
  [stdio] 
  [stdio] -Duseithreads -Duselargefiles
  [stdio] -Duselargefiles
  [stdio] -Duseithreads
~~ ../cpan/Test-Simple/t/Test2/modules/EventFacet/Parent.t ..... FAILED Non-zero exit status: 2 No plan found in TAP output
  [stdio] 
  [stdio] -Duseithreads -Duselargefiles
  [stdio] -Duselargefiles
  [stdio] -Duseithreads
~~ ../dist/Data-Dumper/t/freezer_useperl.t ..................... FAILED Non-zero exit status: 2 Bad plan.  You planned 7 tests but ran 0.
  [stdio] 
  [stdio] -Duseithreads -Duselargefiles
  [stdio] -Duselargefiles
  [stdio] -Duseithreads
~~ ../dist/Filter-Simple/t/no.t ................................ FAILED Non-zero exit status: 255 No plan found in TAP output
  [stdio] 
  [stdio] -Duseithreads -Duselargefiles
  [stdio] -Duselargefiles
  [stdio] -Duseithreads
~~ ../cpan/Test-Harness/t/prove.t .............................. FAILED Non-zero exit status: 2 Bad plan.  You planned 1809 tests but ran 0.
  [stdio] 
  [stdio] -Duseithreads -Duselargefiles
  [stdio] -Duselargefiles
  [stdio] -Duseithreads
~~ ../cpan/Test-Simple/t/Test2/modules/API.t ................... FAILED Non-zero exit status: 2 No plan found in TAP output
  [stdio] 
  [stdio] -Duseithreads -Duselargefiles
  [stdio] -Duselargefiles
  [stdio] -Duseithreads
~~ ../cpan/Test-Simple/t/Test2/modules/Event/Fail.t ............ FAILED Non-zero exit status: 2 No plan found in TAP output
  [stdio] 
  [stdio] -Duseithreads -Duselargefiles
  [stdio] -Duselargefiles
  [stdio] -Duseithreads
~~ ../cpan/Test-Simple/t/Test2/modules/Event.t ................. FAILED 3-5 Non-zero exit status: 4
  [stdio] 
  [stdio] -Duseithreads -Duselargefiles
  [stdio] -Duselargefiles
  [stdio] -Duseithreads
~~ ../dist/Filter-Simple/t/export.t ............................ FAILED Non-zero exit status: 255 Bad plan.  You planned 1 tests but ran 0.
  [stdio] 
  [stdio] -Duseithreads -Duselargefiles
  [stdio] -Duselargefiles
  [stdio] -Duseithreads
~~ ../cpan/Test-Simple/t/Test2/modules/IPC/Driver.t ............ FAILED Non-zero exit status: 2 No plan found in TAP output
  [stdio] 
  [stdio] -Duseithreads -Duselargefiles
  [stdio] -Duselargefiles
  [stdio] -Duseithreads
~~ ../lib/Unicode/UCD.t ........................................ FAILED Non-zero exit status: 2 No plan found in TAP output
  [stdio] 
  [stdio] -Duseithreads -Duselargefiles
  [stdio] -Duselargefiles
  [stdio] -Duseithreads
~~ ../cpan/Test-Simple/t/Test2/modules/Event/Waiting.t ......... FAILED Non-zero exit status: 2 No plan found in TAP output
  [stdio] 
  [stdio] -Duseithreads -Duselargefiles
  [stdio] -Duselargefiles
  [stdio] -Duseithreads
~~ ../dist/Data-Dumper/t/sortkeys.t ............................ FAILED Non-zero exit status: 2 No plan found in TAP output
  [stdio] 
  [stdio] -Duseithreads -Duselargefiles
  [stdio] -Duselargefiles
  [stdio] -Duseithreads
~~ ../dist/Data-Dumper/t/indent.t .............................. FAILED Non-zero exit status: 2 No plan found in TAP output
  [stdio] 
  [stdio] -Duseithreads -Duselargefiles
  [stdio] -Duselargefiles
  [stdio] -Duseithreads
~~ ../dist/Data-Dumper/t/bugs.t ................................ FAILED Non-zero exit status: 2 Bad plan.  You planned 24 tests but ran 0.
  [stdio] 
  [stdio] -Duseithreads -Duselargefiles
  [stdio] -Duselargefiles
  [stdio] -Duseithreads
~~ ../cpan/Test-Simple/t/Test2/modules/IPC.t ................... FAILED Non-zero exit status: 2 No plan found in TAP output
  [stdio] 
  [stdio] -Duseithreads -Duselargefiles
  [stdio] -Duselargefiles
  [stdio] -Duseithreads
~~ ../dist/Data-Dumper/t/quotekeys.t ........................... FAILED Non-zero exit status: 2 No plan found in TAP output
  [stdio] 
  [stdio] -Duseithreads -Duselargefiles
  [stdio] -Duselargefiles
  [stdio] -Duseithreads
~~ ../dist/Data-Dumper/t/deparse.t ............................. FAILED Non-zero exit status: 2 No plan found in TAP output
  [stdio] 
  [stdio] -Duseithreads -Duselargefiles
  [stdio] -Duselargefiles
  [stdio] -Duseithreads
~~ ../cpan/Text-Balanced/t/01_compile.t ........................ FAILED 1 Non-zero exit status: 1
  [stdio] 
  [stdio] -Duseithreads -Duselargefiles
  [stdio] -Duselargefiles
  [stdio] -Duseithreads
~~ ../dist/Data-Dumper/t/trailing_comma.t ...................... FAILED Non-zero exit status: 2 No plan found in TAP output
  [stdio] 
  [stdio] -Duseithreads -Duselargefiles
  [stdio] -Duselargefiles
  [stdio] -Duseithreads
~~ ../dist/Net-Ping/t/450_service.t ............................ FAILED 9 Non-zero exit status: 1
  [stdio] 
  [stdio] -Duseithreads -Duselargefiles
  [stdio] -Duselargefiles
  [stdio] -Duseithreads
~~ ../lib/DBM_Filter/t/int32.t ................................. FAILED Non-zero exit status: 2 Bad plan.  You planned 22 tests but ran 3.
  [stdio] 
  [stdio] -Duseithreads -Duselargefiles
  [stdio] -Duselargefiles
  [stdio] -Duseithreads
~~ ../cpan/version/t/02derived.t ............................... FAILED Non-zero exit status: 2 No plan found in TAP output
  [stdio] 
  [stdio] -Duseithreads -Duselargefiles
  [stdio] -Duselargefiles
  [stdio] -Duseithreads
~~ ../cpan/Test-Simple/t/Test2/modules/Event/Diag.t ............ FAILED Non-zero exit status: 2 No plan found in TAP output
  [stdio] 
  [stdio] -Duseithreads -Duselargefiles
  [stdio] -Duselargefiles
  [stdio] -Duseithreads
~~ ../dist/IO/t/cachepropagate-tcp.t ........................... FAILED Non-zero exit status: 9 Bad plan.  You planned 8 tests but ran 5.
  [stdio] -Duseithreads
~~ ../dist/Data-Dumper/t/bless.t ............................... FAILED 1 Non-zero exit status: 255 Bad plan.  You planned 11 tests but ran 1.
  [stdio] 
  [stdio] -Duseithreads -Duselargefiles
  [stdio] -Duselargefiles
  [stdio] -Duseithreads
~~ ../cpan/Module-Load/t/02_Module-Load.t ...................... FAILED 1-2 Non-zero exit status: 6
  [stdio] 
  [stdio] -Duseithreads -Duselargefiles
  [stdio] -Duselargefiles
  [stdio] -Duseithreads
~~ ../dist/Carp/t/Carp_overload.t .............................. FAILED Non-zero exit status: 2 Bad plan.  You planned 7 tests but ran 0.
  [stdio] 
  [stdio] -Duseithreads -Duselargefiles
  [stdio] -Duselargefiles
  [stdio] -Duseithreads
~~ ../cpan/File-Fetch/t/01_File-Fetch.t ........................ FAILED Non-zero exit status: 2 No plan found in TAP output
  [stdio] 
  [stdio] -Duseithreads -Duselargefiles
  [stdio] -Duselargefiles
  [stdio] -Duseithreads
~~ ../cpan/JSON-PP/t/022_comment_at_eof.t ...................... FAILED Non-zero exit status: 2 Bad plan.  You planned 13 tests but ran 0.
  [stdio] 
  [stdio] -Duseithreads -Duselargefiles
  [stdio] -Duselargefiles
  [stdio] -Duseithreads
~~ ../cpan/Test-Simple/t/Test2/modules/Util/Facets2Legacy.t .... FAILED 1 Non-zero exit status: 2
  [stdio] 
  [stdio] -Duseithreads -Duselargefiles
  [stdio] -Duselargefiles
  [stdio] -Duseithreads
~~ ../dist/Data-Dumper/t/misc.t ................................ FAILED Non-zero exit status: 2 No plan found in TAP output
  [stdio] 
  [stdio] -Duseithreads -Duselargefiles
  [stdio] -Duselargefiles
  [stdio] -Duseithreads
~~ ../cpan/Test-Simple/t/Test2/modules/Event/Exception.t ....... FAILED Non-zero exit status: 2 No plan found in TAP output
  [stdio] 
  [stdio] -Duseithreads -Duselargefiles
  [stdio] -Duselargefiles
  [stdio] -Duseithreads
~~ ../cpan/Test-Simple/t/Test2/modules/Event/Bail.t ............ FAILED Non-zero exit status: 2 No plan found in TAP output
  [stdio] 
  [stdio] -Duseithreads -Duselargefiles
  [stdio] -Duselargefiles
  [stdio] -Duseithreads
~~ ../cpan/Test-Simple/t/Test2/modules/Util/Trace.t ............ FAILED Non-zero exit status: 2 No plan found in TAP output
  [stdio] 
  [stdio] -Duseithreads -Duselargefiles
  [stdio] -Duselargefiles
  [stdio] -Duseithreads
~~ ../cpan/Test-Simple/t/Test2/behavior/run_subtest_inherit.t .. FAILED 1 Non-zero exit status: 4
  [stdio] 
  [stdio] -Duseithreads -Duselargefiles
  [stdio] -Duselargefiles
  [stdio] -Duseithreads
~~ ../cpan/Text-Balanced/t/08_extvar.t ......................... FAILED Non-zero exit status: 255 Bad plan.  You planned 183 tests but ran 0.
  [stdio] 
  [stdio] -Duseithreads -Duselargefiles
  [stdio] -Duselargefiles
  [stdio] -Duseithreads
~~ ../cpan/Test-Simple/t/Test2/modules/Event/Skip.t ............ FAILED Non-zero exit status: 2 No plan found in TAP output
  [stdio] 
  [stdio] -Duseithreads -Duselargefiles
  [stdio] -Duselargefiles
  [stdio] -Duseithreads
~~ ../cpan/Test-Simple/t/Test2/modules/API/Stack.t ............. FAILED Non-zero exit status: 2 No plan found in TAP output
  [stdio] 
  [stdio] -Duseithreads -Duselargefiles
  [stdio] -Duselargefiles
  [stdio] -Duseithreads
~~ ../lib/DBM_Filter/t/compress.t .............................. FAILED Non-zero exit status: 2 Bad plan.  You planned 23 tests but ran 4.
  [stdio] 
  [stdio] -Duseithreads -Duselargefiles
  [stdio] -Duselargefiles
  [stdio] -Duseithreads
~~ ../lib/DBM_Filter/t/encode.t ................................ FAILED Non-zero exit status: 2 Bad plan.  You planned 26 tests but ran 4.
  [stdio] 
  [stdio] -Duseithreads -Duselargefiles
  [stdio] -Duselargefiles
  [stdio] -Duseithreads
~~ ../cpan/Test-Harness/t/yamlish-writer.t ..................... FAILED Non-zero exit status: 2 Bad plan.  You planned 102 tests but ran 0.
  [stdio] 
  [stdio] -Duseithreads -Duselargefiles
  [stdio] -Duselargefiles
  [stdio] -Duseithreads
~~ ../ext/XS-APItest/t/utf8.t .................................. FAILED Non-zero exit status: 255 No plan found in TAP output
  [stdio] 
  [stdio] -Duseithreads -Duselargefiles
  [stdio] -Duselargefiles
  [stdio] -Duseithreads
~~ ../cpan/Test-Simple/t/Test2/modules/EventFacet/Info.t ....... FAILED Non-zero exit status: 2 No plan found in TAP output
  [stdio] 
  [stdio] -Duseithreads -Duselargefiles
  [stdio] -Duselargefiles
  [stdio] -Duseithreads
~~ ../cpan/Test-Simple/t/Test2/modules/EventFacet/Plan.t ....... FAILED Non-zero exit status: 2 No plan found in TAP output
  [stdio] 
  [stdio] -Duseithreads -Duselargefiles
  [stdio] -Duselargefiles
  [stdio] -Duseithreads
~~ ../dist/Data-Dumper/t/sparseseen.t .......................... FAILED Non-zero exit status: 2 No plan found in TAP output
  [stdio] 
  [stdio] -Duseithreads -Duselargefiles
  [stdio] -Duselargefiles
  [stdio] -Duseithreads
~~ ../cpan/Test-Simple/t/Test2/modules/API/Breakage.t .......... FAILED Non-zero exit status: 2 No plan found in TAP output
  [stdio] 
  [stdio] -Duseithreads -Duselargefiles
  [stdio] -Duselargefiles
  [stdio] -Duseithreads
~~ ../cpan/Text-Balanced/t/06_extqlk.t ......................... FAILED Non-zero exit status: 255 Bad plan.  You planned 95 tests but ran 0.
  [stdio] 
  [stdio] -Duseithreads -Duselargefiles
  [stdio] -Duselargefiles
  [stdio] -Duseithreads
~~ ../dist/Data-Dumper/t/qr.t .................................. FAILED Non-zero exit status: 2 Bad plan.  You planned 2 tests but ran 0.
  [stdio] 
  [stdio] -Duseithreads -Duselargefiles
  [stdio] -Duselargefiles
  [stdio] -Duseithreads
~~ ../t/porting/regen.t ........................................ FAILED 12 Non-zero exit status: 255 Bad plan.  You planned 45 tests but ran 12.
  [stdio] 
  [stdio] -Duseithreads -Duselargefiles
  [stdio] -Duselargefiles
  [stdio] -Duseithreads
~~ ../cpan/Test-Simple/t/Test2/modules/EventFacet/Meta.t ....... FAILED Non-zero exit status: 2 No plan found in TAP output
  [stdio] 
  [stdio] -Duseithreads -Duselargefiles
  [stdio] -Duselargefiles
  [stdio] -Duseithreads
~~ ../lib/DBM_Filter/t/utf8.t .................................. FAILED Non-zero exit status: 2 Bad plan.  You planned 20 tests but ran 4.
  [stdio] 
  [stdio] -Duseithreads -Duselargefiles
  [stdio] -Duselargefiles
  [stdio] -Duseithreads
~~ ../cpan/IO-Compress/t/105oneshot-zip-only.t ................. FAILED 219 Non-zero exit status: 1
  [stdio] 
  [stdio] -Duseithreads -Duselargefiles
  [stdio] -Duselargefiles
  [stdio] -Duseithreads
~~ ../dist/Data-Dumper/t/huge.t ................................ FAILED Non-zero exit status: 2 No plan found in TAP output
  [stdio] 
  [stdio] -Duseithreads -Duselargefiles
  [stdio] -Duselargefiles
  [stdio] -Duseithreads
~~ ../cpan/podlators/t/text/encoding.t ......................... FAILED Non-zero exit status: 255 Bad plan.  You planned 7 tests but ran 1.
  [stdio] 
  [stdio] -Duseithreads -Duselargefiles
  [stdio] -Duselargefiles
  [stdio] -Duseithreads
~~ ../dist/Data-Dumper/t/dumpperl.t ............................ FAILED Non-zero exit status: 2 No plan found in TAP output
  [stdio] 
  [stdio] -Duseithreads -Duselargefiles
  [stdio] -Duselargefiles
  [stdio] -Duseithreads
~~ ../dist/Data-Dumper/t/purity_deepcopy_maxdepth.t ............ FAILED Non-zero exit status: 2 No plan found in TAP output
  [stdio] 
  [stdio] -Duseithreads -Duselargefiles
  [stdio] -Duselargefiles
  [stdio] -Duseithreads
~~ ../dist/Filter-Simple/t/data.t .............................. FAILED Non-zero exit status: 255 No plan found in TAP output
  [stdio] 
  [stdio] -Duseithreads -Duselargefiles
  [stdio] -Duselargefiles
  [stdio] -Duseithreads
~~ ../cpan/Test-Simple/t/Test2/modules/Event/V2.t .............. FAILED Non-zero exit status: 2 No plan found in TAP output
  [stdio] 
  [stdio] -Duseithreads -Duselargefiles
  [stdio] -Duselargefiles
  [stdio] -Duseithreads
~~ ../t/op/tr.t ................................................ FAILED Non-zero exit status: 255 No plan found in TAP output
  [stdio] 
  [stdio] -Duseithreads -Duselargefiles
  [stdio] -Duselargefiles
  [stdio] -Duseithreads
~~ ../cpan/Text-Balanced/t/02_extbrk.t ......................... FAILED Non-zero exit status: 255 Bad plan.  You planned 19 tests but ran 0.
  [stdio] 
  [stdio] -Duseithreads -Duselargefiles
  [stdio] -Duselargefiles
  [stdio] -Duseithreads
~~ ../dist/Data-Dumper/t/names.t ............................... FAILED Non-zero exit status: 2 No plan found in TAP output
  [stdio] 
  [stdio] -Duseithreads -Duselargefiles
  [stdio] -Duselargefiles
  [stdio] -Duseithreads
~~ ../cpan/Text-Balanced/t/04_extdel.t ......................... FAILED Non-zero exit status: 255 Bad plan.  You planned 45 tests but ran 0.
  [stdio] 
  [stdio] -Duseithreads -Duselargefiles
  [stdio] -Duselargefiles
  [stdio] -Duseithreads
~~ ../cpan/Test-Simple/t/Test2/behavior/Formatter.t ............ FAILED Non-zero exit status: 2 No plan found in TAP output
  [stdio] 
  [stdio] -Duseithreads -Duselargefiles
  [stdio] -Duselargefiles
  [stdio] -Duseithreads
~~ ../cpan/Test-Simple/t/Test2/modules/API/Context.t ........... FAILED Non-zero exit status: 2 No plan found in TAP output
  [stdio] 
  [stdio] -Duseithreads -Duselargefiles
  [stdio] -Duselargefiles
  [stdio] -Duseithreads
~~ ../dist/Data-Dumper/t/recurse.t ............................. FAILED Non-zero exit status: 2 Bad plan.  You planned 32 tests but ran 0.
  [stdio] 
  [stdio] -Duseithreads -Duselargefiles
  [stdio] -Duselargefiles
  [stdio] -Duseithreads
~~ ../dist/Data-Dumper/t/bless_var_method.t .................... FAILED Non-zero exit status: 2 No plan found in TAP output
  [stdio] 
  [stdio] -Duseithreads -Duselargefiles
  [stdio] -Duselargefiles
  [stdio] -Duseithreads
~~ ../cpan/version/t/01base.t .................................. FAILED Non-zero exit status: 2 No plan found in TAP output
  [stdio] 
  [stdio] -Duseithreads -Duselargefiles
  [stdio] -Duselargefiles
  [stdio] -Duseithreads
~~ ../cpan/Text-Balanced/t/09_gentag.t ......................... FAILED Non-zero exit status: 255 Bad plan.  You planned 37 tests but ran 0.
  [stdio] 
  [stdio] -Duseithreads -Duselargefiles
  [stdio] -Duselargefiles
  [stdio] -Duseithreads
~~ ../cpan/Test-Simple/t/Test2/modules/EventFacet/Assert.t ..... FAILED Non-zero exit status: 2 No plan found in TAP output
  [stdio] 
  [stdio] -Duseithreads -Duselargefiles
  [stdio] -Duselargefiles
  [stdio] -Duseithreads
~~ ../cpan/Test-Simple/t/Test2/modules/EventFacet/About.t ...... FAILED Non-zero exit status: 2 No plan found in TAP output
  [stdio] 
  [stdio] -Duseithreads -Duselargefiles
  [stdio] -Duselargefiles
  [stdio] -Duseithreads
~~ ../cpan/version/t/03require.t ............................... FAILED Non-zero exit status: 2 No plan found in TAP output
  [stdio] 
  [stdio] -Duseithreads -Duselargefiles
  [stdio] -Duselargefiles
  [stdio] -Duseithreads
~~ ../dist/Data-Dumper/t/seen.t ................................ FAILED Non-zero exit status: 2 No plan found in TAP output
  [stdio] 
  [stdio] -Duseithreads -Duselargefiles
  [stdio] -Duselargefiles
  [stdio] -Duseithreads
~~ ../t/porting/customized.t ................................... FAILED 1-29
  [stdio] 
  [stdio] -Duseithreads -Duselargefiles
  [stdio] -Duselargefiles
  [stdio] -Duseithreads
~~ ../ext/XS-APItest/t/utf8_to_bytes.t ......................... FAILED Non-zero exit status: 2 No plan found in TAP output
  [stdio] 
  [stdio] -Duseithreads -Duselargefiles
  [stdio] -Duselargefiles
  [stdio] -Duseithreads
~~ ../cpan/Pod-Simple/t/JustPod_corpus.t ....................... FAILED 3-7 Non-zero exit status: 15
  [stdio] 
  [stdio] -Duseithreads -Duselargefiles
  [stdio] -Duselargefiles
  [stdio] -Duseithreads
~~ ../cpan/Test-Harness/t/state.t .............................. FAILED Non-zero exit status: 2 No plan found in TAP output
  [stdio] 
  [stdio] -Duseithreads -Duselargefiles
  [stdio] -Duselargefiles
  [stdio] -Duseithreads
~~ ../cpan/Test-Simple/t/Test2/modules/EventFacet.t ............ FAILED Non-zero exit status: 2 No plan found in TAP output
  [stdio] 
  [stdio] -Duseithreads -Duselargefiles
  [stdio] -Duselargefiles
  [stdio] -Duseithreads
~~ ../dist/Data-Dumper/t/dumper.t .............................. FAILED Non-zero exit status: 2 No plan found in TAP output
  [stdio] 
  [stdio] -Duseithreads -Duselargefiles
  [stdio] -Duselargefiles
  [stdio] -Duseithreads
~~ ../cpan/Test-Simple/t/Test2/regression/693_ipc_ordering.t ... FAILED Non-zero exit status: 2 No plan found in TAP output
  [stdio] -Duseithreads -Duselargefiles
  [stdio] -Duseithreads
~~ ../dist/Data-Dumper/t/freezer.t ............................. FAILED Non-zero exit status: 2 Bad plan.  You planned 8 tests but ran 0.
  [stdio] 
  [stdio] -Duseithreads -Duselargefiles
  [stdio] -Duselargefiles
  [stdio] -Duseithreads
~~ ../lib/DBM_Filter/t/null.t .................................. FAILED Non-zero exit status: 2 Bad plan.  You planned 26 tests but ran 3.
  [stdio] 
  [stdio] -Duseithreads -Duselargefiles
  [stdio] -Duselargefiles
  [stdio] -Duseithreads
~~ ../cpan/CPAN-Meta-YAML/t/30_yaml_spec_tml.t ................. FAILED Non-zero exit status: 2 No plan found in TAP output
  [stdio] 
  [stdio] -Duseithreads -Duselargefiles
  [stdio] -Duselargefiles
  [stdio] -Duseithreads
~~ ../cpan/Test-Simple/t/Test2/modules/Event/Encoding.t ........ FAILED Non-zero exit status: 2 No plan found in TAP output
  [stdio] 
  [stdio] -Duseithreads -Duselargefiles
  [stdio] -Duselargefiles
  [stdio] -Duseithreads
~~ ../cpan/CPAN-Meta-YAML/t/32_world_tml.t ..................... FAILED Non-zero exit status: 2 No plan found in TAP output
  [stdio] 
  [stdio] -Duseithreads -Duselargefiles
  [stdio] -Duselargefiles
  [stdio] -Duseithreads
~~ ../cpan/Test-Simple/t/Test2/modules/Event/Note.t ............ FAILED Non-zero exit status: 2 No plan found in TAP output
  [stdio] 
  [stdio] -Duseithreads -Duselargefiles
  [stdio] -Duselargefiles
  [stdio] -Duseithreads
~~ ../cpan/Text-Balanced/t/05_extmul.t ......................... FAILED Non-zero exit status: 255 Bad plan.  You planned 86 tests but ran 0.
  [stdio] 
  [stdio] -Duseithreads -Duselargefiles
  [stdio] -Duselargefiles
  [stdio] -Duseithreads
~~ ../cpan/Test-Simple/t/Test2/modules/Formatter/TAP.t ......... FAILED 3-10 Non-zero exit status: 8
  [stdio] 
  [stdio] -Duseithreads -Duselargefiles
  [stdio] -Duselargefiles
  [stdio] -Duseithreads
~~ ../cpan/Test-Simple/t/Legacy/check_tests.t .................. FAILED Non-zero exit status: 2 No plan found in TAP output
  [stdio] 
  [stdio] -Duseithreads -Duselargefiles
  [stdio] -Duselargefiles
  [stdio] -Duseithreads
~~ ../cpan/Test-Simple/t/Test2/modules/EventFacet/Error.t ...... FAILED Non-zero exit status: 2 No plan found in TAP output
  [stdio] 
  [stdio] -Duseithreads -Duselargefiles
  [stdio] -Duselargefiles
  [stdio] -Duseithreads
~~ ../cpan/Test-Simple/t/Test2/behavior/no_load_api.t .......... FAILED Non-zero exit status: 2 No plan found in TAP output
  [stdio] 
  [stdio] -Duseithreads -Duselargefiles
  [stdio] -Duselargefiles
  [stdio] -Duseithreads
~~ ../t/op/read.t .............................................. FAILED Non-zero exit status: 255 No plan found in TAP output
  [stdio] 
  [stdio] -Duseithreads -Duselargefiles
  [stdio] -Duselargefiles
  [stdio] -Duseithreads
~~ ../cpan/Text-Balanced/t/07_exttag.t ......................... FAILED Non-zero exit status: 255 Bad plan.  You planned 53 tests but ran 0.
  [stdio] 
  [stdio] -Duseithreads -Duselargefiles
  [stdio] -Duselargefiles
  [stdio] -Duseithreads
~~ ../cpan/Test-Simple/t/Legacy/explain.t ...................... FAILED Non-zero exit status: 2 Bad plan.  You planned 5 tests but ran 1.
  [stdio] 
  [stdio] -Duseithreads -Duselargefiles
  [stdio] -Duselargefiles
  [stdio] -Duseithreads
~~ ../cpan/Archive-Tar/t/05_iter.t ............................. FAILED 22 Non-zero exit status: 6
  [stdio] 
  [stdio] -Duseithreads -Duselargefiles
  [stdio] -Duselargefiles
  [stdio] -Duseithreads
~~ ../dist/Filter-Simple/t/filter_only.t ....................... FAILED Non-zero exit status: 255 No plan found in TAP output
  [stdio] 
  [stdio] -Duseithreads -Duselargefiles
  [stdio] -Duselargefiles
  [stdio] -Duseithreads
~~ ../cpan/Test-Simple/t/Test2/modules/EventFacet/Trace.t ...... FAILED Non-zero exit status: 2 No plan found in TAP output
  [stdio] 
  [stdio] -Duseithreads -Duselargefiles
  [stdio] -Duselargefiles
  [stdio] -Duseithreads
~~ ../cpan/Test-Simple/t/Test2/modules/IPC/Driver/Files.t ...... FAILED Non-zero exit status: 2 No plan found in TAP output
  [stdio] 
  [stdio] -Duseithreads -Duselargefiles
  [stdio] -Duselargefiles
  [stdio] -Duseithreads
~~ ../cpan/ExtUtils-MakeMaker/t/min_perl_version.t ............. FAILED 17-18 Non-zero exit status: 2
  [stdio] 
  [stdio] -Duseithreads -Duselargefiles
  [stdio] -Duselargefiles
  [stdio] -Duseithreads
~~ ../ext/Pod-Html/t/cache.t ................................... FAILED Non-zero exit status: 2 No plan found in TAP output
  [stdio] 
  [stdio] -Duseithreads -Duselargefiles
  [stdio] -Duselargefiles
  [stdio] -Duseithreads
~~ ../dist/Filter-Simple/t/import.t ............................ FAILED Non-zero exit status: 255 Bad plan.  You planned 4 tests but ran 0.
  [stdio] 
  [stdio] -Duseithreads -Duselargefiles
  [stdio] -Duselargefiles
  [stdio] -Duseithreads
~~ ../cpan/IO-Compress/t/112utf8-zip.t ......................... FAILED Non-zero exit status: 2 No plan found in TAP output
  [stdio] 
  [stdio] -Duseithreads -Duselargefiles
  [stdio] -Duselargefiles
  [stdio] -Duseithreads
~~ ../cpan/ExtUtils-MakeMaker/t/02-xsdynamic.t ................. FAILED 17 Non-zero exit status: 4
  [stdio] 
  [stdio] -Duselargefiles
~~ ../cpan/Test-Simple/t/Test2/modules/Event/TAP/Version.t ..... FAILED Non-zero exit status: 2 No plan found in TAP output
  [stdio] 
  [stdio] -Duseithreads -Duselargefiles
  [stdio] -Duselargefiles
  [stdio] -Duseithreads
~~ ../cpan/Test-Simple/t/Test2/modules/Tools/Tiny.t ............ FAILED Non-zero exit status: 2 No plan found in TAP output
  [stdio] 
  [stdio] -Duseithreads -Duselargefiles
  [stdio] -Duselargefiles
  [stdio] -Duseithreads
~~ ../dist/Data-Dumper/t/terse.t ............................... FAILED Non-zero exit status: 2 No plan found in TAP output
  [stdio] 
  [stdio] -Duseithreads -Duselargefiles
  [stdio] -Duselargefiles
  [stdio] -Duseithreads
~~ ../cpan/Test-Simple/t/Legacy/explain_err_vars.t ............. FAILED Non-zero exit status: 2 No plan found in TAP output
  [stdio] 
  [stdio] -Duseithreads -Duselargefiles
  [stdio] -Duselargefiles
  [stdio] -Duseithreads
~~ ../dist/Data-Dumper/t/values.t .............................. FAILED Non-zero exit status: 2 No plan found in TAP output
  [stdio] 
  [stdio] -Duseithreads -Duselargefiles
  [stdio] -Duselargefiles
  [stdio] -Duseithreads
~~ ../cpan/Pod-Simple/t/fake-closers.t ......................... FAILED Non-zero exit status: 2 No plan found in TAP output
  [stdio] 
  [stdio] -Duseithreads -Duselargefiles
  [stdio] -Duselargefiles
  [stdio] -Duseithreads
~~ ../cpan/Test-Simple/t/Test2/modules/EventFacet/Control.t .... FAILED Non-zero exit status: 2 No plan found in TAP output
  [stdio] 
  [stdio] -Duseithreads -Duselargefiles
  [stdio] -Duselargefiles
  [stdio] -Duseithreads
~~ ../cpan/Test-Simple/t/Test2/modules/API/Instance.t .......... FAILED Non-zero exit status: 2 No plan found in TAP output
  [stdio] 
  [stdio] -Duseithreads -Duselargefiles
  [stdio] -Duselargefiles
  [stdio] -Duseithreads
~~ ../cpan/IPC-Cmd/t/03_run-forked.t ........................... FAILED Non-zero exit status: 2 No plan found in TAP output
  [stdio] 
  [stdio] -Duseithreads -Duselargefiles
  [stdio] -Duselargefiles
  [stdio] -Duseithreads
~~ ../dist/Filter-Simple/t/filter.t ............................ FAILED Non-zero exit status: 255 No plan found in TAP output
  [stdio] 
  [stdio] -Duseithreads -Duselargefiles
  [stdio] -Duselargefiles
  [stdio] -Duseithreads
~~ ../cpan/Test-Simple/t/Test2/modules/Hub.t ................... FAILED 1-2 Non-zero exit status: 6
  [stdio] 
  [stdio] -Duseithreads -Duselargefiles
  [stdio] -Duselargefiles
  [stdio] -Duseithreads
~~ ../cpan/CPAN-Meta/t/converter-fail.t ........................ FAILED Non-zero exit status: 2 No plan found in TAP output
  [stdio] 
  [stdio] -Duseithreads -Duselargefiles
  [stdio] -Duselargefiles
  [stdio] -Duseithreads
~~ ../cpan/Test-Simple/t/Test2/modules/Event/Generic.t ......... FAILED Non-zero exit status: 2 No plan found in TAP output
  [stdio] 
  [stdio] -Duseithreads -Duselargefiles
  [stdio] -Duselargefiles
  [stdio] -Duseithreads

Test todo-passed:
~~ ../ext/IPC-Open3/t/IPC-Open3.t .............................. PASSED 25
  [stdio] 
  [stdio] -Duseithreads -Duselargefiles
  [stdio] -Duselargefiles
  [stdio] -Duseithreads

MANIFEST messages:

Compiler messages:
  [2019-11-03 07:03:25Z] perlio.obj : warning LNK4197: export 'PerlIO_pending' specified multiple times; using first specification
  [2019-11-03 07:03:25Z] perlio.obj : warning LNK4197: export 'PerlIO_perlio' specified multiple times; using first specification
  [2019-11-03 07:03:25Z] LINK : warning LNK4281: undesirable base address 0x28000000 for x64 image; set base address above 4GB for best ASLR optimization
  # Test.obj : error LNK2001: unresolved external symbol PL_curpad
  # Test.obj : error LNK2001: unresolved external symbol PL_op
  # Test.obj : error LNK2001: unresolved external symbol PL_stack_base
  # Test.obj : error LNK2001: unresolved external symbol PL_tainted
  # Test.obj : error LNK2001: unresolved external symbol PL_markstack_ptr
  # Test.obj : error LNK2001: unresolved external symbol PL_stack_sp
  # blib\arch\auto\XS\Test\Test.dll : fatal error LNK1120: 6 unresolved externals
  # NMAKE : fatal error U1077: '"C:\Program Files (x86)\Microsoft Visual Studio\2019\Community\VC\Tools\MSVC\14.23.28105\bin\HostX64\x64\link.EXE"' : return code '0x460'
  # Other.obj : error LNK2001: unresolved external symbol PL_curpad
  # Other.obj : error LNK2001: unresolved external symbol PL_op
  # Other.obj : error LNK2001: unresolved external symbol PL_stack_base
  # Other.obj : error LNK2001: unresolved external symbol PL_tainted
  # Other.obj : error LNK2001: unresolved external symbol PL_markstack_ptr
  # Other.obj : error LNK2001: unresolved external symbol PL_stack_sp
  # blib\arch\auto\XS\Other\Other.dll : fatal error LNK1120: 6 unresolved externals
  [2019-11-03 07:40:32Z] perlio.obj : warning LNK4197: export 'PerlIO_pending' specified multiple times; using first specification
  [2019-11-03 07:40:32Z] perlio.obj : warning LNK4197: export 'PerlIO_perlio' specified multiple times; using first specification
  [2019-11-03 07:40:32Z] LINK : warning LNK4281: undesirable base address 0x28000000 for x64 image; set base address above 4GB for best ASLR optimization
  [2019-11-03 08:14:27Z] perlio.obj : warning LNK4197: export 'PerlIO_pending' specified multiple times; using first specification
  [2019-11-03 08:14:27Z] perlio.obj : warning LNK4197: export 'PerlIO_perlio' specified multiple times; using first specification
  [2019-11-03 08:14:27Z] LINK : warning LNK4281: undesirable base address 0x28000000 for x64 image; set base address above 4GB for best ASLR optimization
  [2019-11-03 08:54:08Z] perlio.obj : warning LNK4197: export 'PerlIO_pending' specified multiple times; using first specification
  [2019-11-03 08:54:08Z] perlio.obj : warning LNK4197: export 'PerlIO_perlio' specified multiple times; using first specification
  [2019-11-03 08:54:08Z] LINK : warning LNK4281: undesirable base address 0x28000000 for x64 image; set base address above 4GB for best ASLR optimization

About this smoke:
    smoking-perl: 5.28.1
  smoker-version: 1.72/0.046
       timestamp: 2019-11-03 06:57:47+00
          tester: greer

Smoke logs available at http://m-l.org/~perl/smoke/perl/mswin32-win10/mswin32-win10-smoke-me/Karl%20Williamson/logb6a2e3648f6f5f82fde30021a3f79439dee40d64.log.gz
-- 
Report generated by Test::Smoke::Gateway v0.09_01