Show logfile
Automated smoke report for branch blead 5.31.6 patch 712e071bf4b91b0e2970bf38637b1a1b96dcc099 v5.31.5-115-g712e071
r9: PA8900 (PA-RISC2.0/64/1 cpus)
    on        HP-UX B.11.11/64
    using     gcc version 4.6.1 (*1)
    smoketime 1 day 18 hours 42 minutes (average 5 hours 20 minutes)

Summary: FAIL(F)

O = OK  F = Failure(s), extended report at the bottom
X = Failure(s) under TEST but not under harness
? = still running or test results not (yet) available
Build failures during:       - = unknown or N/A
c = Configure, m = make, M = make (after miniperl), t = make test-prep

v5.31.5-115-g712e071
---------------------- ----------------------------------------------------
F  F  F  F  F  F        -Dcc=gcc (*1)
F  F  F  F  F  F        -Dcc=gcc -Duse64bitall (*1)
F  F  F  F  F  F        -Dcc=gcc -Duseithreads (*1)
F  F  F  F  F  F        -Dcc=gcc -Duseithreads -Duse64bitall (*1)
|  |  |  |  |  |
|  |  |  |  |  +------  locale:univ.utf8 DEBUGGING
|  |  |  |  +---------  perlio DEBUGGING
|  |  |  +------------  stdio DEBUGGING
|  |  +---------------  locale:univ.utf8
|  +------------------  perlio
+---------------------  stdio

Applied patches:
  SMOKE712e071bf4b91b0e2970bf38637b1a1b96dcc099

Skipped tests:
  None

Test failures:
~~ ../t/re/pat.t ............................................... FAILED 965
  [locale:univ.utf8] -Dcc=gcc
  [locale:univ.utf8] -Dcc=gcc -Duse64bitall
  [locale:univ.utf8] -Dcc=gcc -Duseithreads -Duse64bitall DEBUGGING
  [locale:univ.utf8] -Dcc=gcc -Duseithreads DEBUGGING
  [locale:univ.utf8] -Dcc=gcc -Duseithreads
  [locale:univ.utf8] -Dcc=gcc DEBUGGING
  [locale:univ.utf8] -Dcc=gcc -Duse64bitall DEBUGGING
  [locale:univ.utf8] -Dcc=gcc -Duseithreads -Duse64bitall
~~ ../dist/Time-HiRes/t/ualarm.t ............................... FAILED 1 Non-zero exit status: 1
  [locale:univ.utf8] -Dcc=gcc -Duse64bitall DEBUGGING
~~ ../lib/B/Deparse.t .......................................... FAILED 3-90 94-96 104 107 109-143 145-187 189-260
  [locale:univ.utf8] -Dcc=gcc
  [locale:univ.utf8] -Dcc=gcc -Duse64bitall
  [locale:univ.utf8] -Dcc=gcc -Duseithreads -Duse64bitall DEBUGGING
  [locale:univ.utf8] -Dcc=gcc -Duseithreads DEBUGGING
  [locale:univ.utf8] -Dcc=gcc -Duseithreads
  [locale:univ.utf8] -Dcc=gcc DEBUGGING
  [locale:univ.utf8] -Dcc=gcc -Duse64bitall DEBUGGING
  [locale:univ.utf8] -Dcc=gcc -Duseithreads -Duse64bitall
~~ ../dist/Time-HiRes/t/alarm.t ................................ FAILED 8-9 Non-zero exit status: 2
  [perlio] -Dcc=gcc
~~ ../t/run/switches.t ......................................... FAILED Non-zero exit status: 2 Bad plan.  You planned 137 tests but ran 105.
  [locale:univ.utf8] -Dcc=gcc -Duseithreads -Duse64bitall DEBUGGING
~~ ../dist/threads-shared/t/waithires.t ........................ FAILED Bad plan.  You planned 63 tests but ran 0.
  [stdio/perlio/locale:univ.utf8] -Dcc=gcc -Duseithreads
  [stdio/perlio/locale:univ.utf8] -Dcc=gcc -Duseithreads -Duse64bitall DEBUGGING
  [stdio/perlio/locale:univ.utf8] -Dcc=gcc -Duseithreads DEBUGGING
  [stdio/perlio/locale:univ.utf8] -Dcc=gcc -Duseithreads -Duse64bitall
~~ ../dist/threads-shared/t/wait.t ............................. FAILED Bad plan.  You planned 91 tests but ran 0.
  [stdio/perlio/locale:univ.utf8] -Dcc=gcc -Duseithreads
  [stdio/perlio/locale:univ.utf8] -Dcc=gcc -Duseithreads -Duse64bitall DEBUGGING
  [stdio/perlio/locale:univ.utf8] -Dcc=gcc -Duseithreads DEBUGGING
  [stdio/perlio/locale:univ.utf8] -Dcc=gcc -Duseithreads -Duse64bitall
~~ ../dist/threads/t/free.t .................................... FAILED Bad plan.  You planned 29 tests but ran 0.
  [stdio/perlio/locale:univ.utf8] -Dcc=gcc -Duseithreads
  [stdio/perlio/locale:univ.utf8] -Dcc=gcc -Duseithreads -Duse64bitall DEBUGGING
  [stdio/perlio/locale:univ.utf8] -Dcc=gcc -Duseithreads DEBUGGING
  [stdio/perlio/locale:univ.utf8] -Dcc=gcc -Duseithreads -Duse64bitall
~~ ../t/io/nargv.t ............................................. FAILED Bad plan.  You planned 7 tests but ran 5.
  [perlio] -Dcc=gcc -Duseithreads DEBUGGING
~~ ../t/re/pat_psycho_thr.t .................................... FAILED No plan found in TAP output
  [stdio/perlio/locale:univ.utf8] -Dcc=gcc -Duseithreads
  [stdio/perlio/locale:univ.utf8] -Dcc=gcc -Duseithreads -Duse64bitall DEBUGGING
  [stdio/perlio/locale:univ.utf8] -Dcc=gcc -Duseithreads DEBUGGING
  [stdio/perlio/locale:univ.utf8] -Dcc=gcc -Duseithreads -Duse64bitall
~~ ../lib/locale.t ............................................. FAILED 431-432 498
  [stdio/perlio/locale:univ.utf8] -Dcc=gcc
  [stdio/perlio/locale:univ.utf8] -Dcc=gcc -Duse64bitall
  [stdio/perlio/locale:univ.utf8] -Dcc=gcc -Duseithreads -Duse64bitall DEBUGGING
  [stdio/perlio/locale:univ.utf8] -Dcc=gcc -Duseithreads DEBUGGING
  [stdio/perlio/locale:univ.utf8] -Dcc=gcc -Duseithreads
  [stdio/perlio/locale:univ.utf8] -Dcc=gcc DEBUGGING
  [stdio/perlio/locale:univ.utf8] -Dcc=gcc -Duse64bitall DEBUGGING
  [stdio/perlio/locale:univ.utf8] -Dcc=gcc -Duseithreads -Duse64bitall
~~ ../t/op/threads.t ........................................... FAILED Bad plan.  You planned 30 tests but ran 9.
  [stdio/perlio/locale:univ.utf8] -Dcc=gcc -Duseithreads
  [stdio/perlio/locale:univ.utf8] -Dcc=gcc -Duseithreads -Duse64bitall DEBUGGING
  [stdio/perlio/locale:univ.utf8] -Dcc=gcc -Duseithreads DEBUGGING
  [stdio/perlio/locale:univ.utf8] -Dcc=gcc -Duseithreads -Duse64bitall
~~ ../t/io/socket.t ............................................ FAILED 30
  [stdio] -Dcc=gcc
  [stdio] -Dcc=gcc -Duse64bitall
  [stdio] -Dcc=gcc -Duseithreads -Duse64bitall DEBUGGING
  [stdio] -Dcc=gcc -Duseithreads DEBUGGING
  [stdio] -Dcc=gcc -Duseithreads
  [stdio] -Dcc=gcc DEBUGGING
  [stdio] -Dcc=gcc -Duse64bitall DEBUGGING
  [stdio] -Dcc=gcc -Duseithreads -Duse64bitall
~~ ../lib/warnings.t ........................................... FAILED 366
  [stdio/perlio/locale:univ.utf8] -Dcc=gcc
  [stdio/perlio/locale:univ.utf8] -Dcc=gcc -Duse64bitall
  [stdio/perlio/locale:univ.utf8] -Dcc=gcc -Duseithreads -Duse64bitall DEBUGGING
  [stdio/perlio/locale:univ.utf8] -Dcc=gcc -Duseithreads DEBUGGING
  [stdio/perlio/locale:univ.utf8] -Dcc=gcc -Duseithreads
  [stdio/perlio/locale:univ.utf8] -Dcc=gcc DEBUGGING
  [stdio/perlio/locale:univ.utf8] -Dcc=gcc -Duse64bitall DEBUGGING
  [stdio/perlio/locale:univ.utf8] -Dcc=gcc -Duseithreads -Duse64bitall
~~ ../dist/threads/t/free2.t ................................... FAILED Bad plan.  You planned 78 tests but ran 0.
  [stdio/perlio/locale:univ.utf8] -Dcc=gcc -Duseithreads
  [stdio/perlio/locale:univ.utf8] -Dcc=gcc -Duseithreads -Duse64bitall DEBUGGING
  [stdio/perlio/locale:univ.utf8] -Dcc=gcc -Duseithreads DEBUGGING
  [stdio/perlio/locale:univ.utf8] -Dcc=gcc -Duseithreads -Duse64bitall
~~ ../t/io/iprefix.t ........................................... FAILED Bad plan.  You planned 2 tests but ran 0.
  [stdio/perlio] -Dcc=gcc -Duseithreads -Duse64bitall DEBUGGING
~~ ../cpan/Socket/t/Socket.t ................................... FAILED Non-zero exit status: 255 Bad plan.  You planned 6 tests but ran 2.
  [locale:univ.utf8] -Dcc=gcc
  [locale:univ.utf8] -Dcc=gcc -Duse64bitall
  [locale:univ.utf8] -Dcc=gcc -Duseithreads -Duse64bitall DEBUGGING
  [locale:univ.utf8] -Dcc=gcc -Duseithreads DEBUGGING
  [locale:univ.utf8] -Dcc=gcc -Duseithreads
  [locale:univ.utf8] -Dcc=gcc DEBUGGING
  [locale:univ.utf8] -Dcc=gcc -Duse64bitall DEBUGGING
  [locale:univ.utf8] -Dcc=gcc -Duseithreads -Duse64bitall
~~ ../cpan/Memoize/t/speed.t ................................... FAILED 2
  [stdio] -Dcc=gcc DEBUGGING
~~ ../ext/XS-APItest/t/keyword_plugin_threads.t ................ FAILED 1
  [stdio/perlio/locale:univ.utf8] -Dcc=gcc -Duseithreads
  [stdio/perlio/locale:univ.utf8] -Dcc=gcc -Duseithreads -Duse64bitall DEBUGGING
  [stdio/perlio/locale:univ.utf8] -Dcc=gcc -Duseithreads DEBUGGING
  [stdio/perlio/locale:univ.utf8] -Dcc=gcc -Duseithreads -Duse64bitall
~~ ../t/re/pat_thr.t ........................................... FAILED 965
  [locale:univ.utf8] -Dcc=gcc -Duseithreads
  [locale:univ.utf8] -Dcc=gcc -Duseithreads -Duse64bitall DEBUGGING
  [locale:univ.utf8] -Dcc=gcc -Duseithreads DEBUGGING
  [locale:univ.utf8] -Dcc=gcc -Duseithreads -Duse64bitall
~~ ../ext/XS-APItest/t/subsignature.t .......................... FAILED 2 Non-zero exit status: 1
  [stdio/perlio/locale:univ.utf8] -Dcc=gcc
  [stdio/perlio/locale:univ.utf8] -Dcc=gcc -Duse64bitall
  [stdio/perlio/locale:univ.utf8] -Dcc=gcc -Duseithreads -Duse64bitall DEBUGGING
  [stdio/perlio/locale:univ.utf8] -Dcc=gcc -Duseithreads DEBUGGING
  [stdio/perlio/locale:univ.utf8] -Dcc=gcc -Duseithreads
  [stdio/perlio/locale:univ.utf8] -Dcc=gcc DEBUGGING
  [stdio/perlio/locale:univ.utf8] -Dcc=gcc -Duse64bitall DEBUGGING
  [stdio/perlio/locale:univ.utf8] -Dcc=gcc -Duseithreads -Duse64bitall

Test todo-passed:
~~ ../dist/Net-Ping/t/450_service.t ............................ PASSED 9 18
  [stdio/perlio/locale:univ.utf8] -Dcc=gcc
  [stdio/perlio/locale:univ.utf8] -Dcc=gcc -Duse64bitall
  [stdio/perlio/locale:univ.utf8] -Dcc=gcc -Duseithreads -Duse64bitall DEBUGGING
  [stdio/perlio/locale:univ.utf8] -Dcc=gcc -Duseithreads DEBUGGING
  [stdio/perlio/locale:univ.utf8] -Dcc=gcc -Duseithreads
  [stdio/perlio/locale:univ.utf8] -Dcc=gcc DEBUGGING
  [stdio/perlio/locale:univ.utf8] -Dcc=gcc -Duse64bitall DEBUGGING
  [stdio/perlio/locale:univ.utf8] -Dcc=gcc -Duseithreads -Duse64bitall

MANIFEST messages:

Compiler messages:
  op.c: In function 'Perl_ck_eval':
  op.c:11856:9: warning: value computed is not used [-Wunused-value]
  toke.c: In function 'Perl_scan_num':
  toke.c:11498:54: warning: 'b' may be used uninitialized in this function [-Wuninitialized]
  regcomp.c: In function 'S_regpiece':
  regcomp.c:12722:46: warning: comparison between signed and unsigned integer expressions [-Wsign-compare]
  regcomp.c: In function 'S_regatom':
  regcomp.c:14751:25: warning: comparison is always false due to limited range of data type [-Wtype-limits]
  pp.c: In function 'Perl_pp_argelem':
  pp.c:7050:13: warning: value computed is not used [-Wunused-value]
  /usr/include/rpc/rpcb_prot.h:163:25: note: originally defined here
  regexec.c: In function 'S_regmatch':
  regexec.c:8144:37: warning: comparison between signed and unsigned integer expressions [-Wsign-compare]
  regexec.c:8167:34: warning: comparison between signed and unsigned integer expressions [-Wsign-compare]
  RealPPPort.xs: In function 'XS_Devel__PPPort_check_HeUTF8':
  RealPPPort.xs:1976:17: warning: value computed is not used [-Wunused-value]
  Encode.c: In function 'XS_Encode_decode':
  Encode.c:1356:5: warning: unused variable 'ix' [-Wunused-variable]
  Encode.c: In function 'XS_Encode_encode':
  Encode.c:1398:5: warning: unused variable 'ix' [-Wunused-variable]
  Socket.c: In function 'XS_Socket_pack_ip_mreq_source':
  Socket.c:1673:7: warning: variable 'interface' set but not used [-Wunused-but-set-variable]
  ./const-xs.inc: In function 'boot_Socket':
  ./const-xs.inc:986:20: warning: missing braces around initializer [-Wmissing-braces]
  ./const-xs.inc:986:20: warning: (near initialization for 'ip6_address._s6_un') [-Wmissing-braces]
  ./const-xs.inc:995:20: warning: missing braces around initializer [-Wmissing-braces]
  ./const-xs.inc:995:20: warning: (near initialization for 'ip6_address._s6_un') [-Wmissing-braces]
  const-c.inc: In function 'constant_19':
  const-c.inc:351:42: warning: unused parameter 'iv_return' [-Wunused-parameter]
  re_exec.c: In function 'S_regmatch':
  re_exec.c:8144:37: warning: comparison between signed and unsigned integer expressions [-Wsign-compare]
  re_exec.c:8167:34: warning: comparison between signed and unsigned integer expressions [-Wsign-compare]
  re_exec.c: In function 'S_regtry':
  re_exec.c:6497:30: warning: 'fold_array' may be used uninitialized in this function [-Wuninitialized]
  re_exec.c:6401:17: note: 'fold_array' was declared here
  re_exec.c:6503:28: warning: 'folder' may be used uninitialized in this function [-Wuninitialized]
  re_exec.c:6400:16: note: 'folder' was declared here
  re_comp.c: In function 'S_regpiece':
  re_comp.c:12722:46: warning: comparison between signed and unsigned integer expressions [-Wsign-compare]
  re_comp.c: In function 'S_regatom':
  re_comp.c:14751:25: warning: comparison is always false due to limited range of data type [-Wtype-limits]
  regexec.c: In function 'S_regtry':
  regexec.c:6497:30: warning: 'fold_array' may be used uninitialized in this function [-Wuninitialized]
  regexec.c:6401:17: note: 'fold_array' was declared here
  regexec.c:6503:28: warning: 'folder' may be used uninitialized in this function [-Wuninitialized]
  regexec.c:6400:16: note: 'folder' was declared here
  pp_sys.c: In function 'Perl_pp_gpwent':
  pp_sys.c:5515:19: warning: implicit declaration of function 'getspnam_r' [-Wimplicit-function-declaration]
  shared.xs: In function 'sharedsv_scalar_store':
  shared.xs:830:13: warning: value computed is not used [-Wunused-value]

About this smoke:
    smoking-perl: 5.14.2
  smoker-version: 1.72_06/0.046
       timestamp: 2019-10-31 22:25:34+00
          tester: merijn

Status overview available here: https://tux.nl/perl5/smoke/
-- 
Report generated by Test::Smoke::Gateway v0.09_01