Show logfile
Automated smoke report for branch blead 5.31.6 patch 712e071bf4b91b0e2970bf38637b1a1b96dcc099 v5.31.5-115-g712e071
x1: Intel(R) Itanium 2 processor/1600 MHz (ia64/2 cpus)
    on        HP-UX B.11.23/64
    using     gcc version 4.6.1 (*1)
    smoketime 18 hours 45 minutes (average 2 hours 20 minutes)

Summary: FAIL(F)

O = OK  F = Failure(s), extended report at the bottom
X = Failure(s) under TEST but not under harness
? = still running or test results not (yet) available
Build failures during:       - = unknown or N/A
c = Configure, m = make, M = make (after miniperl), t = make test-prep

v5.31.5-115-g712e071
---------------------- ----------------------------------------------------
F  F  F  F  F  F        -Dcc=gcc (*1)
F  F  F  F  F  F        -Dcc=gcc -Duse64bitall (*1)
F  F  F  F  F  F        -Dcc=gcc -Duseithreads (*1)
F  F  F  F  F  F        -Dcc=gcc -Duseithreads -Duse64bitall (*1)
|  |  |  |  |  |
|  |  |  |  |  +------  locale:en_US.utf8 DEBUGGING
|  |  |  |  +---------  perlio DEBUGGING
|  |  |  +------------  stdio DEBUGGING
|  |  +---------------  locale:en_US.utf8
|  +------------------  perlio
+---------------------  stdio

Applied patches:
  SMOKE712e071bf4b91b0e2970bf38637b1a1b96dcc099

Skipped tests:
      lib/Test/Simple/t/utf8.t

Test failures:
~~ ../dist/threads-shared/t/wait.t ............................. FAILED Bad plan.  You planned 91 tests but ran 7.
  [locale:en_US.utf8] -Dcc=gcc -Duseithreads -Duse64bitall
~~ ../dist/threads-shared/t/waithires.t ........................ FAILED Bad plan.  You planned 63 tests but ran 6.
  [perlio] -Dcc=gcc -Duseithreads DEBUGGING
~~ ../t/re/pat.t ............................................... FAILED 965
  [locale:en_US.utf8] -Dcc=gcc
  [locale:en_US.utf8] -Dcc=gcc -Duse64bitall
  [locale:en_US.utf8] -Dcc=gcc -Duseithreads -Duse64bitall DEBUGGING
  [locale:en_US.utf8] -Dcc=gcc -Duseithreads DEBUGGING
  [locale:en_US.utf8] -Dcc=gcc -Duseithreads
  [locale:en_US.utf8] -Dcc=gcc DEBUGGING
  [locale:en_US.utf8] -Dcc=gcc -Duse64bitall DEBUGGING
  [locale:en_US.utf8] -Dcc=gcc -Duseithreads -Duse64bitall
~~ ../lib/B/Deparse.t .......................................... FAILED 3-90 94-96 104 107 109-143 145-187 189-260
  [locale:en_US.utf8] -Dcc=gcc
  [locale:en_US.utf8] -Dcc=gcc -Duse64bitall
  [locale:en_US.utf8] -Dcc=gcc -Duseithreads -Duse64bitall DEBUGGING
  [locale:en_US.utf8] -Dcc=gcc -Duseithreads DEBUGGING
  [locale:en_US.utf8] -Dcc=gcc -Duseithreads
  [locale:en_US.utf8] -Dcc=gcc DEBUGGING
  [locale:en_US.utf8] -Dcc=gcc -Duse64bitall DEBUGGING
  [locale:en_US.utf8] -Dcc=gcc -Duseithreads -Duse64bitall
~~ ../dist/Devel-PPPort/t/exception.t .......................... FAILED Bad plan.  You planned 7 tests but ran 4.
  [stdio/perlio/locale:en_US.utf8] -Dcc=gcc -Duseithreads -Duse64bitall DEBUGGING
  [stdio/perlio/locale:en_US.utf8] -Dcc=gcc -Duseithreads DEBUGGING
~~ ../dist/threads-shared/t/waithires.t ........................ FAILED Bad plan.  You planned 63 tests but ran 0.
  [perlio/locale:en_US.utf8] -Dcc=gcc -Duseithreads
  [stdio/perlio/locale:en_US.utf8] -Dcc=gcc -Duseithreads -Duse64bitall DEBUGGING
  [locale:en_US.utf8] -Dcc=gcc -Duseithreads DEBUGGING
  [stdio/perlio/locale:en_US.utf8] -Dcc=gcc -Duseithreads -Duse64bitall
~~ ../dist/threads-shared/t/wait.t ............................. FAILED Bad plan.  You planned 91 tests but ran 0.
  [locale:en_US.utf8] -Dcc=gcc -Duseithreads
  [stdio/locale:en_US.utf8] -Dcc=gcc -Duseithreads -Duse64bitall DEBUGGING
  [perlio] -Dcc=gcc -Duseithreads -Duse64bitall
~~ ../dist/threads/t/free.t .................................... FAILED Bad plan.  You planned 29 tests but ran 1.
  [stdio] -Dcc=gcc -Duseithreads
  [stdio/perlio] -Dcc=gcc -Duseithreads -Duse64bitall DEBUGGING
  [locale:en_US.utf8] -Dcc=gcc -Duseithreads DEBUGGING
  [locale:en_US.utf8] -Dcc=gcc -Duseithreads -Duse64bitall
~~ ../dist/threads/t/free.t .................................... FAILED Bad plan.  You planned 29 tests but ran 0.
  [perlio/locale:en_US.utf8] -Dcc=gcc -Duseithreads
  [locale:en_US.utf8] -Dcc=gcc -Duseithreads -Duse64bitall DEBUGGING
  [stdio/perlio] -Dcc=gcc -Duseithreads DEBUGGING
  [stdio/perlio] -Dcc=gcc -Duseithreads -Duse64bitall
~~ ../t/re/pat_psycho_thr.t .................................... FAILED Bad plan.  You planned 15 tests but ran 0.
  [perlio] -Dcc=gcc -Duseithreads
  [stdio] -Dcc=gcc -Duseithreads -Duse64bitall DEBUGGING
  [stdio/locale:en_US.utf8] -Dcc=gcc -Duseithreads DEBUGGING
  [perlio] -Dcc=gcc -Duseithreads -Duse64bitall
~~ ../dist/threads-shared/t/wait.t ............................. FAILED Bad plan.  You planned 91 tests but ran 10.
  [perlio] -Dcc=gcc -Duseithreads -Duse64bitall DEBUGGING
  [perlio/locale:en_US.utf8] -Dcc=gcc -Duseithreads DEBUGGING
~~ ../t/re/pat_psycho_thr.t .................................... FAILED No plan found in TAP output
  [stdio/locale:en_US.utf8] -Dcc=gcc -Duseithreads
  [perlio/locale:en_US.utf8] -Dcc=gcc -Duseithreads -Duse64bitall DEBUGGING
  [perlio] -Dcc=gcc -Duseithreads DEBUGGING
  [stdio/locale:en_US.utf8] -Dcc=gcc -Duseithreads -Duse64bitall
~~ ../ext/XS-APItest/t/exception.t ............................. FAILED Bad plan.  You planned 12 tests but ran 5.
  [stdio/perlio/locale:en_US.utf8] -Dcc=gcc -Duseithreads -Duse64bitall DEBUGGING
  [stdio/perlio/locale:en_US.utf8] -Dcc=gcc -Duseithreads DEBUGGING
~~ ../t/op/threads.t ........................................... FAILED Bad plan.  You planned 30 tests but ran 9.
  [stdio/perlio/locale:en_US.utf8] -Dcc=gcc -Duseithreads
  [stdio/perlio/locale:en_US.utf8] -Dcc=gcc -Duseithreads -Duse64bitall DEBUGGING
  [stdio/perlio/locale:en_US.utf8] -Dcc=gcc -Duseithreads DEBUGGING
  [stdio/perlio/locale:en_US.utf8] -Dcc=gcc -Duseithreads -Duse64bitall
~~ ../dist/threads/t/free2.t ................................... FAILED Bad plan.  You planned 78 tests but ran 1.
  [stdio] -Dcc=gcc -Duseithreads
  [perlio] -Dcc=gcc -Duseithreads DEBUGGING
  [stdio/perlio] -Dcc=gcc -Duseithreads -Duse64bitall
~~ ../dist/threads/t/free2.t ................................... FAILED Bad plan.  You planned 78 tests but ran 0.
  [perlio/locale:en_US.utf8] -Dcc=gcc -Duseithreads
  [stdio/perlio/locale:en_US.utf8] -Dcc=gcc -Duseithreads -Duse64bitall DEBUGGING
  [stdio/locale:en_US.utf8] -Dcc=gcc -Duseithreads DEBUGGING
  [locale:en_US.utf8] -Dcc=gcc -Duseithreads -Duse64bitall
~~ ../cpan/Socket/t/Socket.t ................................... FAILED Non-zero exit status: 255 Bad plan.  You planned 6 tests but ran 2.
  [locale:en_US.utf8] -Dcc=gcc
  [locale:en_US.utf8] -Dcc=gcc -Duse64bitall
  [locale:en_US.utf8] -Dcc=gcc -Duseithreads -Duse64bitall DEBUGGING
  [locale:en_US.utf8] -Dcc=gcc -Duseithreads DEBUGGING
  [locale:en_US.utf8] -Dcc=gcc -Duseithreads
  [locale:en_US.utf8] -Dcc=gcc DEBUGGING
  [locale:en_US.utf8] -Dcc=gcc -Duse64bitall DEBUGGING
  [locale:en_US.utf8] -Dcc=gcc -Duseithreads -Duse64bitall
~~ ../dist/threads-shared/t/wait.t ............................. FAILED Bad plan.  You planned 91 tests but ran 11.
  [stdio/perlio] -Dcc=gcc -Duseithreads
  [stdio] -Dcc=gcc -Duseithreads -Duse64bitall
~~ ../dist/threads-shared/t/wait.t ............................. FAILED Bad plan.  You planned 91 tests but ran 16.
  [stdio] -Dcc=gcc -Duseithreads DEBUGGING
~~ ../ext/XS-APItest/t/keyword_plugin_threads.t ................ FAILED 1
  [stdio/perlio/locale:en_US.utf8] -Dcc=gcc -Duseithreads
  [stdio/perlio/locale:en_US.utf8] -Dcc=gcc -Duseithreads -Duse64bitall DEBUGGING
  [stdio/perlio/locale:en_US.utf8] -Dcc=gcc -Duseithreads DEBUGGING
  [stdio/perlio/locale:en_US.utf8] -Dcc=gcc -Duseithreads -Duse64bitall
~~ ../dist/threads-shared/t/waithires.t ........................ FAILED Bad plan.  You planned 63 tests but ran 8.
  [stdio] -Dcc=gcc -Duseithreads
  [stdio] -Dcc=gcc -Duseithreads DEBUGGING
~~ ../t/re/pat_thr.t ........................................... FAILED 965
  [locale:en_US.utf8] -Dcc=gcc -Duseithreads
  [locale:en_US.utf8] -Dcc=gcc -Duseithreads -Duse64bitall DEBUGGING
  [locale:en_US.utf8] -Dcc=gcc -Duseithreads DEBUGGING
  [locale:en_US.utf8] -Dcc=gcc -Duseithreads -Duse64bitall
~~ ../ext/XS-APItest/t/subsignature.t .......................... FAILED 2 Non-zero exit status: 1
  [stdio/perlio/locale:en_US.utf8] -Dcc=gcc
  [stdio/perlio/locale:en_US.utf8] -Dcc=gcc -Duse64bitall
  [stdio/perlio/locale:en_US.utf8] -Dcc=gcc -Duseithreads -Duse64bitall DEBUGGING
  [stdio/perlio/locale:en_US.utf8] -Dcc=gcc -Duseithreads DEBUGGING
  [stdio/perlio/locale:en_US.utf8] -Dcc=gcc -Duseithreads
  [stdio/perlio/locale:en_US.utf8] -Dcc=gcc DEBUGGING
  [stdio/perlio/locale:en_US.utf8] -Dcc=gcc -Duse64bitall DEBUGGING
  [stdio/perlio/locale:en_US.utf8] -Dcc=gcc -Duseithreads -Duse64bitall

Test todo-passed:
~~ ../dist/Net-Ping/t/450_service.t ............................ PASSED 9 18
  [stdio/perlio/locale:en_US.utf8] -Dcc=gcc
  [stdio/perlio/locale:en_US.utf8] -Dcc=gcc -Duse64bitall
  [stdio/perlio/locale:en_US.utf8] -Dcc=gcc -Duseithreads -Duse64bitall DEBUGGING
  [stdio/perlio/locale:en_US.utf8] -Dcc=gcc -Duseithreads DEBUGGING
  [stdio/perlio/locale:en_US.utf8] -Dcc=gcc -Duseithreads
  [stdio/perlio/locale:en_US.utf8] -Dcc=gcc DEBUGGING
  [stdio/perlio/locale:en_US.utf8] -Dcc=gcc -Duse64bitall DEBUGGING
  [stdio/perlio/locale:en_US.utf8] -Dcc=gcc -Duseithreads -Duse64bitall

MANIFEST messages:

Compiler messages:
  op.c: In function 'Perl_ck_eval':
  op.c:11856:9: warning: value computed is not used [-Wunused-value]
  toke.c: In function 'Perl_scan_num':
  toke.c:11498:54: warning: 'b' may be used uninitialized in this function [-Wuninitialized]
  regcomp.c: In function 'S_regatom':
  regcomp.c:14751:25: warning: comparison is always false due to limited range of data type [-Wtype-limits]
  pp.c: In function 'Perl_pp_argelem':
  pp.c:7050:13: warning: value computed is not used [-Wunused-value]
  /usr/include/rpc/rpcb_prot.h:163:25: note: originally defined here
  RealPPPort.xs: In function 'XS_Devel__PPPort_check_HeUTF8':
  RealPPPort.xs:1976:17: warning: value computed is not used [-Wunused-value]
  Encode.c: In function 'XS_Encode_decode':
  Encode.c:1356:5: warning: unused variable 'ix' [-Wunused-variable]
  Encode.c: In function 'XS_Encode_encode':
  Encode.c:1398:5: warning: unused variable 'ix' [-Wunused-variable]
  Socket.c: In function 'XS_Socket_pack_ip_mreq_source':
  Socket.c:1673:7: warning: variable 'interface' set but not used [-Wunused-but-set-variable]
  ./const-xs.inc: In function 'boot_Socket':
  ./const-xs.inc:986:20: warning: missing braces around initializer [-Wmissing-braces]
  ./const-xs.inc:986:20: warning: (near initialization for 'ip6_address._s6_un') [-Wmissing-braces]
  ./const-xs.inc:995:20: warning: missing braces around initializer [-Wmissing-braces]
  ./const-xs.inc:995:20: warning: (near initialization for 'ip6_address._s6_un') [-Wmissing-braces]
  Storable.xs: In function 'get_regexp':
  Storable.xs:3440:7: warning: format '%d' expects argument of type 'int', but argument 2 has type 'I32' [-Wformat]
  Storable.xs: In function 'retrieve_regexp':
  Storable.xs:6854:9: warning: format '%d' expects argument of type 'int', but argument 2 has type 'I32' [-Wformat]
  const-c.inc: In function 'constant_19':
  const-c.inc:351:42: warning: unused parameter 'iv_return' [-Wunused-parameter]
  APItest.xs: In function 'THX_parse_keyword_subsignature':
  APItest.xs:1085:3: warning: format '%d' expects argument of type 'int', but argument 2 has type 'line_t' [-Wformat]
  re_exec.c: In function 'S_regtry':
  re_exec.c:6497:30: warning: 'fold_array' may be used uninitialized in this function [-Wuninitialized]
  re_exec.c:6401:17: note: 'fold_array' was declared here
  re_exec.c:6503:28: warning: 'folder' may be used uninitialized in this function [-Wuninitialized]
  re_exec.c:6400:16: note: 'folder' was declared here
  re_comp.c: In function 'S_regatom':
  re_comp.c:14751:25: warning: comparison is always false due to limited range of data type [-Wtype-limits]
  regexec.c: In function 'S_regtry':
  regexec.c:6497:30: warning: 'fold_array' may be used uninitialized in this function [-Wuninitialized]
  regexec.c:6401:17: note: 'fold_array' was declared here
  regexec.c:6503:28: warning: 'folder' may be used uninitialized in this function [-Wuninitialized]
  regexec.c:6400:16: note: 'folder' was declared here
  Storable.xs: In function 'store_hook':
  Storable.xs:4081:17: warning: format '%d' expects argument of type 'int', but argument 3 has type 'I32' [-Wformat]
  Storable.xs: In function 'store':
  Storable.xs:4456:6: warning: format '%d' expects argument of type 'int', but argument 3 has type 'I32' [-Wformat]
  shared.xs: In function 'sharedsv_scalar_store':
  shared.xs:830:13: warning: value computed is not used [-Wunused-value]

About this smoke:
    smoking-perl: 5.14.2
  smoker-version: 1.72_06/0.046
       timestamp: 2019-11-01 14:06:43+00
          tester: merijn

Status overview available here: https://tux.nl/perl5/smoke/
-- 
Report generated by Test::Smoke::Gateway v0.09_01