Show logfile
Automated smoke report for branch blead 5.31.6 patch dd469d97d90432366e531534b23dd30f1f8a07ca v5.31.4-368-gdd469d97d9
i3: PPC_POWER5 (PPC/1 cpus)
    on        AIX 5.3.0.0/TL12-05
    using     xlc -q32 version 12.1.0.12 (*1)
    using     xlc -q64 version 12.1.0.12 (*2)
    using     xlc_r -q32 version 12.1.0.12 (*3)
    using     xlc_r -q64 version 12.1.0.12 (*4)
    smoketime 1 day 10 hours 31 minutes (average 2 hours 52 minutes)

Summary: FAIL(F)

O = OK  F = Failure(s), extended report at the bottom
X = Failure(s) under TEST but not under harness
? = still running or test results not (yet) available
Build failures during:       - = unknown or N/A
c = Configure, m = make, M = make (after miniperl), t = make test-prep

v5.31.4-368-gdd469d97d9
---------------------- ----------------------------------------------------
F  F  F  F  F  F         (*1)
F  F  F  F  F  F        -Duse64bitint (*1)
-  -  -  -  -  -        -Duse64bitall (*1)
-  -  -  -  -  -        -Duseithreads (*1)
-  -  -  -  -  -        -Duseithreads -Duse64bitint (*1)
-  -  -  -  -  -        -Duseithreads -Duse64bitall (*1)
-  -  -  -  -  -         (*2)
-  -  -  -  -  -        -Duse64bitint (*2)
F  F  F  F  F  F        -Duse64bitall (*2)
-  -  -  -  -  -        -Duseithreads (*2)
-  -  -  -  -  -        -Duseithreads -Duse64bitint (*2)
-  -  -  -  -  -        -Duseithreads -Duse64bitall (*2)
-  -  -  -  -  -         (*3)
-  -  -  -  -  -        -Duse64bitint (*3)
-  -  -  -  -  -        -Duse64bitall (*3)
F  F  F  F  F  F        -Duseithreads (*3)
F  F  F  F  F  F        -Duseithreads -Duse64bitint (*3)
-  -  -  -  -  -        -Duseithreads -Duse64bitall (*3)
-  -  -  -  -  -         (*4)
-  -  -  -  -  -        -Duse64bitint (*4)
-  -  -  -  -  -        -Duse64bitall (*4)
-  -  -  -  -  -        -Duseithreads (*4)
-  -  -  -  -  -        -Duseithreads -Duse64bitint (*4)
F  F  F  F  F  F        -Duseithreads -Duse64bitall (*4)
|  |  |  |  |  |
|  |  |  |  |  +------  locale:EN_US.UTF-8 DEBUGGING
|  |  |  |  +---------  perlio DEBUGGING
|  |  |  +------------  stdio DEBUGGING
|  |  +---------------  locale:EN_US.UTF-8
|  +------------------  perlio
+---------------------  stdio

Applied patches:
  SMOKEdd469d97d90432366e531534b23dd30f1f8a07ca

Skipped tests:
  None

Test failures:
~~ ../cpan/Socket/t/Socket.t ................................... FAILED Non-zero exit status: 255 Bad plan.  You planned 6 tests but ran 2.
  [locale:EN_US.UTF-8] -Duseithreads -Duse64bitint DEBUGGING
  [locale:EN_US.UTF-8] 
  [locale:EN_US.UTF-8] -Duseithreads DEBUGGING
  [locale:EN_US.UTF-8] -Duseithreads -Duse64bitall DEBUGGING
  [locale:EN_US.UTF-8] -Duse64bitall DEBUGGING
  [locale:EN_US.UTF-8]  DEBUGGING
  [locale:EN_US.UTF-8] -Duseithreads -Duse64bitint
  [locale:EN_US.UTF-8] -Duse64bitint DEBUGGING
  [locale:EN_US.UTF-8] -Duse64bitint
  [locale:EN_US.UTF-8] -Duseithreads
  [locale:EN_US.UTF-8] -Duseithreads -Duse64bitall
  [locale:EN_US.UTF-8] -Duse64bitall
~~ ../ext/XS-APItest/t/subsignature.t .......................... FAILED 2 Non-zero exit status: 1
  [stdio/perlio/locale:EN_US.UTF-8] -Duseithreads -Duse64bitint DEBUGGING
  [stdio/perlio/locale:EN_US.UTF-8] 
  [stdio/perlio/locale:EN_US.UTF-8] -Duseithreads DEBUGGING
  [stdio/perlio/locale:EN_US.UTF-8] -Duseithreads -Duse64bitall DEBUGGING
  [stdio/perlio/locale:EN_US.UTF-8] -Duse64bitall DEBUGGING
  [stdio/perlio/locale:EN_US.UTF-8]  DEBUGGING
  [stdio/perlio/locale:EN_US.UTF-8] -Duseithreads -Duse64bitint
  [stdio/perlio/locale:EN_US.UTF-8] -Duse64bitint DEBUGGING
  [stdio/perlio/locale:EN_US.UTF-8] -Duse64bitint
  [stdio/perlio/locale:EN_US.UTF-8] -Duseithreads
  [stdio/perlio/locale:EN_US.UTF-8] -Duseithreads -Duse64bitall
  [stdio/perlio/locale:EN_US.UTF-8] -Duse64bitall
~~ ../t/re/pat.t ............................................... FAILED 965
  [locale:EN_US.UTF-8] -Duseithreads -Duse64bitint DEBUGGING
  [locale:EN_US.UTF-8] 
  [locale:EN_US.UTF-8] -Duseithreads DEBUGGING
  [locale:EN_US.UTF-8] -Duseithreads -Duse64bitall DEBUGGING
  [locale:EN_US.UTF-8] -Duse64bitall DEBUGGING
  [locale:EN_US.UTF-8]  DEBUGGING
  [locale:EN_US.UTF-8] -Duseithreads -Duse64bitint
  [locale:EN_US.UTF-8] -Duse64bitint DEBUGGING
  [locale:EN_US.UTF-8] -Duse64bitint
  [locale:EN_US.UTF-8] -Duseithreads
  [locale:EN_US.UTF-8] -Duseithreads -Duse64bitall
  [locale:EN_US.UTF-8] -Duse64bitall
~~ ../cpan/ExtUtils-MakeMaker/t/03-xsstatic.t .................. FAILED 5 11 17 23 29 35 Non-zero exit status: 6
  [stdio/perlio/locale:EN_US.UTF-8] -Duseithreads -Duse64bitint DEBUGGING
  [stdio/perlio/locale:EN_US.UTF-8] 
  [stdio/perlio/locale:EN_US.UTF-8] -Duseithreads DEBUGGING
  [stdio/perlio/locale:EN_US.UTF-8] -Duseithreads -Duse64bitall DEBUGGING
  [stdio/perlio/locale:EN_US.UTF-8] -Duse64bitall DEBUGGING
  [stdio/perlio/locale:EN_US.UTF-8]  DEBUGGING
  [stdio/perlio/locale:EN_US.UTF-8] -Duseithreads -Duse64bitint
  [stdio/perlio/locale:EN_US.UTF-8] -Duse64bitint DEBUGGING
  [stdio/perlio/locale:EN_US.UTF-8] -Duse64bitint
  [stdio/perlio/locale:EN_US.UTF-8] -Duseithreads
  [stdio/perlio/locale:EN_US.UTF-8] -Duseithreads -Duse64bitall
  [stdio/perlio/locale:EN_US.UTF-8] -Duse64bitall
~~ ../cpan/IO-Socket-IP/t/31nonblocking-connect-internet.t ..... FAILED Non-zero exit status: 55 No plan found in TAP output
  [perlio] -Duseithreads -Duse64bitint DEBUGGING
  [stdio] 
  [locale:EN_US.UTF-8] -Duseithreads DEBUGGING
  [stdio] -Duseithreads -Duse64bitall DEBUGGING
  [locale:EN_US.UTF-8] -Duse64bitall DEBUGGING
  [locale:EN_US.UTF-8] -Duseithreads -Duse64bitint
  [stdio] -Duse64bitint DEBUGGING
  [stdio/perlio] -Duse64bitint
  [perlio] -Duseithreads
  [perlio] -Duse64bitall
~~ ../t/re/pat_thr.t ........................................... FAILED 965
  [locale:EN_US.UTF-8] -Duseithreads -Duse64bitint DEBUGGING
  [locale:EN_US.UTF-8] -Duseithreads DEBUGGING
  [locale:EN_US.UTF-8] -Duseithreads -Duse64bitall DEBUGGING
  [locale:EN_US.UTF-8] -Duseithreads -Duse64bitall
  [locale:EN_US.UTF-8] -Duseithreads -Duse64bitint
  [locale:EN_US.UTF-8] -Duseithreads

Test todo-passed:
~~ ../lib/B/Deparse.t .......................................... PASSED 2
  [locale:EN_US.UTF-8] -Duseithreads -Duse64bitint DEBUGGING
  [locale:EN_US.UTF-8] 
  [locale:EN_US.UTF-8] -Duseithreads DEBUGGING
  [locale:EN_US.UTF-8] -Duseithreads -Duse64bitall DEBUGGING
  [locale:EN_US.UTF-8] -Duse64bitall DEBUGGING
  [locale:EN_US.UTF-8]  DEBUGGING
  [locale:EN_US.UTF-8] -Duseithreads -Duse64bitint
  [locale:EN_US.UTF-8] -Duse64bitint DEBUGGING
  [locale:EN_US.UTF-8] -Duse64bitint
  [locale:EN_US.UTF-8] -Duseithreads
  [locale:EN_US.UTF-8] -Duseithreads -Duse64bitall
  [locale:EN_US.UTF-8] -Duse64bitall

MANIFEST messages:
  MANIFEST did not declare 'rm.sh'
  MANIFEST did not declare 'rmf.sh'

Compiler messages:

About this smoke:
    smoking-perl: 5.14.2
  smoker-version: 1.72_06/0.046
       timestamp: 2019-10-24 21:24:51+00
          tester: merijn

Status overview available here: https://tux.nl/perl5/smoke/
-- 
Report generated by Test::Smoke::Gateway v0.09_01