Show logfile
Automated smoke report for branch blead 5.31.6 patch 37e7f9c10d7c4b145b48133dcde5058d875bed7b v5.31.5-6-g37e7f9c10d
x2: ia64 (ia64/4 cpus)
    on        HP-UX B.11.31/64
    using     gcc version 4.7.2 (*1)
    smoketime 11 hours 1 minute (average 1 hour 22 minutes)

Summary: FAIL(F)

O = OK  F = Failure(s), extended report at the bottom
X = Failure(s) under TEST but not under harness
? = still running or test results not (yet) available
Build failures during:       - = unknown or N/A
c = Configure, m = make, M = make (after miniperl), t = make test-prep

v5.31.5-6-g37e7f9c10d
---------------------- ----------------------------------------------------
F  F  F  F  F  F        -Dcc=gcc (*1)
F  F  F  F  F  F        -Dcc=gcc -Duse64bitall (*1)
F  F  F  F  F  F        -Dcc=gcc -Duseithreads (*1)
F  F  F  F  F  F        -Dcc=gcc -Duseithreads -Duse64bitall (*1)
|  |  |  |  |  |
|  |  |  |  |  +------  locale:en_US.utf8 DEBUGGING
|  |  |  |  +---------  perlio DEBUGGING
|  |  |  +------------  stdio DEBUGGING
|  |  +---------------  locale:en_US.utf8
|  +------------------  perlio
+---------------------  stdio

Applied patches:
  SMOKE37e7f9c10d7c4b145b48133dcde5058d875bed7b

Skipped tests:
  None

Test failures:
~~ ../dist/threads-shared/t/wait.t ............................. FAILED Bad plan.  You planned 91 tests but ran 7.
  [locale:en_US.utf8] -Dcc=gcc -Duseithreads
  [locale:en_US.utf8] -Dcc=gcc -Duseithreads -Duse64bitall DEBUGGING
  [perlio] -Dcc=gcc -Duseithreads -Duse64bitall
~~ ../dist/threads-shared/t/waithires.t ........................ FAILED Bad plan.  You planned 63 tests but ran 6.
  [stdio] -Dcc=gcc -Duseithreads
  [perlio] -Dcc=gcc -Duseithreads DEBUGGING
~~ ../t/re/pat.t ............................................... FAILED 965
  [locale:en_US.utf8] -Dcc=gcc
  [locale:en_US.utf8] -Dcc=gcc -Duse64bitall
  [locale:en_US.utf8] -Dcc=gcc -Duseithreads -Duse64bitall DEBUGGING
  [locale:en_US.utf8] -Dcc=gcc -Duseithreads DEBUGGING
  [locale:en_US.utf8] -Dcc=gcc -Duseithreads
  [locale:en_US.utf8] -Dcc=gcc DEBUGGING
  [locale:en_US.utf8] -Dcc=gcc -Duse64bitall DEBUGGING
  [locale:en_US.utf8] -Dcc=gcc -Duseithreads -Duse64bitall
~~ ../lib/locale.t ............................................. FAILED 448
  [stdio] -Dcc=gcc
  [stdio] -Dcc=gcc -Duseithreads DEBUGGING
~~ ../dist/Devel-PPPort/t/exception.t .......................... FAILED Bad plan.  You planned 7 tests but ran 4.
  [stdio/perlio/locale:en_US.utf8] -Dcc=gcc -Duseithreads -Duse64bitall DEBUGGING
  [stdio/perlio/locale:en_US.utf8] -Dcc=gcc -Duseithreads DEBUGGING
~~ ../dist/threads-shared/t/waithires.t ........................ FAILED Bad plan.  You planned 63 tests but ran 0.
  [perlio] -Dcc=gcc -Duseithreads
  [locale:en_US.utf8] -Dcc=gcc -Duseithreads DEBUGGING
~~ ../dist/threads-shared/t/wait.t ............................. FAILED Bad plan.  You planned 91 tests but ran 0.
  [locale:en_US.utf8] -Dcc=gcc -Duseithreads DEBUGGING
~~ ../dist/threads/t/free.t .................................... FAILED Bad plan.  You planned 29 tests but ran 1.
  [stdio/perlio/locale:en_US.utf8] -Dcc=gcc -Duseithreads
  [stdio/perlio/locale:en_US.utf8] -Dcc=gcc -Duseithreads -Duse64bitall DEBUGGING
  [stdio/perlio] -Dcc=gcc -Duseithreads DEBUGGING
  [stdio/perlio/locale:en_US.utf8] -Dcc=gcc -Duseithreads -Duse64bitall
~~ ../dist/threads/t/free.t .................................... FAILED Bad plan.  You planned 29 tests but ran 0.
  [locale:en_US.utf8] -Dcc=gcc -Duseithreads DEBUGGING
~~ ../t/re/pat_psycho_thr.t .................................... FAILED Bad plan.  You planned 15 tests but ran 0.
  [stdio/perlio] -Dcc=gcc -Duseithreads
  [stdio] -Dcc=gcc -Duseithreads -Duse64bitall
~~ ../dist/threads-shared/t/wait.t ............................. FAILED Bad plan.  You planned 91 tests but ran 5.
  [locale:en_US.utf8] -Dcc=gcc -Duseithreads -Duse64bitall
~~ ../t/re/pat_psycho_thr.t .................................... FAILED No plan found in TAP output
  [locale:en_US.utf8] -Dcc=gcc -Duseithreads
  [stdio/perlio/locale:en_US.utf8] -Dcc=gcc -Duseithreads -Duse64bitall DEBUGGING
  [stdio/perlio/locale:en_US.utf8] -Dcc=gcc -Duseithreads DEBUGGING
  [perlio/locale:en_US.utf8] -Dcc=gcc -Duseithreads -Duse64bitall
~~ ../ext/XS-APItest/t/exception.t ............................. FAILED Bad plan.  You planned 12 tests but ran 5.
  [stdio/perlio/locale:en_US.utf8] -Dcc=gcc -Duseithreads -Duse64bitall DEBUGGING
  [stdio/perlio/locale:en_US.utf8] -Dcc=gcc -Duseithreads DEBUGGING
~~ ../t/op/threads.t ........................................... FAILED Bad plan.  You planned 30 tests but ran 9.
  [stdio/perlio/locale:en_US.utf8] -Dcc=gcc -Duseithreads
  [stdio/perlio/locale:en_US.utf8] -Dcc=gcc -Duseithreads -Duse64bitall DEBUGGING
  [stdio/perlio/locale:en_US.utf8] -Dcc=gcc -Duseithreads DEBUGGING
  [stdio/perlio/locale:en_US.utf8] -Dcc=gcc -Duseithreads -Duse64bitall
~~ ../dist/threads/t/free2.t ................................... FAILED Bad plan.  You planned 78 tests but ran 1.
  [stdio/perlio/locale:en_US.utf8] -Dcc=gcc -Duseithreads
  [stdio/perlio/locale:en_US.utf8] -Dcc=gcc -Duseithreads -Duse64bitall DEBUGGING
  [stdio/perlio] -Dcc=gcc -Duseithreads DEBUGGING
  [stdio/perlio/locale:en_US.utf8] -Dcc=gcc -Duseithreads -Duse64bitall
~~ ../dist/threads-shared/t/wait.t ............................. FAILED Bad plan.  You planned 91 tests but ran 6.
  [perlio] -Dcc=gcc -Duseithreads
  [perlio] -Dcc=gcc -Duseithreads -Duse64bitall DEBUGGING
~~ ../dist/threads/t/free2.t ................................... FAILED Bad plan.  You planned 78 tests but ran 0.
  [locale:en_US.utf8] -Dcc=gcc -Duseithreads DEBUGGING
~~ ../cpan/Socket/t/Socket.t ................................... FAILED Non-zero exit status: 255 Bad plan.  You planned 6 tests but ran 2.
  [locale:en_US.utf8] -Dcc=gcc
  [locale:en_US.utf8] -Dcc=gcc -Duse64bitall
  [locale:en_US.utf8] -Dcc=gcc -Duseithreads -Duse64bitall DEBUGGING
  [locale:en_US.utf8] -Dcc=gcc -Duseithreads DEBUGGING
  [locale:en_US.utf8] -Dcc=gcc -Duseithreads
  [locale:en_US.utf8] -Dcc=gcc DEBUGGING
  [locale:en_US.utf8] -Dcc=gcc -Duse64bitall DEBUGGING
  [locale:en_US.utf8] -Dcc=gcc -Duseithreads -Duse64bitall
~~ ../dist/threads-shared/t/wait.t ............................. FAILED Bad plan.  You planned 91 tests but ran 11.
  [stdio] -Dcc=gcc -Duseithreads
  [stdio] -Dcc=gcc -Duseithreads -Duse64bitall DEBUGGING
  [stdio/perlio] -Dcc=gcc -Duseithreads DEBUGGING
  [stdio] -Dcc=gcc -Duseithreads -Duse64bitall
~~ ../ext/XS-APItest/t/keyword_plugin_threads.t ................ FAILED 1
  [stdio/perlio/locale:en_US.utf8] -Dcc=gcc -Duseithreads
  [stdio/perlio/locale:en_US.utf8] -Dcc=gcc -Duseithreads -Duse64bitall DEBUGGING
  [stdio/perlio/locale:en_US.utf8] -Dcc=gcc -Duseithreads DEBUGGING
  [stdio/perlio/locale:en_US.utf8] -Dcc=gcc -Duseithreads -Duse64bitall
~~ ../dist/threads-shared/t/waithires.t ........................ FAILED Bad plan.  You planned 63 tests but ran 8.
  [stdio] -Dcc=gcc -Duseithreads -Duse64bitall DEBUGGING
  [stdio] -Dcc=gcc -Duseithreads DEBUGGING
~~ ../dist/threads-shared/t/waithires.t ........................ FAILED Bad plan.  You planned 63 tests but ran 3.
  [locale:en_US.utf8] -Dcc=gcc -Duseithreads
  [stdio/locale:en_US.utf8] -Dcc=gcc -Duseithreads -Duse64bitall
~~ ../t/re/pat_thr.t ........................................... FAILED 965
  [locale:en_US.utf8] -Dcc=gcc -Duseithreads
  [locale:en_US.utf8] -Dcc=gcc -Duseithreads -Duse64bitall DEBUGGING
  [locale:en_US.utf8] -Dcc=gcc -Duseithreads DEBUGGING
  [locale:en_US.utf8] -Dcc=gcc -Duseithreads -Duse64bitall
~~ ../ext/XS-APItest/t/subsignature.t .......................... FAILED 2 Non-zero exit status: 1
  [stdio/perlio/locale:en_US.utf8] -Dcc=gcc
  [stdio/perlio/locale:en_US.utf8] -Dcc=gcc -Duse64bitall
  [stdio/perlio/locale:en_US.utf8] -Dcc=gcc -Duseithreads -Duse64bitall DEBUGGING
  [stdio/perlio/locale:en_US.utf8] -Dcc=gcc -Duseithreads DEBUGGING
  [stdio/perlio/locale:en_US.utf8] -Dcc=gcc -Duseithreads
  [stdio/perlio/locale:en_US.utf8] -Dcc=gcc DEBUGGING
  [stdio/perlio/locale:en_US.utf8] -Dcc=gcc -Duse64bitall DEBUGGING
  [stdio/perlio/locale:en_US.utf8] -Dcc=gcc -Duseithreads -Duse64bitall
~~ ../dist/threads-shared/t/waithires.t ........................ FAILED Bad plan.  You planned 63 tests but ran 2.
  [perlio/locale:en_US.utf8] -Dcc=gcc -Duseithreads -Duse64bitall DEBUGGING
  [perlio] -Dcc=gcc -Duseithreads -Duse64bitall

Test todo-passed:
~~ ../lib/B/Deparse.t .......................................... PASSED 2
  [locale:en_US.utf8] -Dcc=gcc
  [locale:en_US.utf8] -Dcc=gcc -Duse64bitall
  [locale:en_US.utf8] -Dcc=gcc -Duseithreads -Duse64bitall DEBUGGING
  [locale:en_US.utf8] -Dcc=gcc -Duseithreads DEBUGGING
  [locale:en_US.utf8] -Dcc=gcc -Duseithreads
  [locale:en_US.utf8] -Dcc=gcc DEBUGGING
  [locale:en_US.utf8] -Dcc=gcc -Duse64bitall DEBUGGING
  [locale:en_US.utf8] -Dcc=gcc -Duseithreads -Duse64bitall
~~ ../dist/Net-Ping/t/450_service.t ............................ PASSED 9 18
  [stdio/perlio/locale:en_US.utf8] -Dcc=gcc
  [stdio/perlio/locale:en_US.utf8] -Dcc=gcc -Duse64bitall
  [stdio/perlio/locale:en_US.utf8] -Dcc=gcc -Duseithreads -Duse64bitall DEBUGGING
  [stdio/perlio/locale:en_US.utf8] -Dcc=gcc -Duseithreads DEBUGGING
  [stdio/perlio/locale:en_US.utf8] -Dcc=gcc -Duseithreads
  [stdio/perlio/locale:en_US.utf8] -Dcc=gcc DEBUGGING
  [stdio/perlio/locale:en_US.utf8] -Dcc=gcc -Duse64bitall DEBUGGING
  [stdio/perlio/locale:en_US.utf8] -Dcc=gcc -Duseithreads -Duse64bitall

MANIFEST messages:

Compiler messages:
  toke.c: In function 'yyl_try':
  toke.c:7677:13: warning: passing argument 4 of 'yyl_secondclass_keyword' from incompatible pointer type [enabled by default]
  toke.c:5281:1: note: expected 'int *' but argument is of type 'I32 *'
  regcomp.c: In function 'S_regatom':
  regcomp.c:14747:25: warning: comparison is always false due to limited range of data type [-Wtype-limits]
  pp.c: In function 'Perl_pp_argelem':
  pp.c:7051:13: warning: value computed is not used [-Wunused-value]
  RealPPPort.xs: In function 'XS_Devel__PPPort_sprintf_ivmax':
  RealPPPort.xs:999:9: warning: format '%ld' expects argument of type 'long int', but argument 2 has type 'int' [-Wformat]
  RealPPPort.xs: In function 'XS_Devel__PPPort_sprintf_uvmax':
  RealPPPort.xs:1006:9: warning: format '%lu' expects argument of type 'long unsigned int', but argument 2 has type 'unsigned int' [-Wformat]
  RealPPPort.xs: In function 'XS_Devel__PPPort_check_HeUTF8':
  RealPPPort.xs:1976:17: warning: value computed is not used [-Wunused-value]
  Encode.c: In function 'XS_Encode_decode':
  Encode.c:1356:5: warning: unused variable 'ix' [-Wunused-variable]
  Encode.c: In function 'XS_Encode_encode':
  Encode.c:1398:5: warning: unused variable 'ix' [-Wunused-variable]
  ./const-xs.inc: In function 'boot_Socket':
  ./const-xs.inc:986:20: warning: missing braces around initializer [-Wmissing-braces]
  ./const-xs.inc:986:20: warning: (near initialization for 'ip6_address._s6_un') [-Wmissing-braces]
  ./const-xs.inc:995:20: warning: missing braces around initializer [-Wmissing-braces]
  ./const-xs.inc:995:20: warning: (near initialization for 'ip6_address._s6_un') [-Wmissing-braces]
  Storable.xs: In function 'get_regexp':
  Storable.xs:3440:7: warning: format '%d' expects argument of type 'int', but argument 2 has type 'I32' [-Wformat]
  Storable.xs: In function 'retrieve_regexp':
  Storable.xs:6854:9: warning: format '%d' expects argument of type 'int', but argument 2 has type 'I32' [-Wformat]
  const-c.inc: In function 'constant_19':
  const-c.inc:351:42: warning: unused parameter 'iv_return' [-Wunused-parameter]
  APItest.xs: In function 'THX_parse_keyword_subsignature':
  APItest.xs:1085:3: warning: format '%d' expects argument of type 'int', but argument 2 has type 'line_t' [-Wformat]
  re_exec.c: In function 'S_regtry':
  re_exec.c:6497:30: warning: 'fold_array' may be used uninitialized in this function [-Wmaybe-uninitialized]
  re_exec.c:6401:17: note: 'fold_array' was declared here
  re_exec.c:6503:28: warning: 'folder' may be used uninitialized in this function [-Wmaybe-uninitialized]
  re_exec.c:6400:16: note: 'folder' was declared here
  re_comp.c: In function 'S_regatom':
  re_comp.c:14747:25: warning: comparison is always false due to limited range of data type [-Wtype-limits]
  toke.c: In function 'Perl_scan_num':
  toke.c:11517:54: warning: 'b' may be used uninitialized in this function [-Wmaybe-uninitialized]
  regexec.c: In function 'S_regtry':
  regexec.c:6497:30: warning: 'fold_array' may be used uninitialized in this function [-Wmaybe-uninitialized]
  regexec.c:6401:17: note: 'fold_array' was declared here
  regexec.c:6503:28: warning: 'folder' may be used uninitialized in this function [-Wmaybe-uninitialized]
  regexec.c:6400:16: note: 'folder' was declared here
  Storable.xs: In function 'store_hook':
  Storable.xs:4081:17: warning: format '%d' expects argument of type 'int', but argument 3 has type 'I32' [-Wformat]
  Storable.xs: In function 'store':
  Storable.xs:4456:6: warning: format '%d' expects argument of type 'int', but argument 3 has type 'I32' [-Wformat]
  toke.c:7677:13: warning: passing argument 5 of 'yyl_secondclass_keyword' from incompatible pointer type [enabled by default]
  shared.xs: In function 'sharedsv_scalar_store':
  shared.xs:830:13: warning: value computed is not used [-Wunused-value]

About this smoke:
    smoking-perl: 5.26.2
  smoker-version: 1.72_06/0.046
       timestamp: 2019-10-24 05:33:38+00
          tester: merijn

Status overview available here: https://tux.nl/perl5/smoke/
-- 
Report generated by Test::Smoke::Gateway v0.09_01