Show logfile
Automated smoke report for branch blead 5.31.2 patch 86b50d930caa444c44fdcbc7a450402db01fcf1b v5.31.1-147-g86b50d930c
DigitizedSqueak: Intel(R) Core(TM) i7-2760QM CPU @ 2.40GHz(~2392 MHz) (Intel64/4 cpus)
    on        MSWin32 Win10 Business (64-bit)
    using     gcc version 7.1.0 (*1)
    smoketime 8 hours 7 minutes (average 1 hour)

Summary: FAIL(F)

O = OK  F = Failure(s), extended report at the bottom
X = Failure(s) under TEST but not under harness
? = still running or test results not (yet) available
Build failures during:       - = unknown or N/A
c = Configure, m = make, M = make (after miniperl), t = make test-prep

v5.31.1-147-g86b50d930c
---------------------- ----------------------------------------------------
F  F                    -DCCHOME=C:\strawberry-perl-5.28.0.1-64bit-portable\c (*1)
F  F                    -DCCHOME=C:\strawberry-perl-5.28.0.1-64bit-portable\c -Duselargefiles (*1)
F  F                    -DCCHOME=C:\strawberry-perl-5.28.0.1-64bit-portable\c -Duseithreads (*1)
F  F                    -DCCHOME=C:\strawberry-perl-5.28.0.1-64bit-portable\c -Duseithreads -Duselargefiles (*1)
|  |
|  +------------------  stdio DEBUGGING
+---------------------  stdio

Applied patches:
  SMOKE86b50d930caa444c44fdcbc7a450402db01fcf1b

Skipped tests:
      # One test name on a line
      t/porting/pending-author.t

Test failures:
~~ ../t/op/blocks.t ............................................ FAILED 9-11
  [stdio] -DCCHOME=C:\strawberry-perl-5.28.0.1-64bit-portable\c -Duseithreads -Duselargefiles DEBUGGING
  [stdio] -DCCHOME=C:\strawberry-perl-5.28.0.1-64bit-portable\c DEBUGGING
  [stdio] -DCCHOME=C:\strawberry-perl-5.28.0.1-64bit-portable\c -Duselargefiles DEBUGGING
  [stdio] -DCCHOME=C:\strawberry-perl-5.28.0.1-64bit-portable\c -Duseithreads -Duselargefiles
  [stdio] -DCCHOME=C:\strawberry-perl-5.28.0.1-64bit-portable\c -Duseithreads
  [stdio] -DCCHOME=C:\strawberry-perl-5.28.0.1-64bit-portable\c -Duseithreads DEBUGGING
  [stdio] -DCCHOME=C:\strawberry-perl-5.28.0.1-64bit-portable\c
  [stdio] -DCCHOME=C:\strawberry-perl-5.28.0.1-64bit-portable\c -Duselargefiles

Test todo-passed:
~~ ../ext/IPC-Open3/t/IPC-Open3.t .............................. PASSED 25
  [stdio] -DCCHOME=C:\strawberry-perl-5.28.0.1-64bit-portable\c -Duseithreads -Duselargefiles DEBUGGING
  [stdio] -DCCHOME=C:\strawberry-perl-5.28.0.1-64bit-portable\c DEBUGGING
  [stdio] -DCCHOME=C:\strawberry-perl-5.28.0.1-64bit-portable\c -Duselargefiles DEBUGGING
  [stdio] -DCCHOME=C:\strawberry-perl-5.28.0.1-64bit-portable\c -Duseithreads -Duselargefiles
  [stdio] -DCCHOME=C:\strawberry-perl-5.28.0.1-64bit-portable\c -Duseithreads
  [stdio] -DCCHOME=C:\strawberry-perl-5.28.0.1-64bit-portable\c -Duseithreads DEBUGGING
  [stdio] -DCCHOME=C:\strawberry-perl-5.28.0.1-64bit-portable\c
  [stdio] -DCCHOME=C:\strawberry-perl-5.28.0.1-64bit-portable\c -Duselargefiles

MANIFEST messages:

Compiler messages:
  perllib.c: In function 'void xs_init(PerlInterpreter*)':
  perllib.c:37:18: warning: ISO C++ forbids converting a string constant to 'char*' [-Wwrite-strings]
  perlhost.h: In function 'CPerlHost* IPerlMem2Host(IPerlMem*)':
  perlhost.h:226:63: warning: offsetof within non-standard-layout type 'CPerlHost' is undefined [-Winvalid-offsetof]
  perlhost.h:240:12: note: in expansion of macro 'STRUCT2RAWPTR'
  perlhost.h: In function 'CPerlHost* IPerlMemShared2Host(IPerlMem*)':
  perlhost.h:245:12: note: in expansion of macro 'STRUCT2RAWPTR'
  perlhost.h: In function 'CPerlHost* IPerlMemParse2Host(IPerlMem*)':
  perlhost.h:250:12: note: in expansion of macro 'STRUCT2RAWPTR'
  perlhost.h: In function 'CPerlHost* IPerlEnv2Host(IPerlEnv*)':
  perlhost.h:233:38: note: in expansion of macro 'STRUCT2RAWPTR'
  perlhost.h:255:12: note: in expansion of macro 'STRUCT2PTR'
  perlhost.h: In function 'CPerlHost* IPerlStdIO2Host(IPerlStdIO*)':
  perlhost.h:260:12: note: in expansion of macro 'STRUCT2PTR'
  perlhost.h: In function 'CPerlHost* IPerlLIO2Host(IPerlLIO*)':
  perlhost.h:265:12: note: in expansion of macro 'STRUCT2PTR'
  perlhost.h: In function 'CPerlHost* IPerlDir2Host(IPerlDir*)':
  perlhost.h:270:12: note: in expansion of macro 'STRUCT2PTR'
  perlhost.h: In function 'CPerlHost* IPerlSock2Host(IPerlSock*)':
  perlhost.h:275:12: note: in expansion of macro 'STRUCT2PTR'
  perlhost.h: In function 'CPerlHost* IPerlProc2Host(IPerlProc*)':
  perlhost.h:280:12: note: in expansion of macro 'STRUCT2PTR'
  RealPPPort.xs: In function 'XS_Devel__PPPort_ptrtests':
  ..\..\lib\CORE/perl.h:1820:26: warning: cast from pointer to integer of different size [-Wpointer-to-int-cast]
  ..\..\lib\CORE/perl.h:1833:21: note: in expansion of macro 'INT2PTR'
  RealPPPort.xs:1686:27: note: in expansion of macro 'PTR2ul'
  POSIX.c: In function 'XS_POSIX__Termios_getattr':
  POSIX.c:2197:17: warning: cast from pointer to integer of different size [-Wpointer-to-int-cast]
  POSIX.c: In function 'XS_POSIX__Termios_setattr':
  POSIX.c:2253:17: warning: cast from pointer to integer of different size [-Wpointer-to-int-cast]
  POSIX.c: In function 'XS_POSIX__Termios_getispeed':
  POSIX.c:2320:17: warning: cast from pointer to integer of different size [-Wpointer-to-int-cast]
  POSIX.c: In function 'XS_POSIX__Termios_getiflag':
  POSIX.c:2351:17: warning: cast from pointer to integer of different size [-Wpointer-to-int-cast]
  POSIX.c: In function 'XS_POSIX__Termios_getcc':
  POSIX.c:2403:17: warning: cast from pointer to integer of different size [-Wpointer-to-int-cast]
  POSIX.c: In function 'XS_POSIX__Termios_setispeed':
  POSIX.c:2442:17: warning: cast from pointer to integer of different size [-Wpointer-to-int-cast]
  POSIX.c: In function 'XS_POSIX__Termios_setiflag':
  POSIX.c:2484:17: warning: cast from pointer to integer of different size [-Wpointer-to-int-cast]
  POSIX.c: In function 'XS_POSIX__Termios_setcc':
  POSIX.c:2532:17: warning: cast from pointer to integer of different size [-Wpointer-to-int-cast]
  POSIX.xs: In function 'XS_POSIX_ctermid':
  POSIX.xs:1462:20: warning: cast to pointer from integer of different size [-Wint-to-pointer-cast]
  POSIX.xs:3717:11: note: in expansion of macro 'ctermid'
  POSIX.c: In function 'XS_POSIX_ttyname':
  POSIX.xs:1381:22: warning: cast to pointer from integer of different size [-Wint-to-pointer-cast]
  POSIX.c:5530:11: note: in expansion of macro 'ttyname'
  Socket.xs: In function 'XS_Socket_pack_sockaddr_in6':
  Socket.xs:1082:10: warning: cast to pointer from integer of different size [-Wint-to-pointer-cast]
  Socket.xs: In function 'XS_Socket_unpack_sockaddr_in6':
  Socket.xs:1125:10: warning: cast to pointer from integer of different size [-Wint-to-pointer-cast]
  APItest.c: In function 'XS_XS__APItest__PtrTable_clear':
  APItest.c:3209:2: warning: 'Perl_ptr_table_clear' is deprecated [-Wdeprecated-declarations]
  ..\..\lib\CORE/proto.h:2777:20: note: declared here
  APItest.xs: In function 'XS_XS__APItest__Magic_test_toLOWER_utf8':
  APItest.xs:6437:13: warning: 'Perl_to_utf8_lower' is deprecated [-Wdeprecated-declarations]
  ..\..\lib\CORE/proto.h:3803:18: note: declared here
  APItest.xs: In function 'XS_XS__APItest__Magic_test_toFOLD_utf8':
  APItest.xs:6527:13: warning: 'Perl_to_utf8_fold' is deprecated [-Wdeprecated-declarations]
  ..\..\lib\CORE/proto.h:3796:18: note: declared here
  APItest.xs: In function 'XS_XS__APItest__Magic_test_toUPPER_utf8':
  APItest.xs:6617:13: warning: 'Perl_to_utf8_upper' is deprecated [-Wdeprecated-declarations]
  ..\..\lib\CORE/proto.h:3817:18: note: declared here
  APItest.xs: In function 'XS_XS__APItest__Magic_test_toTITLE_utf8':
  APItest.xs:6700:13: warning: 'Perl_to_utf8_title' is deprecated [-Wdeprecated-declarations]
  ..\..\lib\CORE/proto.h:3810:18: note: declared here
  threads.xs: In function 'S_jmpenv_run':
  threads.xs:18:23: warning: implicit declaration of function '_setjmpex'; did you mean '_setjmp3'? [-Wimplicit-function-declaration]
  threads.xs:18:23: note: in definition of macro 'setjmp'
  ..\..\lib\CORE/iperlsys.h:1074:31: note: in expansion of macro 'Sigsetjmp'
  ..\..\lib\CORE/cop.h:121:19: note: in expansion of macro 'PerlProc_setjmp'
  threads.xs:504:5: note: in expansion of macro 'JMPENV_PUSH'
  compilet.exp:fake:(.edata+0x3c): undefined reference to `boot_compilet'
  t\cplust.exp:fake:(.edata+0x38): undefined reference to `boot_cplust'
  C:/strawberry-perl-5.28.0.1-64bit-portable/c/lib/gcc/x86_64-w64-mingw32/7.1.0/include/xopintrin.h:25:3: error: #error "Never use  directly; include  instead."
  C:/strawberry-perl-5.28.0.1-64bit-portable/c/lib/gcc/x86_64-w64-mingw32/7.1.0/include/fma4intrin.h:25:3: error: #error "Never use  directly; include  instead."
  C:/strawberry-perl-5.28.0.1-64bit-portable/c/lib/gcc/x86_64-w64-mingw32/7.1.0/include/avxintrin.h:28:3: error: #error "Never use  directly; include  instead."

About this smoke:
    smoking-perl: 5.28.0
  smoker-version: 1.72_06/0.046
       timestamp: 2019-07-11 22:21:49+00
          tester: Mithaldu

-- 
Report generated by Test::Smoke::Gateway v0.09_01