Automated smoke report for branch blead 5.31.2 patch 387e2cd4d0d0ac027048044a6c2f046eb1be946f v5.31.1-144-g387e2cd4d0
hydahydroid81: aarch64 (aarch64/? cpus)
    on        linux 4.4.120 [Android 8.1/Oreo + Termux]
    using     cc version 4.2.1 Compatible Clang 8.0.0 (tags/RELEASE_800/final) (*1)
    smoketime 14 hours 35 minutes (average 3 hours 38 minutes)

Summary: FAIL(F)

O = OK  F = Failure(s), extended report at the bottom
X = Failure(s) under TEST but not under harness
? = still running or test results not (yet) available
Build failures during:       - = unknown or N/A
c = Configure, m = make, M = make (after miniperl), t = make test-prep

v5.31.1-144-g387e2cd4d0
---------------------- ----------------------------------------------------
F  F  F  F              -Alibpth="/system/lib /vendor/lib" -Duse64bitint (*1)
F  F  F  F              -Alibpth="/system/lib /vendor/lib" (*1)
|  |  |  |
|  |  |  +------------  perlio DEBUGGING
|  |  +---------------  stdio DEBUGGING
|  +------------------  perlio
+---------------------  stdio

Applied patches:
  SMOKE387e2cd4d0d0ac027048044a6c2f046eb1be946f

Skipped tests:
      # One test name on a line
      t/op/readline.t

Test failures:
~~ ../t/porting/manifest.t ..................................... FAILED 9500
  [stdio/perlio] -Alibpth="/system/lib /vendor/lib" DEBUGGING
  [stdio/perlio] -Alibpth="/system/lib /vendor/lib" -Duse64bitint
  [stdio/perlio] -Alibpth="/system/lib /vendor/lib" -Duse64bitint DEBUGGING
  [stdio/perlio] -Alibpth="/system/lib /vendor/lib"
~~ ../cpan/ExtUtils-MakeMaker/t/02-xsdynamic.t ................. FAILED 17 Non-zero exit status: 5
  [stdio/perlio] -Alibpth="/system/lib /vendor/lib" DEBUGGING
  [stdio/perlio] -Alibpth="/system/lib /vendor/lib" -Duse64bitint
  [stdio/perlio] -Alibpth="/system/lib /vendor/lib" -Duse64bitint DEBUGGING
  [stdio/perlio] -Alibpth="/system/lib /vendor/lib"
~~ ../t/porting/test_bootstrap.t ............................... FAILED Non-zero exit status: 2
  [stdio/perlio] -Alibpth="/system/lib /vendor/lib" DEBUGGING
  [stdio/perlio] -Alibpth="/system/lib /vendor/lib" -Duse64bitint
  [stdio/perlio] -Alibpth="/system/lib /vendor/lib" -Duse64bitint DEBUGGING
  [stdio/perlio] -Alibpth="/system/lib /vendor/lib"

Test todo-passed:

MANIFEST messages:

Compiler messages:
  awk: cmd. line:1: warning: regexp escape sequence `\=' is not a known regexp operator
  sv.c:12501:41: warning: adding 'int' to a string does not append to the string [-Wstring-plus-int]
  ./handy.h:508:37: note: expanded from macro 'strnEQ'
  sv.c:12501:41: note: use array indexing to silence this warning
  pp_sys.c:4114:11: warning: implicit declaration of function 'seekdir' is invalid in C99 [-Wimplicit-function-declaration]
  ./iperlsys.h:446:33: note: expanded from macro 'PerlDir_seek'
  pp_sys.c:5359:2: warning: implicit declaration of function 'setpwent' is invalid in C99 [-Wimplicit-function-declaration]
  doio.c:261:2: warning: implicit declaration of function 'mkostemp' is invalid in C99 [-Wimplicit-function-declaration]
  ./util.h:252:45: note: expanded from macro 'Perl_my_mkostemp'
  doio.c:281:2: warning: implicit declaration of function 'pipe2' is invalid in C99 [-Wimplicit-function-declaration]
  doio.c:2759:15: warning: implicit declaration of function 'futimes' is invalid in C99 [-Wimplicit-function-declaration]
  doio.c:2911:9: warning: implicit declaration of function 'msgget' is invalid in C99 [-Wimplicit-function-declaration]
  doio.c:2900:9: warning: unused variable 'nsv' [-Wunused-variable]
  doio.c:3023:8: warning: implicit declaration of function 'msgctl' is invalid in C99 [-Wimplicit-function-declaration]
  doio.c:3081:14: warning: implicit declaration of function 'msgsnd' is invalid in C99 [-Wimplicit-function-declaration]
  doio.c:3119:15: warning: implicit declaration of function 'msgrcv' is invalid in C99 [-Wimplicit-function-declaration]
  doio.c:3141:26: warning: unused parameter 'mark' [-Wunused-parameter]
  doio.c:3141:37: warning: unused parameter 'sp' [-Wunused-parameter]
  doio.c:3186:25: warning: unused parameter 'optype' [-Wunused-parameter]
  doio.c:3186:38: warning: unused parameter 'mark' [-Wunused-parameter]
  doio.c:3186:49: warning: unused parameter 'sp' [-Wunused-parameter]
  Encode.c:1356:5: warning: unused variable 'ix' [-Wunused-variable]
  ../../XSUB.h:185:20: note: expanded from macro 'dXSI32'
  Encode.c:1398:5: warning: unused variable 'ix' [-Wunused-variable]
  ./const-c.inc:24:42: warning: unused parameter 'iv_return' [-Wunused-parameter]
  SysV.c:371:7: warning: unused variable 'obj' [-Wunused-variable]
  SysV.c:409:7: warning: unused variable 'obj' [-Wunused-variable]
  SysV.c:411:7: warning: unused variable 'ds' [-Wunused-variable]
  SysV.c:450:7: warning: unused variable 'obj' [-Wunused-variable]
  SysV.c:492:7: warning: unused variable 'obj' [-Wunused-variable]
  SysV.c:494:7: warning: unused variable 'ds' [-Wunused-variable]
  SysV.c:535:15: warning: unused variable 'path' [-Wunused-variable]
  SysV.xs:310:9: warning: unused variable 'proj_id' [-Wunused-variable]
  SysV.xs:311:11: warning: unused variable 'k' [-Wunused-variable]
  SysV.c:665:6: warning: unused variable 'id' [-Wunused-variable]
  SysV.c:667:7: warning: unused variable 'addr' [-Wunused-variable]
  SysV.c:669:6: warning: unused variable 'flag' [-Wunused-variable]
  SysV.c:699:7: warning: unused variable 'addr' [-Wunused-variable]
  SysV.xs:86:20: warning: unused variable 's_pkg_sem' [-Wunused-variable]
  SysV.xs:87:20: warning: unused variable 's_pkg_shm' [-Wunused-variable]

About this smoke:
    smoking-perl: 5.28.2
  smoker-version: 1.72/0.046
       timestamp: 2019-07-10 22:36:26+00
          tester: u0_a56

This smoker is on Android 8.1 (Oreo) using the Termux environment.
(It's a cheap TV box, so doesn't have much grunt.)
Contact: rich+perl@hyphen-dash-hyphen.info

Current test failures with known causes:
* ../cpan/ExtUtils-MakeMaker/t/02-xsdynamic.t - https://github.com/Perl-Toolchain-Gang/ExtUtils-MakeMaker/issues/337 (patch submitted)
* ../dist/Net-Ping/t/*         - https://rt.perl.org/Public/Bug/Display.html?id=134043  (patch submitted)
* io/pipe.t                    - https://rt.perl.org/Ticket/Display.html?id=122112 (Termux bug?)

Skipped tests:
* ../t/op/readline.t - works normally but hangs under stdio layer. Specifically, as per the following,  
PERLIO=stdio ./perl -e 'local $SIG{ALRM} = sub { die "Alarm!" }; alarm 1; readline(STDIN)'

Skipped builds:
uselongdouble & usemorebits - t/POSIX/math.t fails tan(1) == -tan(-1) test. Possible LLVM bug. Definite android bug in failure to printf long doubles correctly.
-- 
Report generated by Test::Smoke::Gateway v0.09_01